LABEL REPORT: jdk11u-fix-yes

This report shows bugs with the given label, along with their backporting status.

Report generated: Thu Feb 29 13:57:26 CET 2024

Minimal actionable level to display: WAITING

client-libs

Fix Versions Bug Synopsis
8 9 10 11 12 13 14 15 16 17 18 19 20 21 22 23
JDK-8252825 Add automated test for fix done in JDK-8218479
JDK-8274029 Remove jtreg tag manual=yesno for java/awt/print/Dialog/DialogOrient.java
JDK-8233986 ProblemList javax/swing/plaf/basic/BasicTextUI/8001470/bug8001470.java for windows-x64
JDK-8270312 Error: Not a test or directory containing tests: java/awt/print/PrinterJob/XparColor.java
JDK-8273685 Remove jtreg tag manual=yesno for java/awt/Graphics/LCDTextAndGraphicsState.java & show test instruction
JDK-8275234 java/awt/GraphicsDevice/DisplayModes/CycleDMImage.java is entered twice in ProblemList
JDK-8278456 Define jtreg jdk_desktop test group time-based sub-tasks for use by headful testing.
JDK-8284535 Fix PrintLatinCJKTest.java test that is failing with Parse Exception
JDK-8285867 Convert applet manual tests SelectionVisible.java to Frame and automate
JDK-8300405 Screen capture for test JFileChooserSetLocationTest.java, failure case
JDK-8306135 Clean up and open source some AWT tests
JDK-8306280 Open source several choice AWT tests
JDK-8306575 Clean up and open source four Dialog related tests
JDK-8294158 HTML formatting for PassFailJFrame instructions
JDK-8282046 Create a regression test for JDK-8000326
JDK-8282640 Create a test for JDK-4740761
JDK-8208996 X11 icon window color handing bug
JDK-8298887 On the latest macOS+XCode the Robot API may report wrong colors
JDK-8233696 [TESTBUG]Some jtreg tests fail when CAPS_LOCK is ON

client-libs/2d

Fix Versions Bug Synopsis
8 9 10 11 12 13 14 15 16 17 18 19 20 21 22 23
JDK-8265761 Font with missed font family name is not properly printed on Windows
JDK-8225007 java/awt/print/PrinterJob/LandscapeStackOverflow.java may hang
JDK-8220074 Clean up GCC 8.3 errors in LittleCMS
JDK-8274456 Remove jtreg tag manual=yesno java/awt/print/PrinterJob/PageDialogTest.java
JDK-8298974 Add ftcolor.c to imported freetype sources
JDK-8316710 Exclude java/awt/font/Rotate/RotatedTextTest.java
JDK-8273358 macOS Monterey does not have the font Times needed by Serif
JDK-8232634 Problem List ICMColorDataTest.java
JDK-8244088 [Regression] Switch of Gnome theme ends up in deadlocked UI
JDK-8262392 Update Mesa 3-D Headers to version 21.0.3
JDK-8297088 Update LCMS to 2.14
JDK-8303482 Update LCMS to 2.15
JDK-8318951 Additional negative value check in JPEG decoding
JDK-8280964 [Linux aarch64] : drawImage dithers TYPE_BYTE_INDEXED images incorrectly
JDK-8275303 sun/java2d/pipe/InterpolationQualityTest.java fails with D3D basic render driver
JDK-8223558 Java does not render Myanmar script correctly
JDK-8231556 Wrong font ligatures used when 2 versions of same font used
JDK-8242557 Add length limit for strings in PNGImageWriter
JDK-7179006 [macosx] Print-to-file doesn't work: printing to the default printer instead
JDK-8264666 Change implementation of safeAdd/safeMult in the LCMSImageLayout class
JDK-8022403 sun/java2d/DirectX/OnScreenRenderingResizeTest/OnScreenRenderingResizeTest.java fails
JDK-8297153 sun/java2d/DirectX/OnScreenRenderingResizeTest/OnScreenRenderingResizeTest.java fails again
JDK-8223869 Problem list java/awt/FontMetrics/MaxAdvanceIsMax.java on more platforms
JDK-8175984 ICC_Profile has un-needed, not-empty finalize method
JDK-8171303 sun/java2d/pipe/InterpolationQualityTest.java fails on Windows & Linux
JDK-8181571 printing to CUPS fails on mac sandbox app
JDK-8311033 [macos] PrinterJob does not take into account Sides attribute
JDK-8231243 [TESTBUG] CustomFont.java cannot find font file

client-libs/java.awt

Fix Versions Bug Synopsis
8 9 10 11 12 13 14 15 16 17 18 19 20 21 22 23
JDK-8216155 C4819 warning at libfreetype sources on Windows
JDK-8224821 java/awt/Focus/NoAutotransferToDisabledCompTest/NoAutotransferToDisabledCompTest.java fails linux-x64
JDK-8224830 test/jdk/java/awt/Focus/ModalExcludedWindowClickTest/ModalExcludedWindowClickTest.java fails on linux-x64
JDK-8257148 Remove obsolete code in AWTView.m
JDK-8282276 Problem list failing two Robot Screen Capture tests
JDK-8289238 Refactoring changes to PassFailJFrame Test Framework
JDK-8290469 Add new positioning options to PassFailJFrame test framework
JDK-8296934 Write a test to verify whether Undecorated Frame can be iconified or not
JDK-8289077 Add manual tests to open
JDK-8306072 Open source several AWT MouseInfo related tests
JDK-8306652 Open source AWT MenuItem related tests
JDK-8306683 Open source several clipboard and color AWT tests
JDK-8306718 Optimize and opensource some old AWT tests
JDK-8306752 Open source several container and component AWT tests
JDK-8306753 Open source several container AWT tests
JDK-8306409 Open source AWT KeyBoardFocusManger, LightWeightComponent related tests
JDK-8306640 Open source several AWT TextArea related tests
JDK-8307078 Opensource and clean up five more AWT Focus related tests
JDK-8306954 Open source five Focus related tests
JDK-8307128 Open source some drag and drop tests 4
JDK-8269984 [macos] JTabbedPane title looks like disabled
JDK-8311689 Wrong visible amount in Adjustable of ScrollPane
JDK-8214578 [macos] Problem with backslashes on macOS/JIS keyboard: Java ignores system settings
JDK-8204161 [TESTBUG] auto failed with the "Applet thread threw exception: java.lang.UnsupportedOperationException" exception
JDK-7185258 [macOS] Deadlock in SunToolKit.realSync()
JDK-8258805 Japanese characters not entered by mouse click on Windows 10
JDK-8284033 Leak XVisualInfo in getAllConfigs in awt_GraphicsEnv.c
JDK-8284023 java.sun.awt.X11GraphicsDevice.getDoubleBufferVisuals() leaks XdbeScreenVisualInfo
JDK-8144030 [macosx] test java/awt/Frame/ShapeNotSetSometimes/ShapeNotSetSometimes.java fails (again)
JDK-8274597 Some of the dnd tests time out and fail intermittently
JDK-8286481 Exception printed to stdout on Windows when storing transparent image in clipboard
JDK-6176679 Application freezes when copying an animated gif image to the system clipboard
JDK-8297923 java.awt.ScrollPane broken after multiple scroll up/down
JDK-8316030 Update Libpng to 1.6.40
JDK-8253682 The AppletInitialFocusTest1.java is unstable
JDK-8254850 Update terminology in java.awt.GridBagLayout source code comments
JDK-8039261 [TEST_BUG]: There is not a minimal security level in Java Preferences and the TestApplet.html is blocked.
JDK-8163086 java/awt/Window/TranslucentJAppletTest/TranslucentJAppletTest.java fails
JDK-8047218 [TEST_BUG] java/awt/FullScreen/AltTabCrashTest/AltTabCrashTest.java fails with exception
JDK-8266949 Check possibility to disable OperationTimedOut on Unix
JDK-8268620 InfiniteLoopException test may fail on x86 platforms
JDK-8233648 [TESTBUG] DefaultMenuBarTest.java failing on macos
JDK-6854300 [TEST_BUG] java/awt/event/MouseEvent/SpuriousExitEnter/SpuriousExitEnter_3.java fails in jdk6u14 & jdk7
JDK-8169468 NoResizeEventOnDMChangeTest.java fails because FS Window didn't receive all resizes!
JDK-8281569 Create tests for Frame.setMinimumSize() method
JDK-8286772 java/awt/dnd/DropTargetInInternalFrameTest/DropTargetInInternalFrameTest.html times out and fails in Windows
JDK-8265586 [windows] last button is not shown in AWT Frame with BorderLayout and MenuBar set.
JDK-8295774 Write a test to verify List sends ItemEvent/ActionEvent
JDK-8297489 Modify TextAreaTextEventTest.java as to verify the content change of TextComponent sends TextEvent
JDK-8297296 java/awt/Mouse/EnterExitEvents/DragWindowTest.java fails with "No MouseReleased event on label!"
JDK-8296275 Write a test to verify setAccelerator method of JMenuItem
JDK-8299296 Write a test to verify the components selection sends ItemEvent
JDK-8298921 Create a regression test for JDK-8139581
JDK-8318154 Improve stability of WheelModifier.java test
JDK-8169475 WheelModifier.java fails by timeout
JDK-8213292 Input freezes after MacOS key-selector (press&hold) usage on macOS Mojave
JDK-8176359 Frame#setMaximizedbounds not working properly in multi screen environments
JDK-8231564 setMaximizedBounds is broken with large display scale and multiple monitors
JDK-8221823 Requested JDialog width is ignored
JDK-8253791 Issue with useAppleColor check in CSystemColors.m
JDK-8030121 java/awt/dnd/MissingDragExitEventTest/MissingDragExitEventTest.java fails
JDK-8176556 java/awt/dnd/ImageTransferTest/ImageTransferTest.java fails for JFIF
JDK-8144125 [macos] java/awt/event/ComponentEvent/MovedResizedTwiceTest/MovedResizedTwiceTest.java failed automatically
JDK-8229515 [macos] access to window property of NSView on wrong thread
JDK-8233573 Toolkit.getScreenInsets(GraphicsConfiguration) may throw ClassCastException
JDK-8263530 sun.awt.X11.ListHelper.removeAll() should use clear()
JDK-8265678 Test java/awt/Focus/ActualFocusedWindowTest/ActualFocusedWindowBlockingTest.java fails intermittentently on windows
JDK-8159904 [TEST_BUG] Failure on solaris of java/awt/Window/MultiWindowApp/MultiWindowAppTest.java
JDK-8286663 Resolve IDE warnings in WTrayIconPeer and SystemTray
JDK-8297481 Create a regression test for JDK-4424517
JDK-8302525 Write a test to check various components send Events while mouse and key are used simultaneously
JDK-8168408 Test java/awt/Focus/ActualFocusedWindowTest/ActualFocusedWindowBlockingTest.java fails intermittentently on windows

client-libs/java.awt:i18n

Fix Versions Bug Synopsis
8 9 10 11 12 13 14 15 16 17 18 19 20 21 22 23
JDK-8278472 Invalid value set to CANDIDATEFORM structure
JDK-8225182 JNI exception pending in DestroyXIMCallback of awt_InputMethod.c:1327

client-libs/java.beans

Fix Versions Bug Synopsis
8 9 10 11 12 13 14 15 16 17 18 19 20 21 22 23
JDK-8231454 File lock in Windows on a loaded jar due to a leak in Introspector::getBeanInfo

client-libs/javax.accessibility

Fix Versions Bug Synopsis
8 9 10 11 12 13 14 15 16 17 18 19 20 21 22 23
JDK-8133713 [macosx] Accessible JTables always reported as empty
JDK-7124293 [macosx] VoiceOver reads percentages rather than the actual values for sliders.
JDK-7124301 [macosx] When in a tab group if you arrow between tabs there are no VoiceOver announcements.
JDK-8277922 Unable to click JCheckBox in JTable through Java Access Bridge
JDK-8283087 Create a test or JDK-4715503
JDK-8283015 Create a test for JDK-4715496
JDK-8283245 Create a test for JDK-4670319
JDK-8282933 Create a test for JDK-4529616
JDK-8284077 Create an automated test for JDK-4170173
JDK-8285693 Create an automated test for JDK-4702199
JDK-8282778 Create a regression test for JDK-4699544
JDK-8282857 Create a regression test for JDK-4702690
JDK-8285305 Create an automated test for JDK-4495286
JDK-8285373 Create an automated test for JDK-4702233
JDK-8282777 Create a Regression test for JDK-4515031
JDK-8284524 Create an automated test for JDK-4422362
JDK-8284767 Create an automated test for JDK-4422535
JDK-8268775 Password is being converted to String in AccessibleJPasswordField

client-libs/javax.imageio

Fix Versions Bug Synopsis
8 9 10 11 12 13 14 15 16 17 18 19 20 21 22 23
JDK-8302151 BMPImageReader throws an exception reading BMP images
JDK-6532025 GIF reader throws misleading exception with truncated images
JDK-8274735 javax.imageio.IIOException: Unsupported Image Type while processing a valid JPEG image
JDK-8195841 PNGImageReader.readNullTerminatedString() doesnt check for non-null terminated strings with length equal to maxLen

client-libs/javax.sound

Fix Versions Bug Synopsis
8 9 10 11 12 13 14 15 16 17 18 19 20 21 22 23
JDK-7188098 TEST_BUG: closed/javax/sound/midi/Synthesizer/Receiver/bug6186488.java fails
JDK-8266421 Deadlock in Sound System
JDK-8301846 Invalid TargetDataLine after screen lock when using JFileChooser or COM library
JDK-8221445 FastSysexMessage constructor crashes MIDI receiption thread
JDK-8178698 javax/sound/midi/Sequencer/MetaCallback.java failed with timeout

client-libs/javax.swing

Fix Versions Bug Synopsis
8 9 10 11 12 13 14 15 16 17 18 19 20 21 22 23
JDK-8209418 Synchronize test/jdk/sanity/client/lib/jemmy with code-tools/jemmy/v2
JDK-8209494 Create a test for SwingSet3 InternalFrameDemo
JDK-8209789 Synchronize test/jdk/sanity/client/lib/jemmy with code-tools/jemmy/v2
JDK-8209993 Create a test for SwingSet3 ToolTipDemo
JDK-8210052 Enable testing for all the available look and feels in SwingSet3 demo tests
JDK-8210994 Create test for SwingSet3 FrameDemo
JDK-8210910 Create test for FileChooserDemo
JDK-8210055 Enable different look and feel tests in SwingSet3 demo tests
JDK-8209499 Create test for SwingSet3 EditorPaneDemo
JDK-8210057 Enable different look and feels in SwingSet3 demo test InternalFrameDemoTest
JDK-8214471 Enable different look and feel tests in SwingSet3 demo test ToolTipDemoTest
JDK-8251166 Add automated testcases for changes done in JDK-8214112
JDK-8251252 Add automated testcase for fix done in JDK-8214253
JDK-8251254 Add automated test for fix done in JDK-8218472
JDK-8254976 Re-enable swing jtreg tests which were broken due to samevm mode
JDK-8253820 Save test images and dumps with timestamps from client sanity suite
JDK-8209343 Test javax/swing/border/TestTitledBorderLeak.java should be marked as headful
JDK-8216353 Use utility APIs introduced in org/netbeans/jemmy/util/LookAndFeel class in client sanity test cases
JDK-8258554 javax/swing/JTable/4235420/bug4235420.java fails in GTK L&F
JDK-8260035 Deproblemlist few problemlisted test
JDK-8281745 Create a regression test for JDK-4514331
JDK-8282343 Create a regression test for JDK-4518432
JDK-8282548 Create a regression test for JDK-4330998
JDK-8286620 Create regression test for verifying setMargin() of JRadioButton
JDK-8225012 sanity/client/SwingSet/src/ToolTipDemoTest.java fails on Windows
JDK-8285635 javax/swing/JRootPane/DefaultButtonTest.java failed with Default Button not pressed for L&F: com.sun.java.swing.plaf.motif.MotifLookAndFeel
JDK-8306755 Open source few Swing JComponent and AbstractButton tests
JDK-8307381 Open Source JFrame, JIF related Swing Tests
JDK-8306996 Open source Swing MenuItem related tests
JDK-8307311 Timeouts on one macOS 12.6.1 host of two Swing JTableHeader tests
JDK-8315602 Open source swing security manager test
JDK-8315611 Open source swing text/html and tree test
JDK-8212903 [TestBug] Tests test/jdk/javax/swing/LookAndFeel/8145547/DemandGTK2.sh and DemandGTK3.sh fail on Ubuntu 18.04 LTS
JDK-8153090 TAB key cannot change input focus after the radio button in the Color Selection dialog
JDK-8239312 [macOS] javax/swing/JFrame/NSTexturedJFrame/NSTexturedJFrame.java
JDK-8015602 [macosx] Test javax/swing/SpringLayout/4726194/bug4726194.java fails on MacOSX
JDK-8258373 Update the text handling in the JPasswordField
JDK-8256126 Create implementation for NSAccessibilityImage protocol peer
JDK-8256110 Create implementation for NSAccessibilityStepper protocol
JDK-8256111 Create implementation for NSAccessibilityStaticText protocol
JDK-8263970 Manual test javax/swing/JTextField/JapaneseReadingAttributes/JapaneseReadingAttributes.java failed
JDK-8264299 Create implementation of native accessibility peer for ScrollPane and ScrollBar Java Accessibility roles
JDK-8239502 [TEST_BUG] Test javax/swing/text/FlowView/6318524/bug6318524.java never fails
JDK-8221903 PIT: javax/swing/RepaintManager/IconifyTest/IconifyTest.java fails on ubuntu18.04
JDK-8238985 [TESTBUG] The arrow image is blue instead of green
JDK-8169953 JComboBox/8057893: ComboBoxEdited event is not fired! on Windows
JDK-8169959 javax/swing/JTable/6263446/bug6263446.java: Table should be editing
JDK-8194126 Regression automated Test '/open/test/jdk/javax/swing/JColorChooser/Test7194184.java' fails
JDK-8169954 JFileChooser/8021253: java.lang.RuntimeException: Default button is not pressed
JDK-8196100 javax/swing/text/JTextComponent/5074573/bug5074573.java fails
JDK-8256187 [TEST_BUG] Automate bug4275046.java test
JDK-8258884 [TEST_BUG] Convert applet-based test open/test/jdk/javax/swing/JMenuItem/8031573/bug8031573.java to a regular java test
JDK-8264328 Broken license in javax/swing/JComboBox/8072767/bug8072767.java
JDK-4819544 SwingSet2 JTable Demo throws NullPointerException
JDK-8270116 Expand ButtonGroupLayoutTraversalTest.java to run in all LaFs, including Aqua on macOS
JDK-8273578 javax/swing/JMenu/4515762/bug4515762.java fails on macOS 12
JDK-8280913 Create a regression test for JRootPane.setDefaultButton() method
JDK-8280948 Write a regression test for JDK-4659800
JDK-8281296 Create a regression test for JDK-4515999
JDK-8281535 Create a regression test for JDK-4670051
JDK-8281988 Create a regression test for JDK-4618767
JDK-8281738 Create a regression test for checking the 'Space' key activation of focused Button
JDK-8282402 Create a regression test for JDK-4666101
JDK-8282234 Create a regression test for JDK-4532513
JDK-8282789 Create a regression test for the JTree usecase of JDK-4618767
JDK-8282937 Write a regression test for JDK-4820080
JDK-8282860 Write a regression test for JDK-4164779
JDK-8283493 Create an automated regression test for RFE 4231298
JDK-8282936 Write a regression test for JDK-4615365
JDK-8283621 Write a regression test for CCC4400728
JDK-8283623 Create an automated regression test for JDK-4525475
JDK-8284294 Create an automated regression test for RFE 4138746
JDK-8283507 Create a regression test for RFE 4287690
JDK-8284521 Write an automated regression test for RFE 4371575
JDK-8251177 [macosx] The text "big" is truncated in JTabbedPane
JDK-8283624 Create an automated regression test for RFE-4390885
JDK-8285698 Create a test to check the focus stealing of JPopupMenu from JComboBox
JDK-8065097 [macosx] javax/swing/Popup/TaskbarPositionTest.java fails because Popup is one pixel off
JDK-8286172 Create an automated test for JDK-4516019
JDK-8289547 Update javax/swing/Popup/TaskbarPositionTest.java
JDK-8215396 JTabbedPane preferred size calculation is wrong for SCROLL_TAB_LAYOUT
JDK-8223788 [macos] JSpinner buttons in JColorChooser dialog may capture focus using TAB Key.
JDK-8040630 Popup menus and tooltips flicker with previous popup contents when first shown
JDK-8296878 Document Filter attached to JPasswordField and setText("") is not cleared instead inserted characters replaced with unicode null characters
JDK-8203904 javax/swing/JSplitPane/4816114/bug4816114.java: The divider location is wrong
JDK-8042383 [TEST_BUG] Test javax/swing/plaf/basic/BasicMenuUI/4983388/bug4983388.java fails with shortcuts on menus do not work
JDK-8152332 [macosx] JFileChooser cannot be serialized on Mac OS X
JDK-8172269 When checking the default behaviour for a scroll tab layout and checking the 'opaque' checkbox, the area behind tabs is not red.
JDK-8171998 javax/swing/JMenu/4692443/bug4692443.java fails on Windows
JDK-8172065 javax/swing/JTree/4908142/bug4908142.java The selected index should be "aad"
JDK-8139173 [macosx] JInternalFrame shadow is not properly drawn
JDK-7132796 [macosx] closed/javax/swing/JComboBox/4517214/bug4517214.java fails on MacOS
JDK-8290399 [macos] Aqua LAF does not fire an action event if combo box menu is displayed
JDK-8054572 [macosx] JComboBox paints the border incorrectly
JDK-7148092 [macosx] When Alt+down arrow key is pressed, the combobox popup does not appear.
JDK-8041447 Test javax/swing/dnd/7171812/bug7171812.java fails with java.lang.RuntimeException: Test failed, scroll on drag doesn't work
JDK-8311585 Add JRadioButtonMenuItem to bug8031573.java

core-libs

Fix Versions Bug Synopsis
8 9 10 11 12 13 14 15 16 17 18 19 20 21 22 23
JDK-8275735 [linux] Remove deprecated Metrics api (kernel memory limit)
JDK-8284756 [11u] Remove unused isUseContainerSupport in CgroupV1Subsystem
JDK-8213328 Update test copyrights in test/java/util/zip and test/jdk/tools
JDK-8221340 [TESTBUG] TestCgroupMetrics.java fails after fix for JDK-8219562
JDK-8223553 Fix code constructs that do not compile with the Eclipse Java Compiler
JDK-8234147 Avoid looking up standard charsets in core libraries
JDK-8243539 Copyright info (Year) should be updated for fix of 8241638
JDK-8253497 Core Libs Terminology Refresh
JDK-8259265 Refactor UncaughtExceptions shell test as java test.
JDK-8259267 Refactor LoaderLeak shell test as java test.
JDK-8266579 Update test/jdk/java/lang/ProcessHandle/PermissionTest.java & test/jdk/java/sql/testng/util/TestPolicy.java
JDK-8267180 Typo in copyright header for HashesTest
JDK-8286705 GCC 12 reports use-after-free potential bugs

core-libs/java.io

Fix Versions Bug Synopsis
8 9 10 11 12 13 14 15 16 17 18 19 20 21 22 23
JDK-8315034 File.mkdirs() occasionally fails to create folders on Windows shared folder
JDK-8275536 Add test to check that File::lastModified returns same time stamp as Files.getLastModifiedTime
JDK-8320798 Console read line with zero out should zero out underlying buffer
JDK-8274122 java/io/File/createTempFile/SpecialTempFile.java fails in Windows 11

core-libs/java.io:serialization

Fix Versions Bug Synopsis
8 9 10 11 12 13 14 15 16 17 18 19 20 21 22 23
JDK-8267751 (test) jtreg.SkippedException has no serial VersionUID
JDK-8277093 Vector should throw ClassNotFoundException for a missing class of an element
JDK-8277072 ObjectStreamClass caches keep ClassLoaders alive

core-libs/java.lang

Fix Versions Bug Synopsis
8 9 10 11 12 13 14 15 16 17 18 19 20 21 22 23
JDK-8208363 test/jdk/java/lang/Package/PackageFromManifest.java missing module dependencies declaration
JDK-8225648 [TESTBUG] java/lang/annotation/loaderLeak/Main.java fails with -Xcomp
JDK-8232135 Add diagnostic output to test java/util/ProcessBuilder/Basic.java
JDK-8183372 Refactor java/lang/Class shell tests to java
JDK-8261036 Reduce classes loaded by CleanerFactory initialization
JDK-8183374 Refactor java/lang/Runtime shell tests to java
JDK-8276880 Remove java/lang/RuntimeTests/exec/ExecWithDir as unnecessary
JDK-8218915 Change isJavaIdentifierStart and isJavaIdentifierPart to handle new code points
JDK-8273541 Cleaner Thread creates with normal priority instead of MAX_PRIORITY - 2
JDK-8213017 jspawnhelper: need to handle pipe write failure when sending return code
JDK-8080569 java/lang/ProcessBuilder/DestroyTest.java fails with "RuntimeException: Process terminated prematurely"

core-libs/java.lang.invoke

Fix Versions Bug Synopsis
8 9 10 11 12 13 14 15 16 17 18 19 20 21 22 23
JDK-8232806 Introduce a system property to disable eager lambda initialization
JDK-8272836 Limit run time for java/lang/invoke/LFCaching tests

core-libs/java.lang.module

Fix Versions Bug Synopsis
8 9 10 11 12 13 14 15 16 17 18 19 20 21 22 23
JDK-8209003 Consolidate use of empty collections in java.lang.module
JDK-8240734 ModuleHashes attribute not reproducible between builds

core-libs/java.lang:class_loading

Fix Versions Bug Synopsis
8 9 10 11 12 13 14 15 16 17 18 19 20 21 22 23
JDK-8302791 Add specific ClassLoader object to Proxy IllegalArgumentException message

core-libs/java.lang:reflect

Fix Versions Bug Synopsis
8 9 10 11 12 13 14 15 16 17 18 19 20 21 22 23
JDK-8208364 java/lang/reflect/callerCache/ReflectionCallerCacheTest.java missing module dependencies declaration
JDK-8261404 Class.getReflectionFactory() is not thread-safe

core-libs/java.math

Fix Versions Bug Synopsis
8 9 10 11 12 13 14 15 16 17 18 19 20 21 22 23
JDK-8213305 Fix legal headers in test/java/math
JDK-8225117 java/math/BigInteger/SymmetricRangeTests.java fails with ParseException
JDK-8272541 Incorrect overflow test in Toom-Cook branch of BigInteger multiplication

core-libs/java.net

Fix Versions Bug Synopsis
8 9 10 11 12 13 14 15 16 17 18 19 20 21 22 23
JDK-8246114 java/net/MulticastSocket/Promiscuous.java fails after 8241072 (multi-homed systems)
JDK-8203672 JNI exception pending in PlainSocketImpl.c
JDK-8217237 HttpClient does not deal well with multi-valued WWW-Authenticate challenge headers
JDK-8223145 Replace wildcard address with loopback or local host in tests - part 1
JDK-8223463 Replace wildcard address with loopback or local host in tests - part 2
JDK-8223573 Replace wildcard address with loopback or local host in tests - part 4
JDK-8223856 Replace wildcard address with loopback or local host in tests - part 8
JDK-8224204 Replace wildcard address with loopback or local host in tests - part 10
JDK-8230435 Replace wildcard address with loopback or local host in tests - part 22
JDK-8230858 Replace wildcard address with loopback or local host in tests - part 23
JDK-8234823 java/net/Socket/Timeouts.java testcase testTimedConnect2() fails on Windows 10
JDK-8238677 java/net/httpclient/ssltest/CertificateTest.java should not specify TLS version
JDK-8238740 java/net/httpclient/whitebox/FlowTestDriver.java should not specify a TLS protocol
JDK-8266250 WebSocketTest and WebSocketProxyTest call assertEquals(List, List)
JDK-8279842 HTTPS Channel Binding support for Java GSS/Kerberos
JDK-8298588 WebSockets: HandshakeUrlEncodingTest unnecessarily depends on a response body
JDK-8216561 HttpClient: The logic of retry on connect exception is inverted
JDK-8217882 java/net/httpclient/MaxStreams.java failed once
JDK-8217903 java/net/httpclient/Response204.java fails with 404
JDK-8221259 New tests for java.net.Socket to exercise long standing behavior
JDK-8223638 Replace wildcard address with loopback or local host in tests - part 6
JDK-8224035 Replace wildcard address with loopback or local host in tests - part 9
JDK-8226683 Remove review suggestion from fix to 8219804
JDK-8225430 Replace wildcard address with loopback or local host in tests - part 14
JDK-8228508 [TESTBUG] java/net/httpclient/SmokeTest.java fails on Windows7
JDK-8229348 java/net/DatagramSocket/UnreferencedDatagramSockets.java fails intermittently
JDK-8229481 sun/net/www/protocol/https/ChunkedOutputStream.java failed with a SSLException
JDK-8229421 The logic of java/net/ipv6tests/TcpTest.java is flawed
JDK-8223714 HTTPSetAuthenticatorTest could be made more resilient
JDK-8244205 HTTP/2 tunnel connections through proxy may be reused regardless of which proxy is selected
JDK-8249812 java/net/DatagramSocket/PortUnreachable.java still fails intermittently with SocketTimeoutException
JDK-8254967 com.sun.net.HttpsServer spins on TLS session close
JDK-8264824 java/net/Inet6Address/B6206527.java doesn't close ServerSocket properly
JDK-8268464 Remove dependancy of TestHttpsServer, HttpTransaction, HttpCallback from open/test/jdk/sun/net/www/protocol/https/ tests
JDK-8263364 sun/net/www/http/KeepAliveStream/KeepAliveStreamCloseWithWrongContentLength.java wedged in getInputStream
JDK-8273655 content-types.properties files are missing some common types
JDK-8295777 java/net/httpclient/ConnectExceptionTest.java should not rely on system resolver
JDK-8305763 Parsing a URI with an underscore goes through a silent exception, negatively impacting performance
JDK-8297569 URLPermission constructor throws IllegalArgumentException: Invalid characters in hostname after JDK-8294378
JDK-8294378 URLPermission constructor exception when using tr locale
JDK-8211092 test/jdk/sun/net/www/http/HttpClient/MultiThreadTest.java fails intermittently when cleaning up
JDK-8211325 test/jdk/java/net/Socket/LingerTest.java fails with cleaning up
JDK-8246741 NetworkInterface/UniqueMacAddressesTest: mac address uniqueness test failed
JDK-8266761 AssertionError in sun.net.httpserver.ServerImpl.responseCompleted
JDK-8278067 Make HttpURLConnection default keep alive timeout configurable
JDK-8054022 HttpURLConnection timeouts with Expect: 100-Continue and no chunking
JDK-8308336 Test java/net/HttpURLConnection/HttpURLConnectionExpectContinueTest.java failed: java.net.BindException: Address already in use
JDK-8211420 com.sun.net.httpserver.HttpServer returns Content-length header for 204 response code
JDK-8233958 Memory retention due to HttpsURLConnection finalizer that serves no purpose
JDK-8233989 Create an IPv4 version of java/net/MulticastSocket/SetLoopbackMode.java
JDK-8243488 Add tests for set/get SendBufferSize and getReceiveBufferSize in DatagramSocket
JDK-8312065 Socket.connect does not timeout when profiling

core-libs/java.nio

Fix Versions Bug Synopsis
8 9 10 11 12 13 14 15 16 17 18 19 20 21 22 23
JDK-8213306 Fix legal headers in test/java/nio
JDK-8213406 (fs) More than one instance of built-in FileSystem observed in heap
JDK-8264821 DirectIOTest fails on a system with large block size
JDK-8214078 (fs) SecureDirectoryStream not supported on arm32
JDK-8215372 test/jdk/java/nio/file/DirectoryStream/Basic.java not correct when using a glob
JDK-8224617 (fs) java/nio/file/FileStore/Basic.java found filesystem twice
JDK-8226706 (se) Reduce the number of outer loop iterations on Windows in java/nio/channels/Selector/RacyDeregister.java
JDK-8239355 (dc) Initial value of SO_SNDBUF should allow sending large datagrams (macOS)
JDK-8283756 (zipfs) ZipFSOutputStreamTest.testOutputStream should only check inflated bytes
JDK-8290197 test/jdk/java/nio/file/Files/probeContentType/Basic.java fails on some systems for the ".rar" extension
JDK-8305528 [11u] Backport of JDK-8259530 breaks build with JDK10 bootstrap VM
JDK-8208281 java/nio/channels/AsynchronousSocketChannel/Basic.java timed out
JDK-8264400 (fs) WindowsFileStore equality depends on how the FileStore was constructed
JDK-8234824 java/nio/channels/SocketChannel/AdaptSocket.java fails on Windows 10
JDK-8249773 Upgrade ReceiveISA.java test to be resilient to failure due to stray packets and interference
JDK-8174819 java/nio/file/WatchService/LotsOfEvents.java fails intermittently
JDK-8230870 (zipfs) Add a ZIP FS test that is similar to test/jdk/java/util/zip/EntryCount64k.java
JDK-8053479 (dc) DatagramChannel.read() throws exception instead of discarding data when buffer too small
JDK-8264200 java/nio/channels/DatagramChannel/SRTest.java fails intermittently
JDK-8277159 Fix java/nio/file/FileStore/Basic.java test by ignoring /run/user/* mount points

core-libs/java.nio.charsets

Fix Versions Bug Synopsis
8 9 10 11 12 13 14 15 16 17 18 19 20 21 22 23
JDK-8213618 IBM970 charset has missing entry and remove unexpected entries
JDK-8235834 IBM-943 charset encoder needs updating
JDK-8208634 Add x-IBM-1129 charset

core-libs/java.rmi

Fix Versions Bug Synopsis
8 9 10 11 12 13 14 15 16 17 18 19 20 21 22 23
JDK-8318705 [macos] ProblemList java/rmi/registry/multipleRegistries/MultipleRegistries.java

core-libs/java.text

Fix Versions Bug Synopsis
8 9 10 11 12 13 14 15 16 17 18 19 20 21 22 23
JDK-8216969 ParseException thrown for certain months with russian locale

core-libs/java.time

Fix Versions Bug Synopsis
8 9 10 11 12 13 14 15 16 17 18 19 20 21 22 23
JDK-8212941 Support new Japanese era in java.time.chrono.JapaneseEra
JDK-8213085 (tz) Upgrade Timezone Data to tzdata2018g
JDK-8224560 (tz) Upgrade Timezone Data to tzdata2019a
JDK-8296108 (tz) Update Timezone Data to 2022f
JDK-8305505 NPE in javazic compiler

core-libs/java.util

Fix Versions Bug Synopsis
8 9 10 11 12 13 14 15 16 17 18 19 20 21 22 23
JDK-8264512 jdk/test/jdk/java/util/prefs/ExportNode.java relies on default platform encoding
JDK-8213325 (props) Properties.loadFromXML does not fully comply with the spec
JDK-8172695 (scanner) java/util/Scanner/ScanTest.java fails
JDK-8280550 SplittableRandom#nextDouble(double,double) can return result >= bound

core-libs/java.util.concurrent

Fix Versions Bug Synopsis
8 9 10 11 12 13 14 15 16 17 18 19 20 21 22 23
JDK-8224698 ConcurrentSkipListMap.java does not compile with the Eclipse Java Compiler
JDK-8221892 ThreadPoolExecutor: Thread.isAlive() is not equivalent to not being startable
JDK-8292877 java/util/concurrent/atomic/Serial.java uses {Double,Long}Accumulator incorrectly

core-libs/java.util.jar

Fix Versions Bug Synopsis
8 9 10 11 12 13 14 15 16 17 18 19 20 21 22 23
JDK-8295530 Update Zlib Data Compression Library to Version 1.2.13
JDK-8193682 Infinite loop in ZipOutputStream.close()
JDK-8278794 Infinite loop in DeflaterOutputStream.finish()
JDK-8239351 Give more meaningful InternalError messages in Deflater.c
JDK-8240235 jdk.test.lib.util.JarUtils updates jar files incorrectly
JDK-8282036 Change java/util/zip/ZipFile/DeleteTempJar.java to stop HttpServer cleanly in case of exceptions

core-libs/java.util.logging

Fix Versions Bug Synopsis
8 9 10 11 12 13 14 15 16 17 18 19 20 21 22 23
JDK-8283719 java/util/logging/CheckZombieLockTest.java failing intermittently
JDK-8216363 NullPointerException in java.util.logging.Handler#isLoggable

core-libs/java.util.regex

Fix Versions Bug Synopsis
8 9 10 11 12 13 14 15 16 17 18 19 20 21 22 23
JDK-8247546 Pattern matching does not skip correctly over supplementary characters

core-libs/java.util.stream

Fix Versions Bug Synopsis
8 9 10 11 12 13 14 15 16 17 18 19 20 21 22 23
JDK-8249691 jdk/lambda/vm/StrictfpDefault.java file can be removed
JDK-8214761 Bug in parallel Kahan summation implementation

core-libs/java.util:collections

Fix Versions Bug Synopsis
8 9 10 11 12 13 14 15 16 17 18 19 20 21 22 23
JDK-8221924 get(null) on single-entry unmodifiable Map returns null instead of throwing NPE

core-libs/java.util:i18n

Fix Versions Bug Synopsis
8 9 10 11 12 13 14 15 16 17 18 19 20 21 22 23
JDK-8209167 Use CLDR's time zone mappings for Windows
JDK-8211398 Square character support for the Japanese new era
JDK-8213330 Fix legal headers in i18n tests
JDK-8236548 Localized time zone name inconsistency between English and other locales
JDK-8241082 Update IANA Language Subtag Registry to Version 2020-03-16
JDK-8274658 ISO 4217 Amendment 170 Update
JDK-8283277 ISO 4217 Amendment 171 Update
JDK-8289549 ISO 4217 Amendment 172 Update
JDK-8292899 CustomTzIDCheckDST.java testcase failed on AIX platform
JDK-8294307 ISO 4217 Amendment 173 Update
JDK-8296239 ISO 4217 Amendment 174 Update
JDK-8305400 ISO 4217 Amendment 175 Update
JDK-8321480 ISO 4217 Amendment 176 Update
JDK-8208656 Move java/util/Calendar/CalendarTestScripts tests into OpenJDK
JDK-8210443 Migrate Locale matching tests to JDK Repo.
JDK-8238203 Return value of GetUserDefaultUILanguage() should be handled as LANGID
JDK-8252497 Incorrect numeric currency code for ROL
JDK-8274864 Remove Amman/Cairo hacks in ZoneInfoFile
JDK-8287180 Update IANA Language Subtag Registry to Version 2022-08-08
JDK-8273924 ArrayIndexOutOfBoundsException thrown in java.util.JapaneseImperialCalendar.add()

core-libs/javax.naming

Fix Versions Bug Synopsis
8 9 10 11 12 13 14 15 16 17 18 19 20 21 22 23
JDK-8250772 Test com/sun/jndi/ldap/NamingExceptionMessageTest.java fails intermittently with javax.naming.ServiceUnavailableException
JDK-8245527 LDAP Channel Binding support for Java GSS/Kerberos
JDK-8208279 Add 8 JNDI tests to com/sun/jndi/dns/EnvTests/
JDK-8208483 Add 5 JNDI tests to com/sun/jndi/dns/FactoryTests/
JDK-8200151 Add 8 JNDI tests to com/sun/jndi/dns/ConfigTests/
JDK-8208542 Add 4 JNDI tests to com/sun/jndi/dns/ListTests/
JDK-8210339 Add 10 JNDI tests to com/sun/jndi/dns/FedTests/
JDK-8214694 cleanup rawtypes warnings in open jndi tests
JDK-8242614 cleanup duplicated test ldap server in some com/sun/jndi/ldap/ tests
JDK-8248865 Document JNDI/LDAP timeout properties
JDK-8259707 LDAP channel binding does not work with StartTLS extension
JDK-8287672 jtreg test com/sun/jndi/ldap/LdapPoolTimeoutTest.java fails intermittently in nightly run
JDK-8202117 com/sun/jndi/ldap/RemoveNamingListenerTest.java fails intermittently: Connection reset
JDK-8313657 com.sun.jndi.ldap.Connection.cleanup does not close connections on SocketTimeoutErrors
JDK-8314063 The socket is not closed in Connection::createSocket when the handshake failed for LDAP connection

core-svc

Fix Versions Bug Synopsis
8 9 10 11 12 13 14 15 16 17 18 19 20 21 22 23
JDK-8262379 Add regression test for JDK-8257746
JDK-8215411 some GetByteArrayElements calls miss corresponding Release

core-svc/debugger

Fix Versions Bug Synopsis
8 9 10 11 12 13 14 15 16 17 18 19 20 21 22 23
JDK-8209604 [TEST] rewrite com/sun/jdi shell tests to java version - step2
JDK-8210243 [TEST] rewrite com/sun/jdi shell tests to java version - step3
JDK-8210760 [TEST] rewrite com/sun/jdi shell tests to java version - step4
JDK-8211292 [TEST] convert com/sun/jdi/DeferredStepTest.sh test
JDK-8214892 Delayed starting of debugging via jcmd
JDK-8279669 test/jdk/com/sun/jdi/TestScaffold.java uses wrong condition
JDK-8283717 vmTestbase/nsk/jdi/ThreadStartEvent/thread/thread001 failed due to SocketTimeoutException
JDK-8234808 jdb quoted option parsing broken
JDK-8163083 SocketListeningConnector does not allow invocations with port 0
JDK-8193879 Java debugger hangs on method invocation
JDK-8068225 nsk/jdi/EventQueue/remove_l/remove_l005 intermittently times out
JDK-8276990 Memory leak in invoker.c fillInvokeRequest() during JDI operations
JDK-8284094 Memory leak in invoker_completeInvokeRequest()
JDK-8067354 com/sun/jdi/GetLocalVariables4Test.sh failed
JDK-8317920 JDWP-agent sends broken exception event with onthrow option

core-svc/java.lang.management

Fix Versions Bug Synopsis
8 9 10 11 12 13 14 15 16 17 18 19 20 21 22 23
JDK-8300659 Refactor TestMemoryAwareness to use WhiteBox api for host values
JDK-8240604 Rewrite sun/management/jmxremote/bootstrap/CustomLauncherTest.java test to make binaries from source file
JDK-8268103 JNI functions incorrectly return a double after JDK-8265836
JDK-8268361 Fix the infinite loop in next_line
JDK-8300119 CgroupMetrics.getTotalMemorySize0() can report invalid results on 32 bit systems
JDK-8198668 MemoryPoolMBean/isUsageThresholdExceeded/isexceeded001/TestDescription.java still failing
JDK-8048215 [TESTBUG] java/lang/management/ManagementFactory/ThreadMXBeanProxy.java Expected non-null LockInfo
JDK-8185005 Improve performance of ThreadMXBean.getThreadInfo(long ids[], int maxDepth)

core-svc/javax.management

Fix Versions Bug Synopsis
8 9 10 11 12 13 14 15 16 17 18 19 20 21 22 23
JDK-8219585 [TESTBUG] sun/management/jmxremote/bootstrap/JMXInterfaceBindingTest.java passes trivially when it shouldn't
JDK-8281377 Remove vmTestbase/nsk/monitoring/ThreadMXBean/ThreadInfo/Deadlock/JavaDeadlock001/TestDescription.java from problemlist.
JDK-8131745 java/lang/management/ThreadMXBean/AllThreadIds.java still fails intermittently

core-svc/tools

Fix Versions Bug Synopsis
8 9 10 11 12 13 14 15 16 17 18 19 20 21 22 23
JDK-8240711 TestJstatdPort.java failed due to "ExportException: Port already in use:"
JDK-8209595 MonitorVmStartTerminate.java timed out

hotspot

Fix Versions Bug Synopsis
8 9 10 11 12 13 14 15 16 17 18 19 20 21 22 23
JDK-8297656 AArch64: Enable AES/GCM Intrinsics
JDK-8248403 AArch64: Remove uses of kernel integer types

hotspot/compiler

Fix Versions Bug Synopsis
8 9 10 11 12 13 14 15 16 17 18 19 20 21 22 23
JDK-8248845 AArch64: stack corruption after spilling vector register
JDK-8248500 AArch64: Remove the r18 dependency on Windows AArch64
JDK-8241900 Loop unswitching may cause dependence on null check to be lost
JDK-8243670 Unexpected test result caused by C2 MergeMemNode::Ideal
JDK-8318889 C2: add bailout after assert Bad graph detected in build_loop_late
JDK-8247200 AArch64: assert((unsigned)fpargs < 32)
JDK-8248552 C2 crashes with SIGFPE due to division by zero
JDK-8250825 C2 crashes with assert(field != __null) failed: missing field
JDK-8255466 C2 crashes at ciObject::get_oop() const+0x0
JDK-8255058 C1: assert(is_virtual()) failed: type check
JDK-8268366 Incorrect calculation of has_fpu_registers in C1 linear scan
JDK-8269304 Regression ~5% in spec2005 in b27
JDK-8285835 SIGSEGV in PhaseIdealLoop::build_loop_late_post_work
JDK-8216154 C4819 warnings at HotSpot sources on Windows
JDK-8058176 [mlvm] tests should not allow code cache exhaustion
JDK-8217760 C2: Missing symbolic info on a call from intrinsics when invoked through MethodHandle
JDK-8217990 C2 UseOptoBiasInlining: load of markword optimized to 0 if running with -XX:-EliminateLocks
JDK-8255550 x86: Assembler::cmpq(Address dst, Register src) encoding is incorrect
JDK-8266615 C2 incorrectly folds subtype checks involving an interface array
JDK-8268347 C2: nested locks optimization may create unbalanced monitor enter/exit code
JDK-8268362 [REDO] C2 crash when compile negative Arrays.copyOf length after loop
JDK-8265132 C2 compilation fails with assert "missing precedence edge"
JDK-8269795 C2: Out of bounds array load floats above its range check in loop peeling resulting in SEGV
JDK-8272574 C2: assert(false) failed: Bad graph detected in build_loop_late
JDK-8279837 C2: assert(is_Loop()) failed: invalid node class: Region
JDK-8293044 C1: Missing access check on non-accessible class
JDK-8210387 C2 compilation fails with "assert(node->_last_del == _last) failed: must have deleted the edge just produced"
JDK-8177899 Tests fail due to code cache exhaustion on machines with many cores
JDK-8208277 Code cache heap (-XX:ReservedCodeCacheSize) doesn't work with 1GB LargePages
JDK-8076988 reevaluate trivial method policy
JDK-8216549 Mismatched unsafe access to non escaping object fails
JDK-8217918 C2: -XX:+AggressiveUnboxing is broken
JDK-8188133 C2: Static field accesses in clinit can trigger deoptimizations
JDK-8163511 Allocation of compile task fails with assert: "Leaking compilation tasks?"
JDK-8220714 C2 Compilation failure when accessing off-heap memory using Unsafe
JDK-8228772 C2 compilation fails due to unschedulable graph if DominatorSearchLimit is reached
JDK-8214904 Test8004741.java failed due to "Too few ThreadDeath hits; expected at least 6 but saw only 5"
JDK-8236140 assert(!VerifyHashTableKeys || _hash_lock == 0) failed: remove node from hash table before modifying it
JDK-8229855 C2 fails with assert(false) failed: bad AD file
JDK-8240905 assert(mem == (Node*)1 || mem == mem2) failed: multiple Memories being matched at once?
JDK-8245051 c1 is broken if it is compiled by gcc without -fno-lifetime-dse
JDK-8239083 C1 assert(known_holder == NULL || (known_holder->is_instance_klass() && (!known_holder->is_interface() || ((ciInstanceKlass*)known_holder)->has_nonstatic_concrete_methods())), "should be non-static concrete method");
JDK-8239477 jdk/jfr/jcmd/TestJcmdStartStopDefault.java fails -XX:+VerifyOops with "verify_oop: rsi: broken oop"
JDK-8248226 TestCloneAccessStressGCM fails with -XX:-ReduceBulkZeroing
JDK-8246381 VM crashes with "Current BasicObjectLock* below than low_mark"
JDK-8249605 C2: assert(no_dead_loop) failed: dead loop detected
JDK-8249603 C1: assert(has_error == false) failed: register allocation invalid
JDK-8253404 C2: assert(C->live_nodes() <= C->max_node_limit()) failed: Live Node limit exceeded limit
JDK-8251535 Partial peeling at unsigned test adds incorrect loop exit check
JDK-8255479 AArch64: assert(src->section_index_of(target) == CodeBuffer::SECT_NONE) failed: sanity
JDK-8256757 Incorrect MachCallRuntimeNode::ret_addr_offset() for CallLeafNoFP on x86_32
JDK-8255763 C2: OSR miscompilation caused by invalid memory instruction placement
JDK-8257513 C2: assert((constant_addr - _masm.code()->consts()->start()) == con.offset())
JDK-8261730 C2 compilation fails with assert(store->find_edge(load) != -1) failed: missing precedence edge
JDK-8266288 assert root method not found in witnessed_reabstraction_in_supers is too strong
JDK-8256934 C2: assert(C->live_nodes() <= C->max_node_limit()) failed: Live Node limit exceeded limit
JDK-8279076 C2: Bad AD file when matching SqrtF with UseSSE=0
JDK-8280867 Cpuid1Ecx feature parsing is incorrect for AMD CPUs
JDK-8283408 Fix a C2 crash when filling arrays with unsafe
JDK-8284944 assert(cnt++ < 40) failed: infinite cycle in loop optimization
JDK-8290705 StringConcat::validate_mem_flow asserts with "unexpected user: StoreI"
JDK-8290451 Incorrect result when switching to C2 OSR compilation from C1
JDK-8201516 DebugNonSafepoints generates incorrect information
JDK-8303564 C2: "Bad graph detected in build_loop_late" after a CMove is wrongly split thru phi
JDK-8313626 C2 crash due to unexpected exception control flow
JDK-8284882 SIGSEGV in Node::verify_edges due to compilation bailout
JDK-8219006 AArch64: Register corruption in slow subtype check
JDK-8218991 s390: Add intrinsic for GHASH algorithm
JDK-8219993 AArch64: Compiled CI stubs are unsafely modified
JDK-8221995 AARCH64: problems with CAS instructions encoding
JDK-8222785 aarch64: add necessary masking for immediate shift counts
JDK-8223020 aarch64: expand minI_rReg and maxI_rReg patterns into separate instructions
JDK-8223504 improve performance of forall loops by better inlining of "iterator()" methods.
JDK-8222412 AARCH64: multiple instructions encoding issues
JDK-8231403 [ppc]: Align ReservedCodeCacheSize default value with other platforms
JDK-8232591 AArch64: Add missing match rules for smaddl, smsubl and smnegl
JDK-8233364 Fix undefined behavior in Canonicalizer::do_ShiftOp
JDK-8241319 WB_GetCodeBlob doesn't have ResourceMark
JDK-8241911 AArch64: Fix a potential issue about register allocation effect rule in reduce_add2I
JDK-8022574 remove HaltNode code after uncommon trap calls
JDK-8243114 Implement montgomery{Multiply,Square}intrinsics on Windows
JDK-8222286 Fix for JDK-8213419 is broken on s390
JDK-8264626 C1 should be able to inline excluded methods
JDK-8277893 Arraycopy stress tests
JDK-8279668 x86: AVX2 versions of vpxor should be asserted
JDK-8271055 Crash during deoptimization with "assert(bb->is_reachable()) failed: getting result from unreachable basicblock" with -XX:+VerifyStack
JDK-8287425 Remove unnecessary register push for MacroAssembler::check_klass_subtype_slow_path
JDK-8294947 Use 64bit atomics in patch_verified_entry on x86_64
JDK-8316178 Better diagnostic header for CodeBlobs
JDK-8316514 Better diagnostic header for VtableStub
JDK-8227632 Incorrect PrintCompilation message: made not compilable on levels 0 1 2 3 4
JDK-8232084 HotSpot build failed with GCC 9.2.1
JDK-8251994 VM crashed running TestComplexAddrExpr.java test with -XX:UseAVX=X

hotspot/gc

Fix Versions Bug Synopsis
8 9 10 11 12 13 14 15 16 17 18 19 20 21 22 23
JDK-8218063 JDK-8218060 breaks build for S390
JDK-8210088 ProblemList gc/epsilon/TestMemoryMXBeans.java
JDK-8210063 ZGC: Enable load barriers for IN_NATIVE runtime barriers
JDK-8210158 Accessorize JFR getEventWriter() intrinsics
JDK-8210236 Prepare ciReceiverTypeData::translate_receiver_data_from for concurrent class unloading
JDK-8211432 [REDO] Handle JNIGlobalRefLocker.cpp
JDK-8212083 Handle remaining gc/lock native code and fix two strings
JDK-8213440 Lingering INCLUDE_ALL_GCS in test_oopStorage_parperf.cpp
JDK-8214799 Add package declaration to each JTREG test case in the gc folder
JDK-8227179 Test for new gc+metaspace=info output format
JDK-8229156 ProblemList gc/stress/gclocker/TestExcessGCLockerCollections.java
JDK-8244010 Simplify usages of ProcessTools.createJavaProcessBuilder in our tests
JDK-8269077 TestSystemGC uses "require vm.gc.G1" for large pages subtest
JDK-8284573 [11u] ProblemList TestBubbleUpRef.java and TestGCOldWithCMS.java because of 8272195
JDK-8252114 Windows-AArch64: Enable and test ZGC and ShenandoahGC
JDK-8241478 vmTestbase/gc/gctests/Steal/steal001/steal001.java fails with OOME
JDK-8224531 SEGV while collecting Klass statistics
JDK-8235324 Dying objects are published from users of CollectedHeap::object_iterate
JDK-8247201 Print potential pointer value of readable stack memory in hs_err file
JDK-8300742 jstat's CGCT is 5 percent higher than the pause time in -Xlog:gc.

hotspot/jfr

Fix Versions Bug Synopsis
8 9 10 11 12 13 14 15 16 17 18 19 20 21 22 23
JDK-8287113 JFR: Periodic task thread uses period for method sampling events
JDK-8287463 JFR: Disable TestDevNull.java on Windows
JDK-8298129 Let checkpoint event sizes grow beyond u4 limit
JDK-8249875 GCC 10 warnings -Wtype-limits with JFR code
JDK-8262121 [11u] Redo 8244287: JFR: Methods samples have line number 0
JDK-8260589 Crash in JfrTraceIdLoadBarrier::load(_jclass*)
JDK-8271490 [ppc] [s390]: Crash in JavaThread::pd_get_top_frame_for_profiling
JDK-8289745 JfrStructCopyFailed uses heap words instead of bytes for object sizes
JDK-8289917 Metadata for regionsRefilled of G1EvacuationStatistics event is wrong
JDK-8294673 JFR: Add SecurityProviderService#threshold to TestActiveSettingEvent.java
JDK-8230400 Missing constant pool entry for a method in stacktrace
JDK-8261020 Wrong format parameter in create_emergency_chunk_path
JDK-8276125 RunThese24H.java SIGSEGV in JfrThreadGroup::thread_group_id
JDK-8225004 Remove invalid assertion in jfr_conditional_flush()

hotspot/jvmti

Fix Versions Bug Synopsis
8 9 10 11 12 13 14 15 16 17 18 19 20 21 22 23
JDK-8210385 Clean up JNI_ENV_ARG and factorize the macros for vmTestbase/jvmti[A-N] tests
JDK-8211036 Remove the NSK_STUB macros from vmTestbase for non jvmti
JDK-8211131 Remove the NSK_CPP_STUB macros from vmTestbase for jvmti/[G-I]*
JDK-8211261 Remove the NSK_CPP_STUB macros from vmTestbase for jvmti/[A-G]*
JDK-8211782 Remove the NSK_CPP_STUB macros from vmTestbase for jvmti/[I-S]*
JDK-8211801 Remove the NSK_CPP_STUB macros from vmTestbase for jvmti/scenarios/[A-E]
JDK-8212082 Remove the NSK_CPP_STUB macros for remaining vmTestbase/jvmti/[sS]*
JDK-8211899 Remove the NSK_CPP_STUB macros from vmTestbase for jvmti/scenarios/[E-M]
JDK-8212148 Remove remaining NSK_CPP_STUBs
JDK-8212754 Build failure: undefined JvmtiSampledObjectAllocEventCollector::object_alloc_is_safe_to_sample
JDK-8231595 [TEST] develop a test case for SuspendThreadList including current thread
JDK-8235218 Minimal VM is broken after JDK-8173361
JDK-8235456 Minimal VM is broken after JDK-8212160
JDK-8257928 Test image build failure with clang-10 due to -Wmisleading-indentation
JDK-8227277 HeapInspection::find_instances_at_safepoint walks dead objects
JDK-8253899 Make IsClassUnloadingEnabled signature match specification
JDK-8173658 JvmtiExport::post_class_unload() is broken for non-JavaThread initiators
JDK-8201513 nsk/jvmti/IterateThroughHeap/filter-* are broken
JDK-8051349 nsk/jvmti/scenarios/sampling/SP06/sp06t003 fails in nightly
JDK-8222072 JVMTI GenerateEvents() sends CompiledMethodLoad events to wrong jvmtiEnv
JDK-6606767 resexhausted00[34] fail assert(!thread->owns_locks(), "must release all locks when leaving VM")

hotspot/runtime

Fix Versions Bug Synopsis
8 9 10 11 12 13 14 15 16 17 18 19 20 21 22 23
JDK-8210040 [TESTBUG] TestOptionsWithRanges is very slow
JDK-8316746 Top of lock-stack does not match the unlocked object
JDK-8209545 Simplify HeapShared::archive_module_graph_objects
JDK-8209657 Refactor filemap.hpp to simplify integration with Serviceability Agent
JDK-8209826 Undefined reference to os::write after JDK-8209657 (filemap.hpp cleanup)
JDK-8210043 Invalid assert(HeapBaseMinAddress > 0) in ReservedHeapSpace::initialize_compressed_heap
JDK-8209946 [TESTBUG] CDS tests should use "@run driver"
JDK-8218751 Do not store original classfiles inside the CDS archive
JDK-8239559 Cgroups: Incorrect detection logic on some systems
JDK-8287741 Fix of JDK-8287107 (unused cgv1 freezer controller) was incomplete
JDK-8208623 [TESTBUG] runtime/LoadClass/LongBCP.java fails in AUFS file system
JDK-8208704 runtime/appcds/MultiReleaseJars.java timed out often in hs-tier7 testing
JDK-8208705 [TESTBUG] The -Xlog:cds,cds+hashtables vm option is not always required for appcds tests
JDK-8209120 Archive the Integer.IntegerCache
JDK-8209850 Allow NamedThreads to use GlobalCounter critical sections
JDK-8211124 HotSpot vm_version.cpp should recognise updated VS2017
JDK-8211333 AArch64: Fix another build failure after JDK-8211029
JDK-8211296 Remove HotSpot deprecation warning suppression for Mac/clang
JDK-8216366 Add rationale to PER_CPU_SHARES define
JDK-8216982 Assertion poison page established too early
JDK-8217628 Verbose ArrayIndexOutOfBoundsException message also in JNI calls.
JDK-8223395 PPC64: Improve comments in the JVM signal handler to match ISA text
JDK-8239886 Minimal VM build fails after JDK-8237499
JDK-8241101 [s390] jtreg test failure after JDK-8238696: not conformant features string
JDK-8243470 [macos] bring back O2 opt level for unsafe.cpp
JDK-8252957 Wrong comment in CgroupV1Subsystem::cpu_quota
JDK-8254244 Some code emitted by TemplateTable::branch is unused when running TieredCompilation
JDK-8254748 Bad Copyright header format after JDK-8212218
JDK-8266749 AArch64: Backtracing broken on PAC enabled systems
JDK-8266967 debug.cpp utility find() should print Java Object fields.
JDK-8269882 stack-use-after-scope in NewObjectA
JDK-8284752 Zero does not build on Mac OS X due to missing os::current_thread_enable_wx implementation
JDK-8284331 Add sanity check for signal handler modification warning.
JDK-8284950 CgroupV1 detection code should consider memory.swappiness
JDK-8301065 Handle control characters in java_lang_String::print
JDK-8309138 Fix container tests for jdks with symlinked conf dir
JDK-8261652 Remove some dead comments from os_bsd_x86
JDK-8284732 FFI_GO_CLOSURES macro not defined but required for zero build on Mac OS X
JDK-8221725 AArch64 build failures after JDK-8221408 (Windows 32bit build build errors/warnings in hotspot)
JDK-8323243 JNI invocation of an abstract instance method corrupts the stack
JDK-8227041 runtime/memory/RunUnitTestsConcurrently.java has a memory leak
JDK-8305766 ProblemList runtime/CompressedOops/CompressedClassPointers.java
JDK-8229147 Linux os::create_thread() overcounts guardpage size with newer glibc (>=2.27)
JDK-8213845 ARM32: Interpreter doesn't call result handler after native calls
JDK-8220672 [TESTBUG] TestCPUSets should check that cpuset does not exceed available cores
JDK-8238175 CTW: Class.getDeclaredMethods fails with assert(k->is_subclass_of(SystemDictionary::Throwable_klass())) failed: invalid exception class
JDK-8247354 AArch64: PopFrame causes assert(oopDesc::is_oop(obj)) failed: not an oop
JDK-8253572 [windows] CDS archive may fail to open with long file names
JDK-8255065 Zero: accessor_entry misses the IRIW case
JDK-8258077 Using -Xcheck:jni can lead to a double-free after JDK-8193234
JDK-8269934 RunThese24H.java failed with EXCEPTION_ACCESS_VIOLATION in java_lang_Thread::get_thread_status
JDK-8295974 jni_FatalError and Xcheck:jni warnings should print the native stack when there are no Java frames
JDK-8207779 Method::is_valid_method() compares 'this' with NULL
JDK-8208499 NMT: Missing memory tag for Safepoint polling page
JDK-8024368 private methods are allocated vtable indices
JDK-8219074 [TESTBUG] runtime/containers/docker/TestCPUAwareness.java typo of printing parameters (period should be shares)
JDK-8219370 NMT: Move synchronization primitives from mtInternal to mtSynchronizer
JDK-8214777 Avoid some GCC 8.X strncpy() errors in HotSpot
JDK-8219698 aarch64: SIGILL triggered when specifying unsupported hardware features
JDK-8233912 aarch64: minor improvements of atomic operations
JDK-8233466 aarch64: remove unnecessary load of mdo when profiling return and parameters type
JDK-8241586 compiler/cpuflags/TestAESIntrinsicsOnUnsupportedConfig.java fails on aarch64
JDK-8250911 [windows] os::pd_map_memory error detection broken
JDK-8255718 Zero: VM should know it runs in interpreter-only mode
JDK-8257604 JNI_ArgumentPusherVaArg leaks valist
JDK-8263557 Possible NULL dereference in Arena::destruct_contents()
JDK-8263558 Possible NULL dereference in fast path arena free if ZapResourceArea is true
JDK-8265690 Use the latest Ubuntu base image version in Docker testing
JDK-8278384 Bytecodes::result_type() for arraylength returns T_VOID instead of T_INT
JDK-8280391 NMT: Correct NMT tag on CollectedHeap
JDK-8293466 libjsig should ignore non-modifying sigaction calls
JDK-8313081 MonitoringSupport_lock should be unconditionally initialized after 8304074

hotspot/svc

Fix Versions Bug Synopsis
8 9 10 11 12 13 14 15 16 17 18 19 20 21 22 23
JDK-8209109 [TEST] rewrite com/sun/jdi shell tests to java version - step1
JDK-8203928 [Test] Convert non-JDB scaffolding serviceability shell script tests to java
JDK-8285921 serviceability/dcmd/jvmti/AttachFailed/AttachReturnError.java fails on Alpine
JDK-8285794 AsyncGetCallTrace might acquire a lock via JavaThread::thread_from_jni_environment
JDK-8181383 com/sun/jdi/OptionTest.java fails intermittently with bind failed: Address already in use
JDK-8259451 Zero: skip serviceability/sa tests, set vm.hasSA to false
JDK-8280004 DCmdArgument::parse_value() should handle NULL input
JDK-8021335 Missing synchronization when reading counters for live threads and peak thread count

hotspot/svc-agent

Fix Versions Bug Synopsis
8 9 10 11 12 13 14 15 16 17 18 19 20 21 22 23
JDK-8217473 SA: Tests using ClhsdbLauncher fail on SAP docker containers
JDK-8235220 ClhsdbScanOops.java fails with sun.jvm.hotspot.types.WrongTypeException
JDK-8217612 (CL)HSDB cannot show some JVM flags
JDK-8235846 Improve WindbgDebuggerLocal implementation
JDK-8243210 ClhsdbScanOops fails with NullPointerException in FileMapHeader.inCopiedVtableSpace
JDK-8279662 serviceability/sa/ClhsdbScanOops.java can fail due to unexpected GC
JDK-8307955 Prefer to PTRACE_GETREGSET instead of PTRACE_GETREGS in method 'ps_proc.c::process_get_lwp_regs'
JDK-8210836 Build fails with warn_unused_result in openjdk/src/jdk.hotspot.agent/linux/native/libsaproc/ps_core.c
JDK-8229118 [TESTBUG] serviceability/sa/ClhsdbFindPC fails on AArch64

hotspot/test

Fix Versions Bug Synopsis
8 9 10 11 12 13 14 15 16 17 18 19 20 21 22 23
JDK-8207855 Make applications/jcstress invoke tests in batches
JDK-8220353 [TESTBUG] TestRegisterRestoring uses SafepointALot without UnlockDiagnosticVMOptions
JDK-8210593 Clean up JNI_ENV_ARG and factorize the macros for vmTestbase/jvmti[N-R] tests
JDK-8210665 Clean up JNI_ENV_ARG and factorize the macros for vmTestbase/jvmti[R-U] tests
JDK-8210481 Remove #ifdef cplusplus from vmTestbase
JDK-8210700 Clean up JNI_ENV_ARG and factorize the macros for vmTestbase/jvmti/unit tests
JDK-8210726 Fix up a few minor nits forgotten by JDK-8210665
JDK-8210689 Remove the multi-line old C style for string literals
JDK-8216265 [testbug] Introduce Platform.sharedLibraryPathVariableName() and adapt all tests.
JDK-8217520 Remove vm.opt.MaxGCPauseMillis == "null" from TestOldGenCollectionUsage.java
JDK-8219149 ProcessTools.ProcessBuilder should print timing info for subprocesses
JDK-8244078 ProcessTools executeTestJvm and createJavaProcessBuilder have inconsistent handling of test.*.opts
JDK-8295288 Some vm_flags tests associate with a wrong BugID
JDK-8313159 [11u] Fix test SSLEngineKeyLimit.java after Merge error
JDK-8315415 OutputAnalyzer.shouldMatchByLine() fails in some cases
JDK-8208278 [mlvm] [TESTBUG] vm.mlvm.mixed.stress.java.findDeadlock.INDIFY_Test Deadlocked threads are not always detected

infrastructure

Fix Versions Bug Synopsis
8 9 10 11 12 13 14 15 16 17 18 19 20 21 22 23
JDK-8268185 Update GitHub Actions for jtreg 6
JDK-8224838 Bump update version for OpenJDK: jdk-11.0.5
JDK-8320884 Bump update version for OpenJDK: jdk-11.0.23
JDK-8326801 Bump update version for OpenJDK: jdk-11.0.24
JDK-8248495 [macos] zerovm is broken due to libffi headers location

infrastructure/build

Fix Versions Bug Synopsis
8 9 10 11 12 13 14 15 16 17 18 19 20 21 22 23
JDK-8218413 make reconfigure ignores configure-time AUTOCONF environment variable
JDK-8298459 Fix msys2 linking and handling out of tree build directory for source zip creation
JDK-8298527 Cygwin's uname -m returns different string than before
JDK-8208665 Amend cross-compilation docs with qemu-debootstrap recipe
JDK-8211268 Disable unsupported GCs for Zero
JDK-8222522 Add configure options for Mac Bundle creation
JDK-8223667 ASAN build broken
JDK-8223678 Add Visual Studio Code workspace generation support (for native code)
JDK-8253424 Add support for running pre-submit testing using GitHub Actions
JDK-8247591 Document Alpine Linux build steps in OpenJDK build guide
JDK-8257913 Add more known library locations to simplify Linux cross-compilation
JDK-8265531 doc/building.md should mention homebrew install freetype
JDK-8273497 building.md should link to both md and html
JDK-8254318 Remove .hgtags
JDK-8281262 Windows builds in different directories are not fully reproducible
JDK-8287202 GHA: Add macOS aarch64 to the list of default platforms for workflow_dispatch event
JDK-8290000 Bump macOS GitHub actions to macOS 11
JDK-8304134 jib bootstrapper fails to quote filename when checking download filetype
JDK-8324184 Windows VS2010 build failed with "error C2275: 'int64_t'"
JDK-8297000 [jib] Add more friendly warning for proxy issues
JDK-8317327 Remove JT_JAVA dead code in jib-profiles.js
JDK-8244951 Missing entitlements for hardened runtime
JDK-8246094 [macos] Sound Recording and playback is not working
JDK-8303476 Add the runtime version in the release file of a JDK image
JDK-8306543 GHA: MSVC installation is failing
JDK-8199138 Add RISC-V support to Zero
JDK-8264848 [macos] libjvm.dylib linker warning due to macOS version mismatch
JDK-8267304 Bump global JTReg memory limit to 768m
JDK-8294941 GHA: Cut down cross-compilation sysroots
JDK-8295885 GHA: Bump gcc versions
JDK-8324659 GHA: Generic jtreg errors are not reported
JDK-8324723 GHA: Upgrade some actions to avoid deprecated Node 16

security-libs

Fix Versions Bug Synopsis
8 9 10 11 12 13 14 15 16 17 18 19 20 21 22 23
JDK-8282538 PKCS11 tests fail on CentOS Stream 9
JDK-8253866 Security Libs Terminology Refresh
JDK-8296384 [TESTBUG] sun/security/provider/SecureRandom/AbstractDrbg/SpecTest.java intermittently timeout
JDK-8318983 Fix comment typo in PKCS12Passwd.java
JDK-8305074 ProblemList javax/net/ssl/DTLS/RespondToRetransmit.java
JDK-8266293 Key protection using PBEWithMD5AndDES fails with "java.security.InvalidAlgorithmParameterException: Salt must be 8 bytes long"
JDK-8264190 Harden TLS interop tests
JDK-8270556 Exclude security/infra/java/security/cert/CertPathValidator/certification/LetsEncryptCA

security-libs/java.security

Fix Versions Bug Synopsis
8 9 10 11 12 13 14 15 16 17 18 19 20 21 22 23
JDK-8244087 2020-04-24 public suffix list update v ff6fcea
JDK-8211969 test/jdk/lib/security/CheckBlacklistedCerts.java searching for wrong paths
JDK-8222133 Add temporary exceptions for root certs that are due to expire soon
JDK-8224729 Cleanups in sun/security/provider/certpath/ldap/LDAPCertStoreImpl.java
JDK-8232019 Add LuxTrust certificate updates to the existing root program
JDK-8242184 Default signature algorithm for an RSASSA-PSS key
JDK-8242151 Improve OID mapping and reuse among JDK security providers for aliases registration
JDK-8245134 test/lib/jdk/test/lib/security/KeyStoreUtils.java should allow to specify aliases
JDK-8243321 Add Entrust root CA - G4 to Oracle Root CA program
JDK-8153005 Upgrade the default PKCS12 encryption/MAC algorithms
JDK-8255348 NPE in PKIXCertPathValidator event logging code
JDK-8259338 Add expiry exception for identrustdstx3 alias to VerifyCACerts.java test
JDK-8225083 Remove Google certificate that is expiring in December 2021
JDK-8255266 Update Public Suffix List to 3c213aa
JDK-8277488 Add expiry exception for Digicert (geotrustglobalca) expiring in May 2022
JDK-8293858 Change PKCS7 code to use default SecureRandom impl instead of SHA1PRNG
JDK-8296675 Exclude linux-aarch64 in NSS tests
JDK-8298108 Add a regression test for JDK-8297684
JDK-8245654 Add Certigna Root CA
JDK-8282201 Consider removal of expiry check in VerifyCACerts.java test
JDK-8305975 Add TWCA Global Root CA
JDK-8304760 Add 2 Microsoft TLS roots
JDK-8307134 Add GTS root CAs
JDK-8302017 Allocate BadPaddingException only if it will be thrown
JDK-8320208 Update Public Suffix List to b5bf572
JDK-8321408 Add Certainly roots R1 and E1
JDK-8210395 Add doc to SecurityTools.java
JDK-8213007 Update the link in test/jdk/sun/security/provider/SecureRandom/DrbgCavp.java
JDK-8221801 Update src/java.base/share/legal/public_suffix.md
JDK-8223555 Cleanups in cacerts tests
JDK-8224727 Problem list test security/infra/java/security/cert/CertPathValidator/certification/ActalisCA.java
JDK-8227059 sun/security/tools/keytool/DefaultSignatureAlgorithm.java timed out
JDK-8245665 Test WeakAlg.java should only make sure no warning for weak signature algorithms by keytool on root CA
JDK-8259517 Incorrect test path in test cases
JDK-8247895 SHA1PRNGReseed.java is calling setSeed(0)
JDK-8269933 test/jdk/javax/net/ssl/compatibility/JdkInfo incorrect verification of protocol and cipher support
JDK-8268558 [TESTBUG] Case 2 in TestP11KeyFactoryGetRSAKeySpec is skipped
JDK-8257722 Improve "keytool -printcert -jarfile" output
JDK-8279066 entries.remove(entry) is useless in PKCS12KeyStore
JDK-8273236 keytool does not accurately warn about algorithms that are disabled but have additional constraints
JDK-8292297 Fix up loading of override java.security properties file
JDK-8254711 Add java.security.Provider.getService JFR Event
JDK-8292033 Move jdk.X509Certificate event logic to JCA layer
JDK-8300272 Improve readability of the test JarWithOneNonDisabledDigestAlg
JDK-8300259 Add test coverage for processing of pending block files in signed JARs
JDK-8297955 LDAP CertStore should use LdapName and not String for DNs
JDK-8215318 Amend the Standard Algorithm Names specification to clarify that names can be defined in later versions
JDK-8186143 keytool -ext option doesn't accept wildcards for DNS subject alternative names
JDK-8207059 Update test certificates in QuoVadisCA.java test
JDK-8213400 Support choosing group name in keytool keypair generation
JDK-8148188 Enhance the security libraries to record events of interest
JDK-8218482 sun/security/krb5/auto/ReplayCachePrecise.java failed - no KrbException thrown
JDK-8242897 KeyFactory.generatePublic( x509Spec ) failed with java.security.InvalidKeyException
JDK-8244683 A TSA server used by tests
JDK-8257497 Update keytool to create AKID from the SKID of the issuing certificate as specified by RFC 5280
JDK-8026393 jarsigner never shows a warning in badKeyUsage case
JDK-8267599 Revert the change to the default PKCS12 macAlgorithm and macIterationCount props for 11u/8u/7u
JDK-8267880 Upgrade the default PKCS12 MAC algorithm
JDK-8262862 Harden tests sun/security/x509/URICertStore/ExtensionsWithLDAP.java and krb5/canonicalize/Test.java
JDK-8268427 Improve AlgorithmConstraints:checkAlgorithm performance
JDK-8228578 fix CFData object leak in macosx KeystoreImpl.m
JDK-8237804 sun/security/mscapi tests fail with "Key pair not generated, alias already exists"
JDK-8218021 Have jarsigner preserve posix permission attributes
JDK-8250968 Symlinks attributes not preserved when using jarsigner on zip files
JDK-8163498 Many long-running security libs tests
JDK-8216280 Allow later Symantec Policy distrust date for two Apple SubCAs

security-libs/javax.crypto

Fix Versions Bug Synopsis
8 9 10 11 12 13 14 15 16 17 18 19 20 21 22 23
JDK-8257769 Cipher.getParameters() throws NPE for ChaCha20-Poly1305
JDK-8280703 CipherCore.doFinal(...) causes potentially massive byte[] allocations during decryption
JDK-8209129 Further improvements to cipher buffer management
JDK-8201355 Avoid native memory allocation in sun.security.mscapi.PRNG.generateSeed
JDK-8213009 Refactoring existing SunMSCAPI classes
JDK-8213010 Supporting keys created with certmgr.exe
JDK-8178806 Better exception logging in crypto code
JDK-8023980 JCE doesn't provide any class to handle RSA private key in PKCS#1
JDK-8236671 NullPointerException in JKS keystore
JDK-8281628 KeyAgreement : generateSecret intermittently not resetting
JDK-8217344 Make comparison overflow-aware in ECDHKeyAgreement.engineGenerateSecret()
JDK-8216012 Infinite loop in RSA KeyPairGenerator

security-libs/javax.crypto:pkcs11

Fix Versions Bug Synopsis
8 9 10 11 12 13 14 15 16 17 18 19 20 21 22 23
JDK-8244154 Update SunPKCS11 provider with PKCS11 v3.0 header files
JDK-8255410 Add ChaCha20 and Poly1305 support to SunPKCS11 provider
JDK-8214459 NSS source should be removed
JDK-8225390 ProblemList sun/security/pkcs11/sslecc/ClientJSSEServerJSSE.java due to JDK-8161536
JDK-8267721 Enable sun/security/pkcs11 tests for Amazon Linux 2 AArch64
JDK-8288985 P11TlsKeyMaterialGenerator should work with ChaCha20-Poly1305
JDK-8289301 P11Cipher should not throw out of bounds exception during padding
JDK-8293232 Fix race condition in pkcs11 SessionManager
JDK-8293815 P11PSSSignature.engineUpdate should not print debug messages during normal operation
JDK-8180837 SunPKCS11-NSS tests failing with CKR_ATTRIBUTE_READ_ONLY and CKR_MECHANISM_PARAM_INVALID
JDK-8240256 Better resource cleaning for SunPKCS11 Provider
JDK-8209398 sun/security/pkcs11/KeyStore/SecretKeysBasic.sh failed with "PKCS11Exception: CKR_ATTRIBUTE_SENSITIVE"
JDK-8294906 Memory leak in PKCS11 NSS TLS server
JDK-8279941 sun/security/pkcs11/Signature/TestDSAKeyLength.java fails when NSS version detection fails
JDK-8213008 Cipher with UNWRAP_MODE should support the generation of an AES key type
JDK-8226221 Update PKCS11 tests to use NSS 3.46 libs

security-libs/javax.net.ssl

Fix Versions Bug Synopsis
8 9 10 11 12 13 14 15 16 17 18 19 20 21 22 23
JDK-8140466 ChaCha20 and Poly1305 TLS Cipher Suites
JDK-8202343 Disable TLS 1.0 and 1.1
JDK-8029661 Support TLS v1.2 algorithm in SunPKCS11 provider
JDK-8211883 Disable anon and NULL cipher suites
JDK-8168261 Use server cipher suites preference by default
JDK-8163326 Update the default enabled cipher suites preference
JDK-8222391 javax/net/ssl/compatibility/Compatibility.java should be more flexible
JDK-8224650 Add tests to support X25519 and X448 in TLS
JDK-8190492 Remove SSLv2Hello and SSLv3 from default enabled TLS protocols
JDK-8250839 Improve test template SSLEngineTemplate with SSLContextTemplate
JDK-8254631 Better support ALPN byte wire values in SunJSSE
JDK-8282600 SSLSocketImpl should not use user_canceled workaround when not necessary
JDK-8301700 Increase the default TLS Diffie-Hellman group size from 1024-bit to 2048-bit
JDK-8210918 Add test to exercise server-side client hello processing
JDK-8210632 Add key exchange algorithm to javax/net/ssl/TLSCommon/CipherSuite.java
JDK-8224991 Problemlist javax/net/ssl/ServerName/SSLEngineExplorerMatchedSNI.java
JDK-8226976 SessionTimeOutTests uses == operator for String value check
JDK-8228967 Trust/Key store and SSL context utilities for tests
JDK-8235448 code cleanup in SSLContextImpl.java
JDK-8247510 typo in IllegalHandshakeMessage
JDK-8266881 Enable debug log for SSLEngineExplorerMatchedSNI.java
JDK-8284694 Avoid evaluating SSLAlgorithmConstraints twice
JDK-8236039 JSSE Client does not accept status_request extension in CertificateRequest messages for TLS 1.3
JDK-8239798 SSLSocket closes socket both socket endpoints on a SocketTimeoutException
JDK-8237474 Default SSLEngine should create in server role
JDK-8275811 Incorrect instance to dispose
JDK-8210974 No extensions debug log for ClientHello
JDK-8212885 TLS 1.3 resumed session does not retain peer certificate chain
JDK-8243029 Rewrite javax/net/ssl/compatibility/Compatibility.java with a flexible interop test framework
JDK-8236464 SO_LINGER option is ignored by SSLSocket in JDK 11
JDK-8245005 javax/net/ssl/compatibility/BasicConnectTest.java failed with No enum constant
JDK-8217633 Configurable extensions with system properties
JDK-8227651 Tests fail with SSLProtocolException: Input record too big
JDK-4919790 Errors in alert ssl message does not reflect the actual certificate status
JDK-8259662 Don't wrap SocketExceptions into SSLExceptions in SSLSocketImpl
JDK-8171279 Support X25519 and X448 in TLS
JDK-8310106 sun.security.ssl.SSLHandshake.getHandshakeProducer() incorrectly checks handshakeConsumers

security-libs/javax.smartcardio

Fix Versions Bug Synopsis
8 9 10 11 12 13 14 15 16 17 18 19 20 21 22 23
JDK-8286211 Update PCSC-Lite for SUSE Linux to 1.9.5
JDK-8255546 Missing coverage for javax.smartcardio.CardPermission and ResponseAPDU

security-libs/javax.xml.crypto

Fix Versions Bug Synopsis
8 9 10 11 12 13 14 15 16 17 18 19 20 21 22 23
JDK-8247964 All log0() in com/sun/org/slf4j/internal/Logger.java should be private
JDK-8259801 Enable XML Signature secure validation mode by default
JDK-8255255 Update Apache Santuario (XML Signature) to version 2.2.1
JDK-8275082 Update XML Security for Java to 2.3.0
JDK-8305972 Update XML Security for Java to 3.0.2
JDK-8319124 Update XML Security for Java to 3.0.3
JDK-8210736 jdk/javax/xml/crypto/dsig/GenerationTests.java slow on linux
JDK-8232357 Compare version info of Santuario to legal notice
JDK-8270797 ShortECDSA.java test is not complete
JDK-8272908 Missing coverage for certain classes in com.sun.org.apache.xml.internal.security
JDK-8287246 DSAKeyValue should check for missing params instead of relying on KeyFactory provider
JDK-8255548 Missing coverage for javax.xml.crypto.dom.DOMCryptoContext
JDK-8247907 XMLDsig logging does not work
JDK-8259535 ECDSA SignatureValue do not always have the specified length
JDK-8278186 org.jcp.xml.dsig.internal.dom.Utils.parseIdFromSameDocumentURI throws StringIndexOutOfBoundsException when calling substring method

security-libs/jdk.security

Fix Versions Bug Synopsis
8 9 10 11 12 13 14 15 16 17 18 19 20 21 22 23
JDK-8228341 SignTwice.java fails intermittently on Windows
JDK-8285398 Cache the results of constraint checks
JDK-8292683 Remove BadKeyUsageTest.java from Problem List
JDK-8301167 Update VerifySignedJar to actually exercise and test verification
JDK-8240848 ArrayIndexOutOfBoundsException buf for TextCallbackHandler

security-libs/org.ietf.jgss

Fix Versions Bug Synopsis
8 9 10 11 12 13 14 15 16 17 18 19 20 21 22 23
JDK-8279520 SPNEGO has not passed channel binding info into the underlying mechanism
JDK-8303809 Dispose context in SPNEGO NegotiatorImpl
JDK-8212165 JGSS: Fix cut/paste error in NativeUtil.c
JDK-8212216 JGSS: Fix leak in exception cases in getJavaOID()
JDK-8253829 Wrong length compared in SSPI bridge
JDK-8280401 [sspi] gss_accept_sec_context leaves output_token uninitialized
JDK-8301760 Fix possible leak in SpNegoContext dispose
JDK-8210373 Deadlock in libj2gss.so when loading "j2gss" and "net" libraries in parallel.

security-libs/org.ietf.jgss:krb5

Fix Versions Bug Synopsis
8 9 10 11 12 13 14 15 16 17 18 19 20 21 22 23
JDK-8139348 Deprecate 3DES and RC4 in Kerberos
JDK-8261481 Cannot read Kerberos settings in dynamic store on macOS Big Sur
JDK-8274205 Handle KDC_ERR_SVC_UNAVAILABLE error code from KDC
JDK-8273894 ConcurrentModificationException raised every time ReferralsCache drops referral

tools

Fix Versions Bug Synopsis
8 9 10 11 12 13 14 15 16 17 18 19 20 21 22 23
JDK-8289562 Change bugs.java.com and bugreport.java.com URL's to https
JDK-8168869 jdeps: localized messages don't use proper line breaks

tools/javac

Fix Versions Bug Synopsis
8 9 10 11 12 13 14 15 16 17 18 19 20 21 22 23
JDK-8225386 test for JDK-8216261 fails in Windows
JDK-8193462 Fix Filer handling of package-info initial elements
JDK-8213263 fix legal headers in test/langtools
JDK-8214026 Canonicalized archive paths appearing in diagnostics
JDK-8236210 javac generates wrong annotation for fields generated from record components
JDK-8261205 AssertionError: Cannot add metadata to an intersection type
JDK-8193277 SimpleFileObject inconsistency between getName and getShortName
JDK-8220634 SymLinkArchiveTest should handle not being able to create symlinks
JDK-8308245 Add -proc:full to describe current default annotation processing policy
JDK-8177068 incomplete classpath causes NPE in Flow
JDK-8218268 Javac treats Manifest Class-Path entries as Paths instead of URLs
JDK-8035787 SourcePositions are wrong for Strings concatenated with '+' operator
JDK-8029633 Raw inner class constructor ref should not perform diamond inference
JDK-8281507 Two javac tests have bad jtreg `@clean` tags

tools/javadoc(tool)

Fix Versions Bug Synopsis
8 9 10 11 12 13 14 15 16 17 18 19 20 21 22 23
JDK-8207214 Broken links in JDK API serialized-form page
JDK-8284367 Upgrade JQuery UI to 1.13.1 from 1.12.1
JDK-8219628 [TESTBUG] javadoc/doclet/InheritDocForUserTags fails with -othervm
JDK-8302161 Upgrade jQuery UI to version 1.13.2

tools/javap

Fix Versions Bug Synopsis
8 9 10 11 12 13 14 15 16 17 18 19 20 21 22 23
JDK-8216261 Javap ignores default modifier on interfaces

tools/jconsole

Fix Versions Bug Synopsis
8 9 10 11 12 13 14 15 16 17 18 19 20 21 22 23
JDK-8260690 JConsole User Guide Link from the Help menu is not accessible by keyboard

tools/jlink

Fix Versions Bug Synopsis
8 9 10 11 12 13 14 15 16 17 18 19 20 21 22 23
JDK-8261829 Exclude tools/jlink/JLinkReproducibleTest.java in 11u

tools/jshell

Fix Versions Bug Synopsis
8 9 10 11 12 13 14 15 16 17 18 19 20 21 22 23
JDK-8236505 Mark jdk/editpad/EditPadTest.java as @headful
JDK-8286398 Address possibly lossy conversions in jdk.internal.le

tools/launcher

Fix Versions Bug Synopsis
8 9 10 11 12 13 14 15 16 17 18 19 20 21 22 23
JDK-8241638 launcher time metrics always report 1 on Linux when _JAVA_LAUNCHER_DEBUG set
JDK-8247592 refactor test/jdk/tools/launcher/Test7029048.java
JDK-8305950 Have -XshowSettings option display tzdata version

xml

Fix Versions Bug Synopsis
8 9 10 11 12 13 14 15 16 17 18 19 20 21 22 23
JDK-8285097 Duplicate XML keys in XPATHErrorResources.java and XSLTErrorResources.java

xml/javax.xml.parsers

Fix Versions Bug Synopsis
8 9 10 11 12 13 14 15 16 17 18 19 20 21 22 23
JDK-8016914 CoreDocumentImpl.setXmlVersion NPE
JDK-8280373 Update Xalan serializer / SystemIDResolver to align with JDK-8270492

xml/javax.xml.transform

Fix Versions Bug Synopsis
8 9 10 11 12 13 14 15 16 17 18 19 20 21 22 23
JDK-8180901 Transformer.reset() resets the state only once

xml/javax.xml.xpath

Fix Versions Bug Synopsis
8 9 10 11 12 13 14 15 16 17 18 19 20 21 22 23
JDK-8289471 Issue in Initialization of keys in ErrorMsg.java and XPATHErrorResources.java

xml/jaxp

Fix Versions Bug Synopsis
8 9 10 11 12 13 14 15 16 17 18 19 20 21 22 23
JDK-8223658 Performance regression of XML.validation in 13-b19
</