LABEL REPORT: jdk11u-fix-request

This report shows bugs with the given label, along with their backporting status.

Report generated: Tue Feb 27 19:49:30 CET 2024

Minimal actionable level to display: NONE

client-libs

Fix Versions Bug Synopsis
8 9 10 11 12 13 14 15 16 17 18 19 20 21 22 23
JDK-8252825 Add automated test for fix done in JDK-8218479
JDK-8274029 Remove jtreg tag manual=yesno for java/awt/print/Dialog/DialogOrient.java
JDK-8233986 ProblemList javax/swing/plaf/basic/BasicTextUI/8001470/bug8001470.java for windows-x64
JDK-8270312 Error: Not a test or directory containing tests: java/awt/print/PrinterJob/XparColor.java
JDK-8273685 Remove jtreg tag manual=yesno for java/awt/Graphics/LCDTextAndGraphicsState.java & show test instruction
JDK-8275234 java/awt/GraphicsDevice/DisplayModes/CycleDMImage.java is entered twice in ProblemList
JDK-8278456 Define jtreg jdk_desktop test group time-based sub-tasks for use by headful testing.
JDK-8284535 Fix PrintLatinCJKTest.java test that is failing with Parse Exception
JDK-8285867 Convert applet manual tests SelectionVisible.java to Frame and automate
JDK-8300405 Screen capture for test JFileChooserSetLocationTest.java, failure case
JDK-8306135 Clean up and open source some AWT tests
JDK-8306280 Open source several choice AWT tests
JDK-8306575 Clean up and open source four Dialog related tests
JDK-8294158 HTML formatting for PassFailJFrame instructions
JDK-8282046 Create a regression test for JDK-8000326
JDK-8282640 Create a test for JDK-4740761
JDK-8208996 X11 icon window color handing bug
JDK-8298887 On the latest macOS+XCode the Robot API may report wrong colors
JDK-8233696 [TESTBUG]Some jtreg tests fail when CAPS_LOCK is ON
JDK-8294156 Allow PassFailJFrame.Builder to create test UI
JDK-8210776 Upgrade XWD to 1.0.7
JDK-8210782 Upgrade HarfBuzz to 2.3.1
JDK-8214579 JFrame does not paint content in XVFB / X11vnc environment
JDK-8266545 8261169 broke Harfbuzz build with gcc 7 and 8
JDK-8217676 Upgrade libpng to 1.6.37
JDK-8208702 javax/swing/reliability/HangDuringStaticInitialization.java may hang on macos
JDK-8213614 DnD operation change feature does not work with 64bit big endian CPU
JDK-8214002 Cannot use italic font style if the font has embedded bitmap
JDK-8215364 JavaFX crashes on Ubuntu 18.04 with Wayland while using Swing-FX interop
JDK-8214252 Expanded & Collapsed nodes of a JTree look the same on GTK3
JDK-8213110 Remove the use of applets in automatic tests
JDK-8235638 NPE in LWWindowPeer.getOnscreenGraphics()
JDK-8233827 Enable screenshots in the enhanced failure handler on Linux/macOS
JDK-8259343 [macOS] Update JNI error handling in Cocoa code.
JDK-8259651 [macOS] Replace JNF_COCOA_ENTER/EXIT macros
JDK-8259869 [macOS] Remove desktop module dependencies on JNF Reference APIs
JDK-8260616 Removing remaining JNF dependencies in the java.desktop module
JDK-8213130 Update ProblemList after verification of jtreg tests in Win 7
JDK-8211822 Some tests fail after JDK-8210039
JDK-8198624 java/awt/KeyboardFocusmanager/TypeAhead/SubMenuShowTest/SubMenuShowTest.html fails on mac
JDK-8224705 Tests that need to be problem-listed or have printer resources
JDK-8232225 Rework the fix for JDK-8071483
JDK-8231991 Mouse wheel change focus on awt/swing windows
JDK-8233910 java/awt/ColorClass/AlphaColorTest.java is failing intermittently in nightly lnux-x64 system
JDK-8234385 [TESTBUG] java/awt/EventQueue/6980209/bug6980209.java fails in linux nightly
JDK-8234149 [TESTBUG]Several swing regression tests do not dispose Frame at end
JDK-8234802 [TESTBUG] Test Right Mouse Button Drag Gesture Recognition in all the platforms
JDK-8238721 Add failing client jtreg tests to the Problem List
JDK-8244292 Headful clients failing with --illegal-access=deny
JDK-8239827 The test OpenByUNCPathNameTest.java should be changed to be manual
JDK-8198623 java/awt/KeyboardFocusmanager/TypeAhead/EnqueueWithDialogButtonTest/EnqueueWithDialogButtonTest.java fails on mac
JDK-8197560 test javax/swing/JTree/8003400/Test8003400.java fails
JDK-8249142 java/awt/FontClass/CreateFont/DeleteFont.sh is unstable
JDK-8252194 Add automated test for fix done in JDK-8218469
JDK-8255365 Problem list failing client manual tests
JDK-8256888 Client manual test problem list update
JDK-8263846 Bad JNI lookup getFocusOwner in accessibility code on macOS
JDK-8233565 [TESTBUG] NullModalityDialogTest.java fails on MacOS
JDK-8197811 Test java/awt/Choice/PopupPosTest/PopupPosTest.java fails on Windows
JDK-8197800 Test java/awt/Focus/NonFocusableWindowTest/NoEventsTest.java fails on Windows
JDK-8198617 java/awt/Focus/6382144/EndlessLoopTest.java fails on mac
JDK-8198616 java/awt/Focus/6378278/InputVerifierTest.java fails on mac
JDK-8269529 javax/swing/reliability/HangDuringStaticInitialization.java fails in Windows debug build
JDK-8272123 Problem list 4 jtreg tests which regularly fail on macos-aarch64
JDK-8272332 --with-harfbuzz=system doesn't add -lharfbuzz after JDK-8255790
JDK-8273671 Backport of 8260616 misses one JNF header inclusion removal
JDK-8274296 Update or Problem List tests which may fail with uiScale=2 on macOS
JDK-8274032 Remove jtreg tag manual=yesno for java/awt/print/PrinterJob/ImagePrinting/ImageTypes.java & show test UI
JDK-8270331 [TESTBUG] Error: Not a test or directory containing tests: java/awt/print/PrinterJob/InitToBlack.java
JDK-8283614 [11] Repair compiler versions handling after backport of 8233787
JDK-8283803 Remove jtreg tag manual=yesno for java/awt/print/PrinterJob/PrintGlyphVectorTest.java and fix test
JDK-8285617 Fix java/awt/print/PrinterJob/ImagePrinting/PrintARGBImage.java manual test
JDK-8285612 Remove jtreg tag manual=yesno for java/awt/print/PrinterJob/ImagePrinting/ClippedImages.java
JDK-8285687 Remove jtreg tag manual=yesno for java/awt/print/PrinterJob/PageRangesDlgTest.java
JDK-8296083 javax/swing/JTree/6263446/bug6263446.java fails intermittently on a VM
JDK-8296084 javax/swing/JSpinner/4788637/bug4788637.java fails intermittently on a VM
JDK-8298905 Test "java/awt/print/PrinterJob/ImagePrinting/PrintARGBImage.java" fails because the frames of instruction does not display
JDK-8306765 Some client related jtreg problem list entries are malformed
JDK-8307569 Build with gcc8 is broken after JDK-8307301

client-libs/2d

Fix Versions Bug Synopsis
8 9 10 11 12 13 14 15 16 17 18 19 20 21 22 23
JDK-8265761 Font with missed font family name is not properly printed on Windows
JDK-8225007 java/awt/print/PrinterJob/LandscapeStackOverflow.java may hang
JDK-8220074 Clean up GCC 8.3 errors in LittleCMS
JDK-8274456 Remove jtreg tag manual=yesno java/awt/print/PrinterJob/PageDialogTest.java
JDK-8298974 Add ftcolor.c to imported freetype sources
JDK-8316710 Exclude java/awt/font/Rotate/RotatedTextTest.java
JDK-8273358 macOS Monterey does not have the font Times needed by Serif
JDK-8232634 Problem List ICMColorDataTest.java
JDK-8244088 [Regression] Switch of Gnome theme ends up in deadlocked UI
JDK-8262392 Update Mesa 3-D Headers to version 21.0.3
JDK-8297088 Update LCMS to 2.14
JDK-8303482 Update LCMS to 2.15
JDK-8318951 Additional negative value check in JPEG decoding
JDK-8280964 [Linux aarch64] : drawImage dithers TYPE_BYTE_INDEXED images incorrectly
JDK-8275303 sun/java2d/pipe/InterpolationQualityTest.java fails with D3D basic render driver
JDK-8223558 Java does not render Myanmar script correctly
JDK-8231556 Wrong font ligatures used when 2 versions of same font used
JDK-8242557 Add length limit for strings in PNGImageWriter
JDK-7179006 [macosx] Print-to-file doesn't work: printing to the default printer instead
JDK-8264666 Change implementation of safeAdd/safeMult in the LCMSImageLayout class
JDK-8022403 sun/java2d/DirectX/OnScreenRenderingResizeTest/OnScreenRenderingResizeTest.java fails
JDK-8297153 sun/java2d/DirectX/OnScreenRenderingResizeTest/OnScreenRenderingResizeTest.java fails again
JDK-8223869 Problem list java/awt/FontMetrics/MaxAdvanceIsMax.java on more platforms
JDK-8175984 ICC_Profile has un-needed, not-empty finalize method
JDK-8171303 sun/java2d/pipe/InterpolationQualityTest.java fails on Windows & Linux
JDK-8181571 printing to CUPS fails on mac sandbox app
JDK-8311033 [macos] PrinterJob does not take into account Sides attribute
JDK-8231243 [TESTBUG] CustomFont.java cannot find font file
JDK-8212040 Compilation error due to wrong usage of NSPrintJobDispositionValue in mac10.12
JDK-8216965 crash in freetypeScaler.c CopyBW2Grey8
JDK-8218020 Fix version number in mesa.md 3rd party legal file
JDK-8222362 Upgrade to Freetype 2.10.0
JDK-8224474 harfbuzz 2.3.1 code fails to compile with gcc 4.4.7
JDK-8229800 WindowsServerCore 1809 does not provide d2d1.dll library required by awt.dll
JDK-8227662 freetype seeks to index at the end of the font data
JDK-8232154 Update Mesa 3-D Headers to version 19.2.1
JDK-8233097 Fontmetrics for large Fonts has zero width
JDK-8244818 [macos] Java2D Queue Flusher crash while moving application window to external monitor
JDK-8250605 Linux x86_32 builds fail after JDK-8249821
JDK-8201818 [macosx] Printing attributes break page size set via "java.awt.print.Book" object
JDK-8210384 SunLayoutEngine.isAAT() font is expensive on MacOS
JDK-7017058 Malayalam glyph substitution is failing for Malayalam with Windows Kartika font.
JDK-8210335 Clipping problems with complex affine transforms: negative scaling factors or small scaling factors
JDK-8211055 Provide print to a file (PDF) feature even when printer was not connected
JDK-8212071 Need to set the FreeType LCD Filter to reduce fringing.
JDK-8217263 Automate DashOffset test
JDK-8218682 [TEST_BUG] DashOffset fails in mach5
JDK-8212202 [Windows] Exception if no printers are installed.
JDK-8221304 Problem list java/awt/FontMetrics/MaxAdvanceIsMax.java
JDK-8217707 JNICALL declaration breaks Splash screen functions
JDK-8221411 NullPointerException in RasterPrinterJob without PrinterResolution
JDK-8221412 lookupPrintServices() does not always update the list of Windows remote printers
JDK-8221263 [TEST_BUG] RemotePrinterStatusRefresh test is hard to use
JDK-8208179 Devanagari not shown with logical fonts on Windows after removal of Lucida Sans from JDK
JDK-8217731 Font rendering and glyph spacing changed from jdk-8 to jdk-11
JDK-8224825 java/awt/Color/AlphaColorTest.java fails in linux-x64 system
JDK-8228711 Path rendered incorrectly when it goes outside the clipping region
JDK-8222108 Reduce minRefreshTime for updating remote printer list on Windows
JDK-8146238 [macosx] Java2D Queue Flusher crash on OSX after switching between user accounts
JDK-8230728 Thin stroked shapes are not rendered if affine transform has flip bit
JDK-8230769 BufImg_SetupICM add ReleasePrimitiveArrayCritical call in early return
JDK-8231693 Backout "8230728: Thin stroked shapes are not rendered if affine transform has flip bit" from jdk11u
JDK-8232381 add result NULL-checking to freetypeScaler.c
JDK-8234323 NULL-check return value of SurfaceData_InitOps on macosx
JDK-8214481 freetype path does not disable TrueType hinting with AA+FM hints
JDK-8209113 Use WeakReference for lastFontStrike for created Fonts
JDK-8234398 Replace ID2D1Factory::GetDesktopDpi with GetDeviceCaps
JDK-8224109 Text spaced incorrectly by drawString under rotation with fractional metrics
JDK-8221741 ClassCastException can happen when fontconfig.properties is used
JDK-8238942 Rendering artifacts with LCD text and fractional metrics
JDK-8220150 [macos] macos10.14 Mojave returns anti-aliased glyphs instead of aliased B&W glyphs
JDK-8221305 java/awt/FontMetrics/MaxAdvanceIsMax.java fails on MacOS + Solaris
JDK-8244621 [macos10.15] Garbled FX printing plus CoreText warnings on Catalina when building with Xcode 11
JDK-8247867 Upgrade to freetype 2.10.2
JDK-8245400 Upgrade to LittleCMS 2.11
JDK-6847157 java.lang.NullPointerException: HDC for component at sun.java2d.loops.Blit.Blit
JDK-8256557 libharfbuzz fails to link on gcc 4.4.x due to -Wl,-z,defs
JDK-8256264 Printed GlyphVector outline with low DPI has bad quality on Windows
JDK-8259232 Bad JNI lookup during printing
JDK-8260380 Upgrade to LittleCMS 2.12
JDK-8261170 Upgrade to FreeType 2.10.4
JDK-8262829 Native crash in Win32PrintServiceLookup.getAllPrinterNames()
JDK-8263311 Watch registry changes for remote printers update instead of polling
JDK-8262470 Printed GlyphVector outline with low DPI has bad quality on Windows
JDK-8264047 Duplicate global variable 'jvm' in libjavajpeg and libawt
JDK-8261169 Upgrade HarfBuzz to 2.8.0
JDK-8256372 [macos] Unexpected symbol was displayed on JTextField with Monospaced font
JDK-8262731 [macOS] Exception from "Printable.print" is swallowed during "PrinterJob.print"
JDK-8272342 [TEST_BUG] java/awt/print/PrinterJob/PageDialogMarginTest.java catches all exceptions
JDK-8270874 JFrame paint artifacts when dragged from standard monitor to HiDPI monitor
JDK-8280786 Build failure on Solaris after 8262392
JDK-8282588 [11] set harfbuzz compilation flag to -std=c++11
JDK-8240756 [macos] SwingSet2:TableDemo:Printed Japanese characters were garbled
JDK-8283217 Leak FcObjectSet in getFontConfigLocations() in fontpath.c
JDK-8285686 Update FreeType to 2.12.0
JDK-8285399 JNI exception pending in awt_GraphicsEnv.c:1432
JDK-8289853 Update HarfBuzz to 4.4.1
JDK-8290334 Update FreeType to 2.12.1
JDK-8293672 Update freetype md file
JDK-8301998 Update HarfBuzz to 7.0.1
JDK-8307301 Update HarfBuzz to 7.2.0
JDK-8307603 [AIX] Broken build after JDK-8307301
JDK-8307604 gcc12 based Alpine build broken build after JDK-8307301
JDK-8306881 Update FreeType to 2.13.0
JDK-8313643 Update HarfBuzz to 8.2.2
JDK-8316028 Update FreeType to 2.13.2
JDK-8259007 This test printed a blank page
JDK-8295429 Update harfbuzz md file
JDK-8213568 Typo in java/awt/GraphicsEnvironment/LoadLock/GE_init5.java
JDK-8139178 Wrong fontMetrics when printing in Landscape (OpenJDK)
JDK-8215130 Fix errors in LittleCMS 2.9 reported by GCC 8
JDK-8198411 [TEST_BUG] Two java2d tests are unstable in mach5
JDK-8218854 FontMetrics.getMaxAdvance may be less than the maximum FontMetrics.charWidth
JDK-8220231 Cache HarfBuzz face object for same font's text layout calls
JDK-6933331 (d3d/ogl) java.lang.IllegalStateException: Buffers have not been created
JDK-8224778 test/jdk/demo/jfc/J2Ddemo/J2DdemoTest.java cannot find J2Ddemo.jar
JDK-8233202 exclude javax/swing/plaf/basic/BasicGraphicsUtils/8132119/bug8132119.java
JDK-8210058 Algorithmic Italic font leans opposite angle in Printing
JDK-8232226 [macos 10.15] test/jdk/java/awt/color/EqualityTest/EqualityTest.java may fail
JDK-8235904 Infinite loop when rendering huge lines
JDK-8236996 Incorrect Roboto font rendering on Windows with subpixel antialiasing
JDK-8239091 Reversed arguments in call to strstr in freetype "debug" code.
JDK-8223935 PIT: java/awt/font/WindowsIndicFonts.java fails on windows10
JDK-8241829 Cleanup the code for PrinterJob on windows
JDK-8196181 sun/java2d/GdiRendering/InsetClipping.java fails
JDK-8244520 problemlist java/awt/font/Rotate/RotatedFontTest.java on linux
JDK-6949753 [TEST BUG]: java/awt/print/PageFormat/PDialogTest.java needs update by removing a infinite loop
JDK-8199529 javax/swing/text/Utilities/8142966/SwingFontMetricsTest.java fails on windows
JDK-8249821 Separate libharfbuzz from libfontmanager
JDK-8249215 JFrame::setVisible crashed with -Dfile.encoding=UTF-8 on Japanese Windows.
JDK-8250894 Provide a configure option to build and run against the platform libharfbuzz
JDK-8240487 Cleanup whitespace in .cc, .hh, .m, and .mm files
JDK-8251469 Better cleanup for test/jdk/javax/imageio/SetOutput.java
JDK-8248352 [TEST_BUG] Test test/jdk/java/awt/font/TextLayout/ArabicDiacriticTest.java can leave frame open
JDK-8234393 [macos] printing ignores printer tray
JDK-8255722 Create a new test for rotated blit
JDK-8255387 Japanese characters were printed upside down on AIX
JDK-8256321 Some "inactive" color profiles use the wrong profile class
JDK-8255710 Opensource unit/regression tests for CMM
JDK-8260432 allocateSpaceForGP in freetypeScaler.c might leak memory
JDK-6986863 ProfileDeferralMgr throwing ConcurrentModificationException
JDK-8198343 Test java/awt/print/PrinterJob/TestPgfmtSetMPA.java may fail w/o printer
JDK-8261107 ArrayIndexOutOfBoundsException in the ICC_Profile.getInstance(InputStream)
JDK-8255790 GTKL&F: Java 16 crashes on initialising GTKL&F on Manjaro Linux
JDK-8264923 PNGImageWriter.write_zTXt throws Exception with a typo
JDK-8263362 Avoid division by 0 in java/awt/font/TextJustifier.java justify
JDK-8270609 [TESTBUG] java/awt/print/Dialog/DialogCopies.java does not show instruction
JDK-8255724 [XRender] the BlitRotateClippedArea test fails on Linux in the XR pipeline
JDK-8192931 Regression test java/awt/font/TextLayout/CombiningPerf.java fails
JDK-8273704 DrawStringWithInfiniteXform.java failed : drawString with InfiniteXform transform takes long time
JDK-7001973 java/awt/Graphics2D/CopyAreaOOB.java fails
JDK-8280048 Missing comma in copyright header
JDK-8223543 [TESTBUG] Regression test java/awt/Graphics2D/DrawString/LCDTextSrcEa.java has issues
JDK-8284680 sun.font.FontConfigManager.getFontConfig() leaks charset
JDK-8286630 [11] avoid -std=c++11 CXX harfbuzz buildflag on Windows
JDK-8285397 JNI exception pending in CUPSfuncs.c:250
JDK-8287609 macOS: SIGSEGV at [CoreFoundation] CFArrayGetCount / sun.font.CFont.getTableBytesNative
JDK-8286624 Regression Test CoordinateTruncationBug.java fails on OL8.3
JDK-8282404 DrawStringWithInfiniteXform.java failed with "RuntimeException: drawString with InfiniteXform transform takes long time"
JDK-8285604 closed sun/java2d/GdiRendering/ClipShapeRendering.java failed with "Incorrect color ffeeeeee instead of ff0000ff in pixel (100, 100)"
JDK-8297147 UnexpectedSourceImageSize test times out on slow machines when fastdebug is used
JDK-6528710 sRGB-ColorSpace to sRGB-ColorSpace Conversion
JDK-8297681 Unnecessary color conversion during 4BYTE_ABGR_PRE to INT_ARGB_PRE blit
JDK-8298027 Remove SCCS id's from awt jtreg tests
JDK-8299255 Unexpected round errors in FreetypeFontScaler
JDK-8295737 macOS: Print content cut off when width > height with portrait orientation
JDK-8304295 harfbuzz build fails with GCC 7 after JDK-8301998
JDK-8304350 Font.getStringBounds calculates wrong width for TextAttribute.TRACKING other than 0.0
JDK-8313576 GCC 7 reports compiler warning in bundled freetype 2.13.0
JDK-8316206 Test StretchedFontTest.java fails for Baekmuk font
JDK-8324347 Enable "maybe-uninitialized" warning for FreeType 2.13.1
JDK-8318603 Parallelize sun/java2d/marlin/ClipShapeTest.java
JDK-8293767 AWT test TestSinhalaChar.java has old SCCS markings

client-libs/demo

Fix Versions Bug Synopsis
8 9 10 11 12 13 14 15 16 17 18 19 20 21 22 23
JDK-8251558 J2DBench should support shaped and translucent windows

client-libs/java.awt

Fix Versions Bug Synopsis
8 9 10 11 12 13 14 15 16 17 18 19 20 21 22 23
JDK-8216155 C4819 warning at libfreetype sources on Windows
JDK-8224821 java/awt/Focus/NoAutotransferToDisabledCompTest/NoAutotransferToDisabledCompTest.java fails linux-x64
JDK-8224830 test/jdk/java/awt/Focus/ModalExcludedWindowClickTest/ModalExcludedWindowClickTest.java fails on linux-x64
JDK-8257148 Remove obsolete code in AWTView.m
JDK-8282276 Problem list failing two Robot Screen Capture tests
JDK-8289238 Refactoring changes to PassFailJFrame Test Framework
JDK-8290469 Add new positioning options to PassFailJFrame test framework
JDK-8296934 Write a test to verify whether Undecorated Frame can be iconified or not
JDK-8289077 Add manual tests to open
JDK-8306718 Optimize and opensource some old AWT tests
JDK-8306072 Open source several AWT MouseInfo related tests
JDK-8306409 Open source AWT KeyBoardFocusManger, LightWeightComponent related tests
JDK-8306652 Open source AWT MenuItem related tests
JDK-8306683 Open source several clipboard and color AWT tests
JDK-8306752 Open source several container and component AWT tests
JDK-8306753 Open source several container AWT tests
JDK-8306640 Open source several AWT TextArea related tests
JDK-8307078 Opensource and clean up five more AWT Focus related tests
JDK-8306954 Open source five Focus related tests
JDK-8307128 Open source some drag and drop tests 4
JDK-8269984 [macos] JTabbedPane title looks like disabled
JDK-8311689 Wrong visible amount in Adjustable of ScrollPane
JDK-8214578 [macos] Problem with backslashes on macOS/JIS keyboard: Java ignores system settings
JDK-8204161 [TESTBUG] auto failed with the "Applet thread threw exception: java.lang.UnsupportedOperationException" exception
JDK-7185258 [macOS] Deadlock in SunToolKit.realSync()
JDK-8258805 Japanese characters not entered by mouse click on Windows 10
JDK-8284033 Leak XVisualInfo in getAllConfigs in awt_GraphicsEnv.c
JDK-8284023 java.sun.awt.X11GraphicsDevice.getDoubleBufferVisuals() leaks XdbeScreenVisualInfo
JDK-8144030 [macosx] test java/awt/Frame/ShapeNotSetSometimes/ShapeNotSetSometimes.java fails (again)
JDK-8274597 Some of the dnd tests time out and fail intermittently
JDK-8286481 Exception printed to stdout on Windows when storing transparent image in clipboard
JDK-6176679 Application freezes when copying an animated gif image to the system clipboard
JDK-8297923 java.awt.ScrollPane broken after multiple scroll up/down
JDK-8316030 Update Libpng to 1.6.40
JDK-8253682 The AppletInitialFocusTest1.java is unstable
JDK-8254850 Update terminology in java.awt.GridBagLayout source code comments
JDK-8039261 [TEST_BUG]: There is not a minimal security level in Java Preferences and the TestApplet.html is blocked.
JDK-8163086 java/awt/Window/TranslucentJAppletTest/TranslucentJAppletTest.java fails
JDK-8047218 [TEST_BUG] java/awt/FullScreen/AltTabCrashTest/AltTabCrashTest.java fails with exception
JDK-8266949 Check possibility to disable OperationTimedOut on Unix
JDK-8268620 InfiniteLoopException test may fail on x86 platforms
JDK-8233648 [TESTBUG] DefaultMenuBarTest.java failing on macos
JDK-6854300 [TEST_BUG] java/awt/event/MouseEvent/SpuriousExitEnter/SpuriousExitEnter_3.java fails in jdk6u14 & jdk7
JDK-8169468 NoResizeEventOnDMChangeTest.java fails because FS Window didn't receive all resizes!
JDK-8281569 Create tests for Frame.setMinimumSize() method
JDK-8286772 java/awt/dnd/DropTargetInInternalFrameTest/DropTargetInInternalFrameTest.html times out and fails in Windows
JDK-8265586 [windows] last button is not shown in AWT Frame with BorderLayout and MenuBar set.
JDK-8295774 Write a test to verify List sends ItemEvent/ActionEvent
JDK-8297489 Modify TextAreaTextEventTest.java as to verify the content change of TextComponent sends TextEvent
JDK-8297296 java/awt/Mouse/EnterExitEvents/DragWindowTest.java fails with "No MouseReleased event on label!"
JDK-8296275 Write a test to verify setAccelerator method of JMenuItem
JDK-8299296 Write a test to verify the components selection sends ItemEvent
JDK-8298921 Create a regression test for JDK-8139581
JDK-8318154 Improve stability of WheelModifier.java test
JDK-8169475 WheelModifier.java fails by timeout
JDK-8213292 Input freezes after MacOS key-selector (press&hold) usage on macOS Mojave
JDK-8176359 Frame#setMaximizedbounds not working properly in multi screen environments
JDK-8231564 setMaximizedBounds is broken with large display scale and multiple monitors
JDK-8221823 Requested JDialog width is ignored
JDK-8253791 Issue with useAppleColor check in CSystemColors.m
JDK-8030121 java/awt/dnd/MissingDragExitEventTest/MissingDragExitEventTest.java fails
JDK-8176556 java/awt/dnd/ImageTransferTest/ImageTransferTest.java fails for JFIF
JDK-8144125 [macos] java/awt/event/ComponentEvent/MovedResizedTwiceTest/MovedResizedTwiceTest.java failed automatically
JDK-8229515 [macos] access to window property of NSView on wrong thread
JDK-8233573 Toolkit.getScreenInsets(GraphicsConfiguration) may throw ClassCastException
JDK-8263530 sun.awt.X11.ListHelper.removeAll() should use clear()
JDK-8265678 Test java/awt/Focus/ActualFocusedWindowTest/ActualFocusedWindowBlockingTest.java fails intermittentently on windows
JDK-8159904 [TEST_BUG] Failure on solaris of java/awt/Window/MultiWindowApp/MultiWindowAppTest.java
JDK-8286663 Resolve IDE warnings in WTrayIconPeer and SystemTray
JDK-8297481 Create a regression test for JDK-4424517
JDK-8302525 Write a test to check various components send Events while mouse and key are used simultaneously
JDK-8168408 Test java/awt/Focus/ActualFocusedWindowTest/ActualFocusedWindowBlockingTest.java fails intermittentently on windows
JDK-8315726 Open source several AWT applet tests
JDK-8288332 Tier1 validate-source fails after 8279614
JDK-8213944 Fix AIX build after the removal of Xrandr.h and add a configure check for it
JDK-8213583 Error while opening the JFileChooser when desktop contains shortcuts pointing to deleted files
JDK-8220495 Update GIFlib library to the 5.1.8
JDK-8214046 [macosx] Undecorated Frame does not Iconify when set to
JDK-8227392 Colors with alpha are painted incorrectly on Linux, after JDK-8214579
JDK-8227919 8213232 causes crashes on solaris sparc64
JDK-8213119 [macos] java/awt/GraphicsDevice/CheckDisplayModes.java fails
JDK-8231336 Corrupted option dialog in JTHarness with JDK14b13
JDK-8234522 [macos] Crash with use of native file dialog
JDK-8242174 [macos] The NestedModelessDialogTest test make the macOS unstable
JDK-8242498 Invalid "sun.awt.TimedWindowEvent" object leads to JVM crash
JDK-8252715 Problem list java/awt/event/KeyEvent/KeyTyped/CtrlASCII.java on Linux
JDK-8248532 Every time I change keyboard language at my MacBook, Java crashes
JDK-8261231 Windows IME was disabled after DnD operation
JDK-8272602 [macOS] not all KEY_PRESSED events sent when control modifier is used
JDK-8295685 Update Libpng to 1.6.38
JDK-8130655 OS X: keyboard input in textfield is not possible if the window contained textfield is owned by EmbeddedFrame
JDK-8191178 [macos] Problem with input of yen symbol
JDK-8170937 Swing apps are slow if displaying from a remote source to many local displays
JDK-8210880 Remove HPKeysym.h from JDK sources
JDK-8210886 Remove references in xwindows.md to non-existent files.
JDK-8210863 Remove Xrandr include files from JDK sources
JDK-8211992 GraphicsConfiguration.getDevice().getDisplayMode() causes JVM crash on Mac
JDK-8207070 Webstart app popup on wrong screen in a one-screen setup changing to multi-monitor
JDK-8211435 Exception in thread "AWT-EventQueue-1" java.lang.IllegalArgumentException: null source
JDK-8204142 AWT hang occurs when sequenced events arrive out of sequence in multiple AppContexts.
JDK-8211301 [macos] support full window content options
JDK-8213983 [macosx] Keyboard shortcut “cmd +`” stops working properly if popup window is displayed
JDK-8215200 IllegalArgumentException in sun.lwawt.macosx.CPlatformWindow
JDK-8215756 Memory leaks in the AWT on macOS
JDK-8214765 All TrayIcon MessageType icons does not show up with gtk3 option set
JDK-8216318 The usage of Disposer in the java.awt.Robot can be deleted
JDK-8212677 X11 default visual support for IM status window on VNC
JDK-8207938 At step6,Click Add button,case failed automatically.
JDK-8212678 Windows IME related patch
JDK-8214109 XToolkit is not correctly displayed color on 16-bit high color setting
JDK-8220528 [AIX] Fix basic Xinerama and Xrender functionality
JDK-8215105 java/awt/Robot/HiDPIScreenCapture/ScreenCaptureTest.java: Wrong Pixel Color
JDK-8212676 AWT SystemColor setting on CDE
JDK-8213232 Unix/X11 setCompositionEnableNative issue
JDK-8211826 StringIndexOutOfBoundsException happens via GetStringUTFRegion()
JDK-8221246 NullPointerException within Win32ShellFolder2
JDK-8214469 [macos] PIT: java/awt/Choice/ChoiceKeyEventReaction/ChoiceKeyEventReaction.java fails
JDK-8225101 Crash at sun.awt.X11.XlibWrapper.XkbGetUpdatedMap when change keybord map
JDK-8230782 Robot.createScreenCapture() fails if “awt.robot.gtk” is set to false
JDK-8231445 check ZALLOC return values in awt coding
JDK-8229810 [macos] NullPointerException getting bounds of GraphicsConfiguration
JDK-8233657 Intermittent NPE in Component.validate()
JDK-8234107 Several AWT modal dialog tests failing on Linux after JDK-8231991
JDK-8230873 [AIX] GUI app does not work with UTF-8 locale on minimum software requirements
JDK-8234786 Fix for JDK-8214578 breaks OS X 10.12 compatibility
JDK-8231438 [macOS] Dark mode for the desktop is not supported
JDK-8235620 Broken merge between JDK-8006406 and JDK-8003559
JDK-8225126 Test SetBoundsPaintTest.html failed on Windows when desktop is scaled
JDK-8235153 [TESTBUG] [macos 10.15] java/awt/Graphics/DrawImageBG/SystemBgColorTest.java fails
JDK-8238936 The crash in XRobotPeer when the custom GraphicsDevice is used
JDK-8238575 DragSourceEvent.getLocation() returns wrong value on HiDPI screens (Windows)
JDK-8243925 Toolkit#getScreenInsets() returns wrong value on HiDPI screens (Windows)
JDK-8212226 SurfaceManager throws "Invalid Image variant" for MultiResolutionImage (Windows)
JDK-8232114 JVM crashed at imjpapi.dll in native code
JDK-8249183 JVM crash in "AwtFrame::WmSize" method
JDK-8225790 Two NestedDialogs tests fail on Ubuntu
JDK-8255681 Print callstack in error case in runAWTLoopWithApp
JDK-8211999 Window positioning bugs due to overlapping GraphicsDevice bounds (Windows/HiDPI)
JDK-8259585 [macOS] Bad JNI lookup error : Accessible actions do not work on macOS
JDK-8262461 handle wcstombsdmp return value correctly in unix awt_InputMethod.c
JDK-8262446 DragAndDrop hangs on Windows
JDK-8264786 [macOS] All Swing/AWT apps cause Allow Notifications prompt to appear when app is launched
JDK-8270216 [macOS] Update named used for Java run loop mode
JDK-8272806 [macOS] "Apple AWT Internal Exception" when input method is changed
JDK-8274751 Drag And Drop hangs on Windows
JDK-8274939 Incorrect size of the pixel storage is used by the robot on macOS
JDK-8193543 Regression automated test '/open/test/jdk/java/awt/TrayIcon/SystemTrayInstance/SystemTrayInstanceTest.java' fails
JDK-8255439 System Tray icons get corrupted when Windows scaling changes
JDK-8279614 The left line of the TitledBorder is not painted on 150 scale factor
JDK-8294254 [macOS] javax/swing/plaf/aqua/CustomComboBoxFocusTest.java failure
JDK-8296496 Overzealous check in sizecalc.h prevents large memory allocation
JDK-8252713 jtreg time out of CtrlASCII.java seems to hang the Xserver.
JDK-8296957 One more cast in SAFE_SIZE_NEW_ARRAY2
JDK-8305815 Update Libpng to 1.6.39
JDK-8307165 java/awt/dnd/NoFormatsDropTest/NoFormatsDropTest.java timed out
JDK-8310054 ScrollPane insets are incorrect
JDK-8313164 src/java.desktop/windows/native/libawt/windows/awt_Robot.cpp GetRGBPixels adjust releasing of resources
JDK-8209115 adjust libsplashscreen linux ppc64le builds for easier libpng update
JDK-8205479 OS X: requestFocus() does not work properly for embedded frame
JDK-8039082 [TEST_BUG] Test java/awt/dnd/BadSerializationTest/BadSerializationTest.java fails
JDK-8211218 remove double semicolon in src/java.desktop/macosx/classes/sun/font/CFont.java
JDK-8211810 X11 Time stamp data should be unsigned
JDK-8198001 java/awt/Menu/WrongParentAfterRemoveMenu/WrongParentAfterRemoveMenu.java debug assert on Windows
JDK-8213213 Remove src/java.desktop/unix/classes/sun/awt/X11/keysym2ucs.h
JDK-8198000 java/awt/List/EmptyListEventTest/EmptyListEventTest.java debug assert on Windows
JDK-6849922 java/awt/Choice/ChoiceKeyEventReaction/ChoiceKeyEventReaction.html fails
JDK-8211267 StackOverflowError happened by TextField.setFont(...)
JDK-8219504 Test for JDK-8211435 can be run on all platforms
JDK-8224152 [macOS] ProblemList tests that leave rubbish on the screen
JDK-8224632 testbug: java/awt/dnd/RemoveDropTargetCrashTest/RemoveDropTargetCrashTest.java fails on MacOS
JDK-8225105 java/awt/Focus/ShowFrameCheckForegroundTest/ShowFrameCheckForegroundTest.java fails in Windows 10
JDK-8225487 giflib legal file is missing attribution for openbsd-reallocarray.c.
JDK-8134672 [TEST_BUG] Some tests should check isDisplayChangeSupported
JDK-8230480 check malloc/calloc results in java.desktop
JDK-8230900 missing ReleaseStringUTFChars in java.desktop native code
JDK-8234184 [TESTBUG] java/awt/Mouse/EnterExitEvents/ModalDialogEnterExitEventsTest.java fails in Windows
JDK-8233707 systemScale.cpp could not compile with VS2019
JDK-8234332 [TESTBUG] java/awt/Focus/DisposedWindow/DisposeDialogNotActivateOwnerTest/DisposeDialogNotActivateOwnerTest.java fails on linux-x64 nightly
JDK-8234137 The "AutoTestOnTop.java" test may run external applications
JDK-8235739 Rare NPE at WComponentPeer.getGraphics()
JDK-8223108 Test java/awt/EventQueue/NonComponentSourcePost.java is unstable
JDK-8236545 Compilation error in mach5 java/awt/FileDialog/MacOSGoToFolderCrash.java
JDK-8237222 [macos] java/awt/Focus/UnaccessibleChoice/AccessibleChoiceTest.java fails
JDK-8240518 Incorrect JNU_ReleaseStringPlatformChars in Windows Print
JDK-8226806 [macOS 10.14] Methods of Java Robot should be called from appropriate thread
JDK-8240786 [TESTBUG] The test java/awt/Window/GetScreenLocation/GetScreenLocationTest.java fails on HiDPI screen
JDK-8241087 Build failure with VS 2019 (16.5.0) due to C2039 and C2873
JDK-8241797 Add some tests to the problem list
JDK-8241808 [TESTBUG] The JDK-8039467 bug appeared on macOS
JDK-8196019 java/awt/Window/Grab/GrabTest.java fails on Windows
JDK-8239819 XToolkit: Misread of screen information memory
JDK-8233566 [TESTBUG] KeyboardFocusManager tests failing on MacoS
JDK-8245938 Remove unused print_stack(void) method from XToolkit.c
JDK-8252470 java/awt/dnd/DisposeFrameOnDragCrash/DisposeFrameOnDragTest.java fails on Windows
JDK-8198334 java/awt/FileDialog/8003399/bug8003399.java fails in headless mode
JDK-8252679 Two windows specific FileDIalog tests may fail on some Windows_Server_2016_Standard
JDK-8253274 The CycleDMImagetest brokes the system
JDK-8253739 java/awt/image/MultiResolutionImage/MultiResolutionImageObserverTest.java fails
JDK-8253269 The CheckCommonColors test should provide more info on failure
JDK-8253681 closed java/awt/dnd/MouseEventAfterStartDragTest/MouseEventAfterStartDragTest.html test failed
JDK-8256201 java/awt/FullScreen/FullscreenWindowProps/FullscreenWindowProps.java failed
JDK-8256373 [Windows/HiDPI] The Frame#setBounds does not work in a minimized state
JDK-8254024 Enhance native libs for AWT and Swing to work with GraalVM Native Image
JDK-8257853 Remove dependencies on JNF's JNI utility functions in AWT and 2D code
JDK-8225116 Test OwnedWindowsLeak.java intermittently fails
JDK-8260426 awt debug_mem.c DMem_AllocateBlock might leak memory
JDK-8257414 Drag n Drop target area is wrong on high DPI systems
JDK-8233567 [TESTBUG] FocusSubRequestTest.java fails on macos
JDK-8233564 [TESTBUG] MouseComboBoxTest.java is failing
JDK-8136517 [macosx]Test java/awt/Focus/8073453/AWTFocusTransitionTest.java fails on MacOSX
JDK-8198619 java/awt/Focus/FocusTraversalPolicy/ButtonGroupLayoutTraversal/ButtonGroupLayoutTraversalTest.java fails on mac
JDK-8272966 test/jdk/java/awt/Robot/FlushCurrentEvent.java fails by timeout
JDK-8275131 Exceptions after a touchpad gesture on macOS
JDK-8233558 [TESTBUG] WindowOwnedByEmbeddedFrameTest.java fails on macos
JDK-8275689 [TESTBUG] Use color tolerance only for XRender in BlitRotateClippedArea test
JDK-8233557 [TESTBUG] DoubleClickTitleBarTest.java fails on macOs
JDK-8079267 [TEST_BUG] Test java/awt/Frame/MiscUndecorated/RepaintTest.java fails
JDK-8225122 Test AncestorResized.java fails when Windows desktop is scaled.
JDK-8202836 [macosx] test java/awt/Graphics/TextAAHintsTest.java fails
JDK-8249592 Robot.mouseMove moves cursor to incorrect location when display scale varies and Java runs in DPI Unaware mode
JDK-8159694 HiDPI, Unity, java/awt/dnd/DropTargetEnterExitTest/MissedDragExitTest.java
JDK-8159599 [TEST_BUG] java/awt/Modal/ModalInternalFrameTest/ModalInternalFrameTest.java
JDK-8129827 [TEST_BUG] Test java/awt/Robot/RobotWheelTest/RobotWheelTest.java fails
JDK-8202790 DnD test DisposeFrameOnDragTest.java does not clean up
JDK-8222323 ChildAlwaysOnTopTest.java fails with "RuntimeException: Failed to unset alwaysOnTop"
JDK-8284956 Potential leak awtImageData/color_data when initializes X11GraphicsEnvironment
JDK-6829250 Reg test: java/awt/Toolkit/ScreenInsetsTest/ScreenInsetsTest.java fails in Windows
JDK-8286872 Refactor add/modify notification icon (TrayIcon)
JDK-8213531 Test javax/swing/border/TestTitledBorderLeak.java fails
JDK-8288928 Incorrect GPL header in pnglibconf.h (backport of JDK-8185041)
JDK-8169187 [macosx] Aqua: java/awt/image/multiresolution/MultiresolutionIconTest.java
JDK-8292866 Java_sun_awt_shell_Win32ShellFolder2_getLinkLocation check MultiByteToWideChar return value for failures
JDK-8288325 [windows] Actual and Preferred Size of AWT Non-resizable frame are different
JDK-8295554 Move the "sizecalc.h" to the correct location
JDK-8296632 Write a test to verify the content change of TextArea sends TextEvent
JDK-8239801 [macos] java/awt/Focus/UnaccessibleChoice/AccessibleChoiceTest.java fails
JDK-8297523 Various GetPrimitiveArrayCritical miss result - NULL check
JDK-8271519 java/awt/event/SequencedEvent/MultipleContextsFunctionalTest.java failed with "Total [200] - Expected [400]"
JDK-8298093 improve cleanup and error handling of awt_parseColorModel in awt_parseImage.c
JDK-8202931 [macos] java/awt/Choice/ChoicePopupLocation/ChoicePopupLocation.java fails
JDK-8288415 java/awt/PopupMenu/PopupMenuLocation.java is unstable in MacOS machines
JDK-8300727 java/awt/List/ListGarbageCollectionTest/AwtListGarbageCollectionTest.java failed with "List wasn't garbage collected"
JDK-8304054 Linux: NullPointerException from FontConfiguration.getVersion in case no fonts are installed
JDK-8306134 Open source some AWT tests relating to Button and a few other classes
JDK-8306372 Open source AWT CardLayout and Checkbox tests
JDK-8306430 Open source some AWT tests related to TextComponent and Toolkit
JDK-8306076 Open source AWT misc tests
JDK-8306484 Open source several AWT Choice jtreg tests
JDK-8306682 Open source a few more AWT Choice tests
JDK-8306133 Open source few AWT Drag & Drop related tests
JDK-8306681 Open source more AWT DnD related tests
JDK-8307079 Update test java/awt/Choice/DragOffNoSelect.java
JDK-8306871 Open source more AWT Drag & Drop tests
JDK-8306638 Open source some AWT tests related to datatransfer and Toolkit
JDK-8307299 Move more DnD tests to open
JDK-8306137 Open source several AWT ScrollPane related tests
JDK-8306812 Open source several AWT Miscellaneous tests
JDK-8313252 Java_sun_awt_windows_ThemeReader_paintBackground release resources in early returns
JDK-8314086 [11u] A typo in the fix for JDK-8312462 is causing test failure in ChildAlwaysOnTopTest.java
JDK-8316947 Write a test to check textArea triggers MouseEntered/MouseExited events properly
JDK-8318955 Add ReleaseIntArrayElements in Java_sun_awt_X11_XlibWrapper_SetBitmapShape XlbWrapper.c to early return
JDK-8288993 Make AwtFramePackTest generic by removing @requires tag

client-libs/java.awt:i18n

Fix Versions Bug Synopsis
8 9 10 11 12 13 14 15 16 17 18 19 20 21 22 23
JDK-8278472 Invalid value set to CANDIDATEFORM structure
JDK-8225182 JNI exception pending in DestroyXIMCallback of awt_InputMethod.c:1327
JDK-8211393 Memory leak issue on awt_InputMethod.c
JDK-8282422 JTable.print() failed with UnsupportedCharsetException on AIX ko_KR locale
JDK-8213183 InputMethod cannot be used after its restarting
JDK-8263490 [macos] Crash occurs on JPasswordField with activated InputMethod

client-libs/java.beans

Fix Versions Bug Synopsis
8 9 10 11 12 13 14 15 16 17 18 19 20 21 22 23
JDK-8231454 File lock in Windows on a loaded jar due to a leak in Introspector::getBeanInfo
JDK-8221244 Unexpected behavior of PropertyDescription.getReadMethod for boolean properties
JDK-8211147 Incorrect comparator com.sun.beans.introspect.MethodInfo.MethodOrder
JDK-8216046 test/jdk/java/beans/PropertyEditor/Test6397609.java failing
JDK-8222799 java.beans.Introspector uses an obsolete methods cache

client-libs/javax.accessibility

Fix Versions Bug Synopsis
8 9 10 11 12 13 14 15 16 17 18 19 20 21 22 23
JDK-8133713 [macosx] Accessible JTables always reported as empty
JDK-7124293 [macosx] VoiceOver reads percentages rather than the actual values for sliders.
JDK-7124301 [macosx] When in a tab group if you arrow between tabs there are no VoiceOver announcements.
JDK-8277922 Unable to click JCheckBox in JTable through Java Access Bridge
JDK-8283087 Create a test or JDK-4715503
JDK-8283015 Create a test for JDK-4715496
JDK-8283245 Create a test for JDK-4670319
JDK-8282933 Create a test for JDK-4529616
JDK-8284077 Create an automated test for JDK-4170173
JDK-8285693 Create an automated test for JDK-4702199
JDK-8282778 Create a regression test for JDK-4699544
JDK-8282857 Create a regression test for JDK-4702690
JDK-8285305 Create an automated test for JDK-4495286
JDK-8285373 Create an automated test for JDK-4702233
JDK-8282777 Create a Regression test for JDK-4515031
JDK-8284524 Create an automated test for JDK-4422362
JDK-8284767 Create an automated test for JDK-4422535
JDK-8268775 Password is being converted to String in AccessibleJPasswordField
JDK-8249278 Revert JDK-8226253 which breaks the spec of AccessibleState.SHOWING for JList
JDK-8274381 missing CAccessibility definitions in JNI code
JDK-8287826 javax/accessibility/4702233/AccessiblePropertiesTest.java fails to compile
JDK-8196681 Java Access Bridge logging and debug flags dynamically controlled
JDK-8190361 Incorrect version info in jaccessinspector.exe and jaccesswalker.exe
JDK-8219914 Change the environment variable for Java Access Bridge logging to have a directory
JDK-8226253 JAWS reports wrong number of radio buttons when buttons are hidden
JDK-8249588 libwindowsaccessbridge issues on 64bit Windows
JDK-8249548 backward focus traversal gets stuck in button group
JDK-8259729 Missed JNFInstanceOf -> IsInstanceOf conversion
JDK-8261198 [macOS] Incorrect JNI parameters in number conversion in A11Y code
JDK-8263420 Incorrect function name in NSAccessibilityStaticText native peer implementation
JDK-8261352 Create implementation for component peer for all the components who should be ignored in a11y interactions
JDK-8274056 JavaAccessibilityUtilities leaks JNI objects
JDK-8274326 [macos] Ensure initialisation of sun/lwawt/macosx/CAccessibility in JavaComponentAccessibility.m
JDK-8277497 Last column cell in the JTable row is read as empty cell
JDK-8284690 [macos] VoiceOver : Getting java.lang.IllegalArgumentException: Invalid location on Editable JComboBox
JDK-7106851 Test should not use System.exit
JDK-8225805 Java Access Bridge does not close the logger
JDK-8263136 C4530 was reported from VS 2019 at access bridge

client-libs/javax.imageio

Fix Versions Bug Synopsis
8 9 10 11 12 13 14 15 16 17 18 19 20 21 22 23
JDK-8302151 BMPImageReader throws an exception reading BMP images
JDK-6532025 GIF reader throws misleading exception with truncated images
JDK-8274735 javax.imageio.IIOException: Unsupported Image Type while processing a valid JPEG image
JDK-8195841 PNGImageReader.readNullTerminatedString() doesnt check for non-null terminated strings with length equal to maxLen
JDK-8212116 IIOException "tEXt chunk length is not proper" on opening png file
JDK-8211795 ArrayIndexOutOfBoundsException in PNGImageReader after JDK-6788458
JDK-8238842 AIOOBE in GIFImageReader.initializeStringTable
JDK-8270893 IndexOutOfBoundsException while reading large TIFF file
JDK-8250755 Better cleanup for jdk/test/javax/imageio/plugins/shared/CanWriteSequence.java
JDK-8255937 Better cleanup for test/jdk/javax/imageio/stream/StreamFlush.java
JDK-8266174 -Wmisleading-indentation happens in libmlib_image sources
JDK-8266171 -Warray-bounds happens in imageioJPEG.c
JDK-7131823 bug in GIFImageReader
JDK-8297480 GetPrimitiveArrayCritical in imageioJPEG misses result - NULL check

client-libs/javax.sound

Fix Versions Bug Synopsis
8 9 10 11 12 13 14 15 16 17 18 19 20 21 22 23
JDK-7188098 TEST_BUG: closed/javax/sound/midi/Synthesizer/Receiver/bug6186488.java fails
JDK-8266421 Deadlock in Sound System
JDK-8301846 Invalid TargetDataLine after screen lock when using JFileChooser or COM library
JDK-8221445 FastSysexMessage constructor crashes MIDI receiption thread
JDK-8178698 javax/sound/midi/Sequencer/MetaCallback.java failed with timeout
JDK-8207150 Clip.isRunning() may return true after Clip.stop() was called
JDK-8221885 Add intermittent test in the JavaSound to the ProblemList
JDK-8237495 Java MIDI fails with a dereferenced memory error when asked to send a raw 0xF7
JDK-8269091 javax/sound/sampled/Clip/SetPositionHang.java failed with ArrayIndexOutOfBoundsException: Array index out of range: -4
JDK-8312535 MidiSystem.getSoundbank() throws unexpected SecurityException
JDK-8301310 The SendRawSysexMessage test may cause a JVM crash
JDK-8211962 Implicit narrowing in MacOSX java.desktop jsound
JDK-8238738 AudioSystem.getMixerInfo() takes about 30 sec to report a gone audio device
JDK-8238567 SoftMainMixer.processAudioBuffers(): Wrong handling of stoppedMixers
JDK-8265486 ProblemList javax/sound/midi/Sequencer/Recording.java on macosx-aarch64
JDK-8266248 Compilation failure in PLATFORM_API_MacOSX_MidiUtils.c with Xcode 12.5
JDK-8275170 Some jtreg sound tests should be marked with sound keyword

client-libs/javax.swing

Fix Versions Bug Synopsis
8 9 10 11 12 13 14 15 16 17 18 19 20 21 22 23
JDK-8209418 Synchronize test/jdk/sanity/client/lib/jemmy with code-tools/jemmy/v2
JDK-8209789 Synchronize test/jdk/sanity/client/lib/jemmy with code-tools/jemmy/v2
JDK-8209494 Create a test for SwingSet3 InternalFrameDemo
JDK-8209993 Create a test for SwingSet3 ToolTipDemo
JDK-8210052 Enable testing for all the available look and feels in SwingSet3 demo tests
JDK-8210994 Create test for SwingSet3 FrameDemo
JDK-8210910 Create test for FileChooserDemo
JDK-8210055 Enable different look and feel tests in SwingSet3 demo tests
JDK-8209499 Create test for SwingSet3 EditorPaneDemo
JDK-8210057 Enable different look and feels in SwingSet3 demo test InternalFrameDemoTest
JDK-8214471 Enable different look and feel tests in SwingSet3 demo test ToolTipDemoTest
JDK-8251166 Add automated testcases for changes done in JDK-8214112
JDK-8251252 Add automated testcase for fix done in JDK-8214253
JDK-8251254 Add automated test for fix done in JDK-8218472
JDK-8254976 Re-enable swing jtreg tests which were broken due to samevm mode
JDK-8253820 Save test images and dumps with timestamps from client sanity suite
JDK-8209343 Test javax/swing/border/TestTitledBorderLeak.java should be marked as headful
JDK-8216353 Use utility APIs introduced in org/netbeans/jemmy/util/LookAndFeel class in client sanity test cases
JDK-8258554 javax/swing/JTable/4235420/bug4235420.java fails in GTK L&F
JDK-8260035 Deproblemlist few problemlisted test
JDK-8281745 Create a regression test for JDK-4514331
JDK-8282343 Create a regression test for JDK-4518432
JDK-8282548 Create a regression test for JDK-4330998
JDK-8286620 Create regression test for verifying setMargin() of JRadioButton
JDK-8225012 sanity/client/SwingSet/src/ToolTipDemoTest.java fails on Windows
JDK-8285635 javax/swing/JRootPane/DefaultButtonTest.java failed with Default Button not pressed for L&F: com.sun.java.swing.plaf.motif.MotifLookAndFeel
JDK-8306755 Open source few Swing JComponent and AbstractButton tests
JDK-8307381 Open Source JFrame, JIF related Swing Tests
JDK-8306996 Open source Swing MenuItem related tests
JDK-8307311 Timeouts on one macOS 12.6.1 host of two Swing JTableHeader tests
JDK-8315602 Open source swing security manager test
JDK-8315611 Open source swing text/html and tree test
JDK-8212903 [TestBug] Tests test/jdk/javax/swing/LookAndFeel/8145547/DemandGTK2.sh and DemandGTK3.sh fail on Ubuntu 18.04 LTS
JDK-8153090 TAB key cannot change input focus after the radio button in the Color Selection dialog
JDK-8239312 [macOS] javax/swing/JFrame/NSTexturedJFrame/NSTexturedJFrame.java
JDK-8015602 [macosx] Test javax/swing/SpringLayout/4726194/bug4726194.java fails on MacOSX
JDK-8258373 Update the text handling in the JPasswordField
JDK-8256126 Create implementation for NSAccessibilityImage protocol peer
JDK-8256110 Create implementation for NSAccessibilityStepper protocol
JDK-8256111 Create implementation for NSAccessibilityStaticText protocol
JDK-8263970 Manual test javax/swing/JTextField/JapaneseReadingAttributes/JapaneseReadingAttributes.java failed
JDK-8264299 Create implementation of native accessibility peer for ScrollPane and ScrollBar Java Accessibility roles
JDK-8239502 [TEST_BUG] Test javax/swing/text/FlowView/6318524/bug6318524.java never fails
JDK-8221903 PIT: javax/swing/RepaintManager/IconifyTest/IconifyTest.java fails on ubuntu18.04
JDK-8238985 [TESTBUG] The arrow image is blue instead of green
JDK-8169953 JComboBox/8057893: ComboBoxEdited event is not fired! on Windows
JDK-8169959 javax/swing/JTable/6263446/bug6263446.java: Table should be editing
JDK-8194126 Regression automated Test '/open/test/jdk/javax/swing/JColorChooser/Test7194184.java' fails
JDK-8169954 JFileChooser/8021253: java.lang.RuntimeException: Default button is not pressed
JDK-8196100 javax/swing/text/JTextComponent/5074573/bug5074573.java fails
JDK-8256187 [TEST_BUG] Automate bug4275046.java test
JDK-8258884 [TEST_BUG] Convert applet-based test open/test/jdk/javax/swing/JMenuItem/8031573/bug8031573.java to a regular java test
JDK-8264328 Broken license in javax/swing/JComboBox/8072767/bug8072767.java
JDK-4819544 SwingSet2 JTable Demo throws NullPointerException
JDK-8270116 Expand ButtonGroupLayoutTraversalTest.java to run in all LaFs, including Aqua on macOS
JDK-8273578 javax/swing/JMenu/4515762/bug4515762.java fails on macOS 12
JDK-8280913 Create a regression test for JRootPane.setDefaultButton() method
JDK-8280948 Write a regression test for JDK-4659800
JDK-8281296 Create a regression test for JDK-4515999
JDK-8281535 Create a regression test for JDK-4670051
JDK-8281988 Create a regression test for JDK-4618767
JDK-8281738 Create a regression test for checking the 'Space' key activation of focused Button
JDK-8282402 Create a regression test for JDK-4666101
JDK-8282234 Create a regression test for JDK-4532513
JDK-8282789 Create a regression test for the JTree usecase of JDK-4618767
JDK-8282937 Write a regression test for JDK-4820080
JDK-8282860 Write a regression test for JDK-4164779
JDK-8283493 Create an automated regression test for RFE 4231298
JDK-8282936 Write a regression test for JDK-4615365
JDK-8283623 Create an automated regression test for JDK-4525475
JDK-8283621 Write a regression test for CCC4400728
JDK-8284294 Create an automated regression test for RFE 4138746
JDK-8283507 Create a regression test for RFE 4287690
JDK-8284521 Write an automated regression test for RFE 4371575
JDK-8251177 [macosx] The text "big" is truncated in JTabbedPane
JDK-8283624 Create an automated regression test for RFE-4390885
JDK-8285698 Create a test to check the focus stealing of JPopupMenu from JComboBox
JDK-8065097 [macosx] javax/swing/Popup/TaskbarPositionTest.java fails because Popup is one pixel off
JDK-8286172 Create an automated test for JDK-4516019
JDK-8289547 Update javax/swing/Popup/TaskbarPositionTest.java
JDK-8215396 JTabbedPane preferred size calculation is wrong for SCROLL_TAB_LAYOUT
JDK-8223788 [macos] JSpinner buttons in JColorChooser dialog may capture focus using TAB Key.
JDK-8040630 Popup menus and tooltips flicker with previous popup contents when first shown
JDK-8296878 Document Filter attached to JPasswordField and setText("") is not cleared instead inserted characters replaced with unicode null characters
JDK-8203904 javax/swing/JSplitPane/4816114/bug4816114.java: The divider location is wrong
JDK-8042383 [TEST_BUG] Test javax/swing/plaf/basic/BasicMenuUI/4983388/bug4983388.java fails with shortcuts on menus do not work
JDK-8152332 [macosx] JFileChooser cannot be serialized on Mac OS X
JDK-8172269 When checking the default behaviour for a scroll tab layout and checking the 'opaque' checkbox, the area behind tabs is not red.
JDK-8171998 javax/swing/JMenu/4692443/bug4692443.java fails on Windows
JDK-8172065 javax/swing/JTree/4908142/bug4908142.java The selected index should be "aad"
JDK-8139173 [macosx] JInternalFrame shadow is not properly drawn
JDK-7132796 [macosx] closed/javax/swing/JComboBox/4517214/bug4517214.java fails on MacOS
JDK-8290399 [macos] Aqua LAF does not fire an action event if combo box menu is displayed
JDK-8054572 [macosx] JComboBox paints the border incorrectly
JDK-7148092 [macosx] When Alt+down arrow key is pressed, the combobox popup does not appear.
JDK-8041447 Test javax/swing/dnd/7171812/bug7171812.java fails with java.lang.RuntimeException: Test failed, scroll on drag doesn't work
JDK-8311585 Add JRadioButtonMenuItem to bug8031573.java
JDK-8316053 Open some swing tests 3
JDK-8226964 [Yaru] GTK L&F: There is no difference between menu selected and de-selected
JDK-8206392 [macosx] Cycling through windows (JFrames) does not work with keyboard shortcut
JDK-8187364 Unable to enter zero width non-joiner (ZWNJ) symbol in Swing text component
JDK-8203627 Swing applications with JRadioButton and JCheckbox fail to render correctly when using GTK3 and the GTK L&F
JDK-8218469 JSlider display issue with slider for GTKLookAndFeel
JDK-8218470 JScrollBar display issue with GTKLookAndFeel
JDK-8218472 JProgressBar display issue with GTKLookAndFeel
JDK-8218473 JOptionPane display issue with GTKLookAndFeel
JDK-8218479 JTextPane display issue with GTKLookAndFeel
JDK-8230235 Rendering HTML with empty img attribute and documentBaseKey cause Exception
JDK-8236953 [macos] JavaFX SwingNode is not rendered on macOS
JDK-8249251 [dark_mode ubuntu 20.04] The selected menu is not highlighted in GTKLookAndFeel
JDK-8300269 The selected item in an editable JComboBox with titled border is not visible in Aqua LAF
JDK-8207941 [TESTBUG] javax/swing/plaf/basic/BasicGraphicsUtils/8132119/bug8132119.java fails on machines without Arial font
JDK-8204963 javax.swing.border.TitledBorder has a memory leak
JDK-8208638 Instead of circle rendered in appl window, but ellipse is produced JEditor Pane
JDK-8211160 Handle different look and feels in JInternalFrameOperator
JDK-8203281 [Windows] JComboBox change in ui when editor.setBorder() is called
JDK-8211139 Increase timeout value in all tests under jdk/sanity/client/SwingSet/src
JDK-8210739 Calling JSpinner's setFont with null throws NullPointerException
JDK-8211443 Enable different look and feels in SwingSet3 demo test SplitPaneDemoTest
JDK-8212897 Some improvements in the EditorPaneDemotest
JDK-8213168 Enable different look and feel tests in SwingSet3 demo test FileChooserDemoTest
JDK-8214111 There is no icon in all JOptionPane target image
JDK-8217297 Add support for multiple look and feel for SwingSet SliderDemoTest
JDK-8217377 javax/swing/JPopupMenu/6583251/bug6583251.java failed with UnsupportedOperation exception
JDK-8217235 Create automated test for SwingSet ColorChooserDemoTest
JDK-8211322 Reduce the timeout of tooltip in SwingSet2DemoTest
JDK-8214112 The whole text in target JPasswordField image are not selected.
JDK-8214253 Tooltip is transparent rather than having a black background
JDK-8218674 HTML Tooltip with "img src=" on component doesn't show
JDK-8212904 JTextArea line wrapping incorrect when using UI scale
JDK-8220349 The fix done for JDK-8214253 have caused issues in JTree behaviour
JDK-8222519 ButtonDemoScreenshotTest fails randomly with "still state to be reached"
JDK-8214702 Wrong text position for whitespaced string in printing Swing text
JDK-8211703 JInternalFrame : java.lang.AssertionError: cannot find the internal frame
JDK-8225144 [macos] In Aqua L&F backspace key does not delete when Shift is pressed
JDK-8225423 GTK L&F: JSplitPane: There is no divider shown
JDK-8226513 JEditorPane is shown with incorrect size
JDK-8225505 ctrl-F1 does not show the tooltip of a menu item (JMenuItems)
JDK-8223158 Docked MacBook cannot start any Java Swing applications
JDK-8226892 ActionListeners on JRadioButtons don't get notified when selection is changed with arrow keys
JDK-8190763 Class cast exception on (CompoundEdit) UndoableEditEvent.getEdit()
JDK-8237540 Missing files in backport of JDK-8210910
JDK-8237541 Missing files in backport of JDK-8209499
JDK-8239334 Tab Size does not work correctly in JTextArea with setLineWrap on
JDK-8239902 [macos] Remove direct usage of JSlider, JProgressBar classes in CAccessible class
JDK-8232243 Wrong caret position in JTextPane on Windows with a screen resolution > 100%
JDK-8244557 test/jdk/javax/swing/JTabbedPane/TestBackgroundScrollPolicy.java failed
JDK-8213535 Windows HiDPI html lightweight tooltips are truncated
JDK-8248187 [TESTBUG] javax/swing/plaf/basic/BasicGraphicsUtils/8132119/bug8132119.java fails with String is not properly drawn
JDK-8247753 UIManager.getSytemLookAndFeelClassName() returns wrong value on Fedora 32
JDK-8255880 UI of Swing components is not redrawn after their internal state changed
JDK-8251377 [macos11] JTabbedPane selected tab text is barely legible
JDK-8259237 Demo selection changes with left/right arrow key. No need to press space for selection.
JDK-8256109 Create implementation for NSAccessibilityButton protocol
JDK-8261351 Create implementation for NSAccessibilityRadioButton protocol
JDK-8261350 Create implementation for NSAccessibilityCheckBox protocol peer
JDK-8264290 Create implementation for NSAccessibilityComponentGroup protocol peer
JDK-8264304 Create implementation for NSAccessibilityToolbar protocol peer
JDK-8269951 [macos] Focus not painted in JButton when setBorderPainted(false) is invoked
JDK-8273366 [testbug] javax/swing/UIDefaults/6302464/bug6302464.java fails on macOS12
JDK-8282958 Rendering Issues with Borders on Windows High-DPI systems
JDK-8227257 javax/swing/JFileChooser/4847375/bug4847375.java fails with AssertionError
JDK-6928542 Chinese characters in RTF are not decoded
JDK-8294427 Check boxes and radio buttons have rendering issues on Windows in High DPI env
JDK-8213116 javax/swing/JComboBox/WindowsComboBoxSize/WindowsComboBoxSizeTest.java fails in Windows
JDK-8199072 Test javax/swing/GroupLayout/6613904/bug6613904.java is unstable
JDK-8198321 javax/swing/JEditorPane/5076514/bug5076514.java fails
JDK-8198339 Test javax/swing/border/Test6981576.java is unstable
JDK-8198398 Test javax/swing/JColorChooser/Test6199676.java fails in mach5
JDK-8196096 javax/swing/JPopupMenu/6580930/bug6580930.java fails
JDK-8196467 javax/swing/JInternalFrame/Test6325652.java fails
JDK-8226697 Several tests which need the @key headful keyword are missing it.
JDK-8228368 avoid incompatible pointer to integer conversion initializing gint in gtk2_interface
JDK-8228479 Correct the format of ColorChooserDemoTest
JDK-8221312 test/jdk/sanity/client/SwingSet/src/ColorChooserDemoTest.java failed
JDK-8194944 Regression automated test 'open/test/jdk/javax/swing/JInternalFrame/8145896/TestJInternalFrameMaximize.java' fails
JDK-8229935 [TEST_BUG]: bug8132119.java inconsistently positions text
JDK-8233634 [TESTBUG] Swing text test bug4278839.java fails on macos
JDK-7124307 JSpinner and changing value by mouse
JDK-8234386 [macos] NPE was thrown at expanding Choice from maximized frame
JDK-8235744 PIT: test/jdk/javax/swing/text/html/TestJLabelWithHTMLText.java times out in linux-x64
JDK-8240202 A few client tests leave mouse buttons pressed
JDK-8240633 Memory leaks in the implementations of FileChooserUI
JDK-8240690 Race condition between EDT and BasicDirectoryModel.FilesLoader.run0()
JDK-7105119 [TEST_BUG] [macosx] In test UIDefaults.toString() must be called with the invokeLater()
JDK-8242526 PIT: javax/swing/JInternalFrame/8020708/bug8020708.java fails in mach5 ubuntu system
JDK-8221902 PIT: javax/swing/JRadioButton/FocusTraversal/FocusTraversal.java fails on ubuntu
JDK-8233638 [TESTBUG] Swing test ScreenMenuBarInputTwice.java fails on macos
JDK-8233642 [TESTBUG] JMenuBar test bug 4750590.java fails on macos
JDK-8233643 [TESTBUG] JMenu test bug4515762.java fails on macos
JDK-8245165 Update bug id for javax/swing/text/StyledEditorKit/4506788/bug4506788.java in ProblemList
JDK-8233553 [TESTBUG] JSpinner test bug4973721.java fails on MacOS
JDK-8233550 [TESTBUG] JTree tests fail regularly on MacOS
JDK-8233552 [TESTBUG] JTable Test bug7068740.java fails on MacOS
JDK-8233551 [TESTBUG] SelectEditTableCell.java fails on MacOS
JDK-8233559 [TESTBUG] TestNimbusOverride.java is failing on macos
JDK-8233647 [TESTBUG] JColorChooser/Test8051548.java is failing on macos
JDK-8159597 [TEST_BUG] closed/javax/swing/JPopupMenu/4760494/bug4760494.java leaves key pressed
JDK-8233635 [TESTBUG] ProgressMonitorEscapeKeyPress.java fails on macos
JDK-8022535 [TEST BUG] javax/swing/text/html/parser/Test8017492.java fails
JDK-8253147 The javax/swing/JPopupMenu/7154841/bug7154841.java fail on big screens
JDK-7151826 [TEST_BUG] [macosx] The test javax/swing/JPopupMenu/4966112/bug4966112.java not for mac
JDK-8253543 sanity/client/SwingSet/src/ButtonDemoScreenshotTest.java failed with "AssertionError: All pixels are not black"
JDK-8254085 javax/swing/text/Caret/TestCaretPositionJTextPane.java failed with "RuntimeException: Wrong caret position"
JDK-8233556 [TESTBUG] JPopupMenu tests fail on MacOS
JDK-8233560 [TESTBUG] ToolTipManager/Test6256140.java is failing on macos
JDK-8233570 [TESTBUG] HTMLEditorKit test bug5043626.java is failing on macos
JDK-8143021 [TEST_BUG] Test javax/swing/JColorChooser/Test6541987.java fails
JDK-8233569 [TESTBUG] JTextComponent test bug6361367.java fails on macos
JDK-8233637 [TESTBUG] Swing ActionListenerCalledTwiceTest.java fails on macos
JDK-8233641 [TESTBUG] JMenuItem test bug4171437.java fails on macos
JDK-8233561 [TESTBUG] Swing text test bug8014863.java fails on macos
JDK-8233562 [TESTBUG] Swing StyledEditorKit test bug4506788.java fails on MacOS
JDK-8241806 The sun/awt/shell/FileSystemViewMemoryLeak.java is unstable
JDK-8196092 javax/swing/JComboBox/8032878/bug8032878.java fails
JDK-8193942 Regression automated test '/open/test/jdk/javax/swing/JFrame/8175301/ScaledFrameBackgroundTest.java' fails
JDK-8233555 [TESTBUG] JRadioButton tests failing on MacoS
JDK-8197825 [Test] Intermittent timeout with javax/swing JColorChooser Test
JDK-8075909 [TEST_BUG] The regression-swing case failed as it does not have the 'Open' button when select 'subdir' folder with NimbusLAF
JDK-8262085 Hovering Metal HTML Tooltips in different windows cause IllegalArgExc on Linux
JDK-8264526 javax/swing/text/html/parser/Parser/8078268/bug8078268.java timeout
JDK-8199079 Test javax/swing/UIDefaults/6302464/bug6302464.java is unstable
JDK-8171381 [TEST_BUG] [macos] javax/swing/JPopupMenu/7156657/bug7156657.java fails on OS X
JDK-8266249 javax/swing/JPopupMenu/7156657/bug7156657.java fails on macOS
JDK-8266713 [AIX] Build failure after 11u backport of JDK-8247753
JDK-8137101 [TEST_BUG] javax/swing/plaf/basic/BasicHTML/4251579/bug4251579.java failure due to timing
JDK-8273638 javax/swing/JTable/4235420/bug4235420.java fails in GTK L&F
JDK-8273634 [TEST_BUG] Improve javax/swing/text/ParagraphView/6364882/bug6364882.java
JDK-8274465 Fix javax/swing/text/ParagraphView/6364882/bug6364882.java failures
JDK-8017175 [TESTBUG] javax/swing/JPopupMenu/4634626/bug4634626.java sometimes failed on mac
JDK-8277396 [TESTBUG] In DefaultButtonModelCrashTest.java, frame is accessed from main thread
JDK-8284884 Replace polling with waiting in javax/swing/text/html/parser/Parser/8078268/bug8078268.java
JDK-8286846 test/jdk/javax/swing/plaf/aqua/CustomComboBoxFocusTest.java fails on mac aarch64
JDK-8287876 The recently de-problemlisted TestTitledBorderLeak test is unstable
JDK-6445283 ProgressMonitorInputStream not large file aware (>2GB)
JDK-8293811 Provide a reason for PassFailJFrame.forceFail
JDK-8277775 Fixup bugids in RemoveDropTargetCrashTest.java - add 4357905
JDK-8297450 ScaledTextFieldBorderTest.java fails when run with -show parameter
JDK-8300205 Swing test bug8078268 make latch timeout configurable
JDK-8306955 Open source several JComboBox jtreg tests
JDK-8307080 Open source some more JComboBox jtreg tests
JDK-8299713 Test javax/swing/JTableHeader/6889007/bug6889007.java failed: Wrong type of cursor
JDK-8307133 Open source some JTable jtreg tests
JDK-8307130 Open source few Swing JMenu tests
JDK-8309095 Remove UTF-8 character from TaskbarPositionTest.java
JDK-8310238 [test bug] javax/swing/JTableHeader/6889007/bug6889007.java fails
JDK-8294535 Add screen capture functionality to PassFailJFrame
JDK-8315600 Open source few more headless Swing misc tests
JDK-8315606 Open source few swing text/html tests
JDK-8315594 Open source few headless Swing misc tests
JDK-8315761 Open source few swing JList and JMenuBar tests
JDK-8315731 Open source several Swing Text related tests
JDK-8316106 Open source few swing JInternalFrame and JMenuBar tests
JDK-8315986 [macos14] javax/swing/JMenuItem/4654927/bug4654927.java: component must be showing on the screen to determine its location
JDK-8321151 JDK-8294427 breaks Windows L&F on all older Windows versions
JDK-8165828 [TEST_BUG] The reg case:javax/swing/plaf/metal/MetalIcons/MetalHiDPIIconsTest.java failed as No Metal Look and Feel

core-libs

Fix Versions Bug Synopsis
8 9 10 11 12 13 14 15 16 17 18 19 20 21 22 23
JDK-8211122 Reduce the number of internal classes made accessible to jdk.unsupported
JDK-8275735 [linux] Remove deprecated Metrics api (kernel memory limit)
JDK-8284756 [11u] Remove unused isUseContainerSupport in CgroupV1Subsystem
JDK-8213328 Update test copyrights in test/java/util/zip and test/jdk/tools
JDK-8221340 [TESTBUG] TestCgroupMetrics.java fails after fix for JDK-8219562
JDK-8223553 Fix code constructs that do not compile with the Eclipse Java Compiler
JDK-8234147 Avoid looking up standard charsets in core libraries
JDK-8243539 Copyright info (Year) should be updated for fix of 8241638
JDK-8253497 Core Libs Terminology Refresh
JDK-8259265 Refactor UncaughtExceptions shell test as java test.
JDK-8259267 Refactor LoaderLeak shell test as java test.
JDK-8266579 Update test/jdk/java/lang/ProcessHandle/PermissionTest.java & test/jdk/java/sql/testng/util/TestPolicy.java
JDK-8267180 Typo in copyright header for HashesTest
JDK-8286705 GCC 12 reports use-after-free potential bugs
JDK-8207748 Fix for 8202794 breaks tier1 builds
JDK-8211097 aix: fix build after JDK-8210919
JDK-8213151 [AIX] Some class library files are missing the Classpath exception
JDK-8277815 Fix mistakes in legal header backports
JDK-8214063 [AIX] Disable symbol visibility flags
JDK-8216401 Allow "file:" URLs in Class-Path of local JARs
JDK-8212528 Wrong cgroup subsystem being used for some CPU Container Metrics
JDK-8228501 java_props_macosx.c - provide missing CFRelease for CFLocaleCopyCurrent
JDK-8255908 ExceptionInInitializerError due to UncheckedIOException while initializing cgroupv1 subsystem
JDK-8275713 TestDockerMemoryMetrics test fails on recent runc
JDK-8287663 Add a regression test for JDK-8287073
JDK-8202794 Native Unix code should use readdir rather than readdir_r
JDK-8209832 Refactor jdk/internal/reflect/Reflection/GetCallerClassTest.sh to plain java test
JDK-8209786 JDK12 fails to build on s390x with gcc 7.3
JDK-8209930 Refactor java/util/zip/ZipFile/deletetempjar.sh to plain java test
JDK-8215449 Several tests failing when jtreg run with -vmoption:--illegal-access=deny
JDK-8220072 GCC 8.3 reports errors in java.base
JDK-8224502 [TESTBUG] JDK docker test TestSystemMetrics.java fails with access issues and OOM
JDK-8224506 [TESTBUG] TestDockerMemoryMetrics.java fails with exitValue = 137
JDK-8226468 [aix] loadquery failed error reported
JDK-8227438 [TESTLIB] Determine if file exists by Files.exists in function FileUtils.deleteFileIfExistsWithRetry
JDK-8220348 [ntintel] asserts about copying unaligned array
JDK-8238380 java.base/unix/native/libjava/childproc.c "multiple definition" link errors with GCC10
JDK-8231111 Cgroups v2: Rework Metrics in java.base so as to recognize unified hierarchy
JDK-8240189 [TESTBUG] Some cgroup tests are failing after JDK-8231111
JDK-8247874 Replacement in VersionProps.java.template not working when --with-vendor-bug-url contains '&'
JDK-8250627 Use -XX:+/-UseContainerSupport for enabling/disabling Java container metrics
JDK-8250863 Build error with GCC 10 in NetworkInterface.c and k_standard.c
JDK-8245543 Cgroups: Incorrect detection logic on some systems (still reproducible)
JDK-8253939 [TESTBUG] Increase coverage of the cgroups detection code
JDK-8257620 Do not use objc_msgSend_stret to get macOS version
JDK-8261422 Adjust problematic String.format calls in jdk/internal/util/Preconditions.java outOfBoundsMessage
JDK-8266173 -Wmaybe-uninitialized happens in jni_util.c
JDK-8266168 -Wmaybe-uninitialized happens in check_code.c
JDK-8282143 Objects.requireNonNull should be ForceInline
JDK-8283059 Uninitialized warning in check_code.c with GCC 11.2
JDK-8287073 NPE from CgroupV2Subsystem.getInstance()
JDK-8284977 MetricsTesterCgroupV2.getLongValueEntryFromFile fails when named value doesn't exist
JDK-8230374 maxOutputSize, instead of javatest.maxOutputSize, should be used in TEST.properties
JDK-8326503 [11u] java/net/HttpURLConnection/HttpURLConnectionExpectContinueTest.java fail because of package org.junit.jupiter.api does not exist
JDK-8200381 Typos in javadoc - missing verb "be" and alike

core-libs/java.io

Fix Versions Bug Synopsis
8 9 10 11 12 13 14 15 16 17 18 19 20 21 22 23
JDK-8315034 File.mkdirs() occasionally fails to create folders on Windows shared folder
JDK-8275536 Add test to check that File::lastModified returns same time stamp as Files.getLastModifiedTime
JDK-8320798 Console read line with zero out should zero out underlying buffer
JDK-8274122 java/io/File/createTempFile/SpecialTempFile.java fails in Windows 11
JDK-8229333 java/io/File/SetLastModified.java timed out
JDK-8237186 Fix typo in copyright header of java/io/Reader/TransferTo.java
JDK-8266460 java.io tests fail on null stream with upgraded jtreg/TestNG
JDK-8275650 Problemlist java/io/File/createTempFile/SpecialTempFile.java for Windows 11
JDK-8285445 cannot open file "NUL:"
JDK-8208077 File.listRoots performance degradation
JDK-8211163 UNIX version of Java_java_io_Console_echo does not return a clean boolean
JDK-8218280 LineNumberReader throws "Mark invalid" exception if CRLF straddles buffer.
JDK-8229899 java.io.File.isInvalid() is racy
JDK-8229022 BufferedReader performance can be improved by using StringBuilder
JDK-8249699 java/io/ByteArrayOutputStream/MaxCapacity.java should use @requires instead of @ignore
JDK-8273961 jdk/nio/zipfs/ZipFSTester.java fails if file path contains '+' character
JDK-8276623 JDK-8275650 accidentally pushed "out" file
JDK-8285523 Improve test java/io/FileOutputStream/OpenNUL.java
JDK-8322417 Console read line with zero out should zero out when throwing exception
JDK-8322772 Clean up code after JDK-8322417

core-libs/java.io:serialization

Fix Versions Bug Synopsis
8 9 10 11 12 13 14 15 16 17 18 19 20 21 22 23
JDK-8267751 (test) jtreg.SkippedException has no serial VersionUID
JDK-8277093 Vector should throw ClassNotFoundException for a missing class of an element
JDK-8277072 ObjectStreamClass caches keep ClassLoaders alive
JDK-6996807 FieldReflectorKey hash code computation can be improved
JDK-8261160 Add a deserialization JFR event
JDK-8278065 Refactor subclassAudits to use ClassValue
JDK-8220166 Performance regression in deserialization (4-6% in SPECjbb)
JDK-8280041 Retry loop issues in java.io.ClassCache

core-libs/java.lang

Fix Versions Bug Synopsis
8 9 10 11 12 13 14 15 16 17 18 19 20 21 22 23
JDK-8254775 Microbenchmark StringIndexOfChar doesn't compile
JDK-8208363 test/jdk/java/lang/Package/PackageFromManifest.java missing module dependencies declaration
JDK-8225648 [TESTBUG] java/lang/annotation/loaderLeak/Main.java fails with -Xcomp
JDK-8232135 Add diagnostic output to test java/util/ProcessBuilder/Basic.java
JDK-8183372 Refactor java/lang/Class shell tests to java
JDK-8261036 Reduce classes loaded by CleanerFactory initialization
JDK-8183374 Refactor java/lang/Runtime shell tests to java
JDK-8276880 Remove java/lang/RuntimeTests/exec/ExecWithDir as unnecessary
JDK-8218915 Change isJavaIdentifierStart and isJavaIdentifierPart to handle new code points
JDK-8273541 Cleaner Thread creates with normal priority instead of MAX_PRIORITY - 2
JDK-8213017 jspawnhelper: need to handle pipe write failure when sending return code
JDK-8080569 java/lang/ProcessBuilder/DestroyTest.java fails with "RuntimeException: Process terminated prematurely"
JDK-8223777 In posix_spawn mode, failing to exec() jspawnhelper may not result in an error
JDK-8240704 ProcessBuilder/checkHandles/CheckHandles.java failed "AssertionError: Handle use increased by more than 10 percent."
JDK-8279833 Loop optimization issue in String.encodeUTF8_UTF16
JDK-8171426 java/lang/ProcessBuilder/Basic.java failed with Stream closed
JDK-8146090 java/lang/ref/ReachabilityFenceTest.java fails with -XX:+DeoptimizeALot
JDK-8215380 Backout accidental change to String::length
JDK-8216205 Java API documentation formatting error in System.getEnv()
JDK-8224181 On child process spawn, child may write to random file descriptor instead of the fail pipe
JDK-8193325 StackFrameInfo::getByteCodeIndex returns wrong value if bci > 32767
JDK-8231584 Deadlock with ClassLoader.findLibrary and System.loadLibrary call
JDK-8239893 Windows handle Leak when starting processes using ProcessBuilder
JDK-8217475 Unexpected StackOverflowError in "process reaper" thread
JDK-8251397 NPE on ClassValue.ClassValueMap.cacheArray
JDK-8256244 java/lang/ProcessHandle/PermissionTest.java fails with TestNG 7.1
JDK-8256154 Some TestNG tests require default constructors
JDK-8258956 Memory Leak in StringCoding on ThreadLocal resultCached StringCoding.Result
JDK-8265019 Update tests for additional TestNG test permissions
JDK-8265020 tests must be updated for new TestNG module name
JDK-8282219 jdk/java/lang/ProcessBuilder/Basic.java fails on AIX
JDK-8282008 Incorrect handling of quoted arguments in ProcessBuilder
JDK-8276651 java/lang/ProcessHandle tests fail with "RuntimeException: Input/output error" in java.lang.ProcessHandleImpl$Info.info0
JDK-8310265 (process) jspawnhelper should not use argv[0]
JDK-8224505 TestQuotedLogOutput failure after ProcessBuilder changes
JDK-8208715 Conversion of milliseconds to nanoseconds in UNIXProcess contains bug.
JDK-8212828 (process) Provide a way for Runtime.exec to use posix_spawn on linux
JDK-8215281 Use String.isEmpty() when applicable in java.base
JDK-8221400 java/lang/String/StringRepeat.java test requests too much heap
JDK-8224905 java/lang/ProcessBuilder/Basic.java#id1 failed with stream closed
JDK-8226809 Circular reference in printed stack trace is not correctly indented & ambiguous
JDK-8231717 Improve performance of charset decoding when charset is always compactable