LABEL REPORT: jdk17u-fix-yes

This report shows bugs with the given label, along with their backporting status.

Report generated: Thu Feb 29 17:01:03 CET 2024

Minimal actionable level to display: NONE

client-libs

Fix Versions Bug Synopsis
8 9 10 11 12 13 14 15 16 17 18 19 20 21 22 23
JDK-8274029 Remove jtreg tag manual=yesno for java/awt/print/Dialog/DialogOrient.java
JDK-8270312 Error: Not a test or directory containing tests: java/awt/print/PrinterJob/XparColor.java
JDK-8273685 Remove jtreg tag manual=yesno for java/awt/Graphics/LCDTextAndGraphicsState.java & show test instruction
JDK-8275234 java/awt/GraphicsDevice/DisplayModes/CycleDMImage.java is entered twice in ProblemList
JDK-8278456 Define jtreg jdk_desktop test group time-based sub-tasks for use by headful testing.
JDK-8284535 Fix PrintLatinCJKTest.java test that is failing with Parse Exception
JDK-8285867 Convert applet manual tests SelectionVisible.java to Frame and automate
JDK-8300405 Screen capture for test JFileChooserSetLocationTest.java, failure case
JDK-8306135 Clean up and open source some AWT tests
JDK-8306280 Open source several choice AWT tests
JDK-8306575 Clean up and open source four Dialog related tests
JDK-8294158 HTML formatting for PassFailJFrame instructions
JDK-8274634 Use String.equals instead of String.compareTo in java.desktop
JDK-8282046 Create a regression test for JDK-8000326
JDK-8282640 Create a test for JDK-4740761
JDK-8275843 Random crashes while the UI code is executed
JDK-8298887 On the latest macOS+XCode the Robot API may report wrong colors
JDK-8312592 New parentheses warnings after HarfBuzz 7.2.0 update
JDK-8269637 javax/swing/JFileChooser/FileSystemView/SystemIconTest.java fails on windows
JDK-8312612 Handle WideCharToMultiByte return values
JDK-8270859 Post JEP 411 refactoring: client libs with maximum covering > 10K
JDK-8272123 Problem list 4 jtreg tests which regularly fail on macos-aarch64
JDK-8272332 --with-harfbuzz=system doesn't add -lharfbuzz after JDK-8255790
JDK-8274296 Update or Problem List tests which may fail with uiScale=2 on macOS
JDK-8274032 Remove jtreg tag manual=yesno for java/awt/print/PrinterJob/ImagePrinting/ImageTypes.java & show test UI
JDK-8276819 javax/print/PrintServiceLookup/FlushCustomClassLoader.java fails to free
JDK-8281338 NSAccessibilityPressAction action for tree node and NSAccessibilityShowMenuAcgtion action not working
JDK-8270331 [TESTBUG] Error: Not a test or directory containing tests: java/awt/print/PrinterJob/InitToBlack.java
JDK-8283803 Remove jtreg tag manual=yesno for java/awt/print/PrinterJob/PrintGlyphVectorTest.java and fix test
JDK-8285617 Fix java/awt/print/PrinterJob/ImagePrinting/PrintARGBImage.java manual test
JDK-8285612 Remove jtreg tag manual=yesno for java/awt/print/PrinterJob/ImagePrinting/ClippedImages.java
JDK-8285687 Remove jtreg tag manual=yesno for java/awt/print/PrinterJob/PageRangesDlgTest.java
JDK-8296083 javax/swing/JTree/6263446/bug6263446.java fails intermittently on a VM
JDK-8296084 javax/swing/JSpinner/4788637/bug4788637.java fails intermittently on a VM
JDK-8298905 Test "java/awt/print/PrinterJob/ImagePrinting/PrintARGBImage.java" fails because the frames of instruction does not display
JDK-8300692 GCC 12 reports some compiler warnings in bundled freetype
JDK-8306765 Some client related jtreg problem list entries are malformed
JDK-8307569 Build with gcc8 is broken after JDK-8307301
JDK-8294156 Allow PassFailJFrame.Builder to create test UI
JDK-8326942 [17u] Backout "8325254: CKA_TOKEN private and secret keys are not necessarily sensitive"
JDK-8273375 Remove redundant 'new String' calls after concatenation in java.desktop

client-libs/2d

Fix Versions Bug Synopsis
8 9 10 11 12 13 14 15 16 17 18 19 20 21 22 23
JDK-8274456 Remove jtreg tag manual=yesno java/awt/print/PrinterJob/PageDialogTest.java
JDK-8298974 Add ftcolor.c to imported freetype sources
JDK-8316710 Exclude java/awt/font/Rotate/RotatedTextTest.java
JDK-8317706 Exclude java/awt/Graphics2D/DrawString/RotTransText.java on linux
JDK-8273358 macOS Monterey does not have the font Times needed by Serif
JDK-8297088 Update LCMS to 2.14
JDK-8303482 Update LCMS to 2.15
JDK-8318951 Additional negative value check in JPEG decoding
JDK-8280964 [Linux aarch64] : drawImage dithers TYPE_BYTE_INDEXED images incorrectly
JDK-8275303 sun/java2d/pipe/InterpolationQualityTest.java fails with D3D basic render driver
JDK-8282577 ICC_Profile.setData(int, byte[]) invalidates the profile
JDK-8275872 Sync J2DBench run and analyze Makefile targets with build.xml
JDK-8273831 PrintServiceLookup spawns 2 threads in the current classloader, getting orphaned
JDK-8271718 Crash when during color transformation the color profile is replaced
JDK-8264666 Change implementation of safeAdd/safeMult in the LCMSImageLayout class
JDK-8022403 sun/java2d/DirectX/OnScreenRenderingResizeTest/OnScreenRenderingResizeTest.java fails
JDK-8297153 sun/java2d/DirectX/OnScreenRenderingResizeTest/OnScreenRenderingResizeTest.java fails again
JDK-8273972 Multi-core choke point in CMM engine (LCMSTransform.doTransform)
JDK-8181571 printing to CUPS fails on mac sandbox app
JDK-8311033 [macos] PrinterJob does not take into account Sides attribute
JDK-8262731 [macOS] Exception from "Printable.print" is swallowed during "PrinterJob.print"
JDK-8272342 [TEST_BUG] java/awt/print/PrinterJob/PageDialogMarginTest.java catches all exceptions
JDK-8276905 Use appropriate macosx_version_minimum value while compiling metal shaders
JDK-8270874 JFrame paint artifacts when dragged from standard monitor to HiDPI monitor
JDK-8240756 [macos] SwingSet2:TableDemo:Printed Japanese characters were garbled
JDK-8283217 Leak FcObjectSet in getFontConfigLocations() in fontpath.c
JDK-8283457 [macos] libpng build failures with Xcode13.3
JDK-8285686 Update FreeType to 2.12.0
JDK-8285399 JNI exception pending in awt_GraphicsEnv.c:1432
JDK-8289697 buffer overflow in MTLVertexCache.m: MTLVertexCache_AddGlyphQuad
JDK-8289853 Update HarfBuzz to 4.4.1
JDK-8290334 Update FreeType to 2.12.1
JDK-8293672 Update freetype md file
JDK-8301998 Update HarfBuzz to 7.0.1
JDK-8304291 [AIX] Broken build after JDK-8301998
JDK-8307301 Update HarfBuzz to 7.2.0
JDK-8307603 [AIX] Broken build after JDK-8307301
JDK-8307604 gcc12 based Alpine build broken build after JDK-8307301
JDK-8306881 Update FreeType to 2.13.0
JDK-8313643 Update HarfBuzz to 8.2.2
JDK-8316028 Update FreeType to 2.13.2
JDK-8295429 Update harfbuzz md file
JDK-8273135 java/awt/color/ICC_ColorSpace/MTTransformReplacedProfile.java crashes in liblcms.dylib with NULLSeek+0x7
JDK-8270609 [TESTBUG] java/awt/print/Dialog/DialogCopies.java does not show instruction
JDK-8273887 [macos] java/awt/color/ICC_ColorSpace/MTTransformReplacedProfile.java timed out
JDK-8255724 [XRender] the BlitRotateClippedArea test fails on Linux in the XR pipeline
JDK-8192931 Regression test java/awt/font/TextLayout/CombiningPerf.java fails
JDK-8273704 DrawStringWithInfiniteXform.java failed : drawString with InfiniteXform transform takes long time
JDK-8276805 java/awt/print/PrinterJob/CheckPrivilege.java fails due to disabled SecurityManager
JDK-8278549 UNIX sun/font coding misses SUSE distro detection on recent distro SUSE 15
JDK-7001973 java/awt/Graphics2D/CopyAreaOOB.java fails
JDK-8280048 Missing comma in copyright header
JDK-8282628 Potential memory leak in sun.font.FontConfigManager.getFontConfig()
JDK-8223543 [TESTBUG] Regression test java/awt/Graphics2D/DrawString/LCDTextSrcEa.java has issues
JDK-8284680 sun.font.FontConfigManager.getFontConfig() leaks charset
JDK-8285397 JNI exception pending in CUPSfuncs.c:250
JDK-8287609 macOS: SIGSEGV at [CoreFoundation] CFArrayGetCount / sun.font.CFont.getTableBytesNative
JDK-8287824 The MTPerLineTransformValidation tests has a typo in the @run tag
JDK-8295812 Skip the "half float" support in LittleCMS during the build
JDK-8286624 Regression Test CoordinateTruncationBug.java fails on OL8.3
JDK-8282404 DrawStringWithInfiniteXform.java failed with "RuntimeException: drawString with InfiniteXform transform takes long time"
JDK-8285604 closed sun/java2d/GdiRendering/ClipShapeRendering.java failed with "Incorrect color ffeeeeee instead of ff0000ff in pixel (100, 100)"
JDK-8297147 UnexpectedSourceImageSize test times out on slow machines when fastdebug is used
JDK-6528710 sRGB-ColorSpace to sRGB-ColorSpace Conversion
JDK-8297681 Unnecessary color conversion during 4BYTE_ABGR_PRE to INT_ARGB_PRE blit
JDK-8298027 Remove SCCS id's from awt jtreg tests
JDK-8299207 [Testbug] Add back test/jdk/java/awt/Graphics2D/DrawPrimitivesTest.java
JDK-8299255 Unexpected round errors in FreetypeFontScaler
JDK-8295737 macOS: Print content cut off when width > height with portrait orientation
JDK-8304295 harfbuzz build fails with GCC 7 after JDK-8301998
JDK-8304350 Font.getStringBounds calculates wrong width for TextAttribute.TRACKING other than 0.0
JDK-8313576 GCC 7 reports compiler warning in bundled freetype 2.13.0
JDK-8316206 Test StretchedFontTest.java fails for Baekmuk font
JDK-8324347 Enable "maybe-uninitialized" warning for FreeType 2.13.1
JDK-8318603 Parallelize sun/java2d/marlin/ClipShapeTest.java
JDK-8293767 AWT test TestSinhalaChar.java has old SCCS markings
JDK-8299497 Usage of constructors of primitive wrapper classes should be avoided in java.desktop API docs

client-libs/demo

Fix Versions Bug Synopsis
8 9 10 11 12 13 14 15 16 17 18 19 20 21 22 23
JDK-8278604 SwingSet2 table demo does not have accessible description set for images

client-libs/java.awt

Fix Versions Bug Synopsis
8 9 10 11 12 13 14 15 16 17 18 19 20 21 22 23
JDK-8282276 Problem list failing two Robot Screen Capture tests
JDK-8289238 Refactoring changes to PassFailJFrame Test Framework
JDK-8290469 Add new positioning options to PassFailJFrame test framework
JDK-8296934 Write a test to verify whether Undecorated Frame can be iconified or not
JDK-8289077 Add manual tests to open
JDK-8306072 Open source several AWT MouseInfo related tests
JDK-8306652 Open source AWT MenuItem related tests
JDK-8306683 Open source several clipboard and color AWT tests
JDK-8306718 Optimize and opensource some old AWT tests
JDK-8306752 Open source several container and component AWT tests
JDK-8306753 Open source several container AWT tests
JDK-8306409 Open source AWT KeyBoardFocusManger, LightWeightComponent related tests
JDK-8306850 Open source AWT Modal related tests
JDK-8306432 Open source several AWT Text Component related tests
JDK-8306640 Open source several AWT TextArea related tests
JDK-8307078 Opensource and clean up five more AWT Focus related tests
JDK-8306954 Open source five Focus related tests
JDK-8306489 Open source AWT List related tests
JDK-8306943 Open source several dnd AWT tests
JDK-8306941 Open source several datatransfer and dnd AWT tests
JDK-8307128 Open source some drag and drop tests 4
JDK-8311689 Wrong visible amount in Adjustable of ScrollPane
JDK-8284033 Leak XVisualInfo in getAllConfigs in awt_GraphicsEnv.c
JDK-8284023 java.sun.awt.X11GraphicsDevice.getDoubleBufferVisuals() leaks XdbeScreenVisualInfo
JDK-8144030 [macosx] test java/awt/Frame/ShapeNotSetSometimes/ShapeNotSetSometimes.java fails (again)
JDK-8274597 Some of the dnd tests time out and fail intermittently
JDK-8286481 Exception printed to stdout on Windows when storing transparent image in clipboard
JDK-6176679 Application freezes when copying an animated gif image to the system clipboard
JDK-8297923 java.awt.ScrollPane broken after multiple scroll up/down
JDK-8316030 Update Libpng to 1.6.40
JDK-8233648 [TESTBUG] DefaultMenuBarTest.java failing on macos
JDK-6854300 [TEST_BUG] java/awt/event/MouseEvent/SpuriousExitEnter/SpuriousExitEnter_3.java fails in jdk6u14 & jdk7
JDK-8169468 NoResizeEventOnDMChangeTest.java fails because FS Window didn't receive all resizes!
JDK-8281569 Create tests for Frame.setMinimumSize() method
JDK-8286772 java/awt/dnd/DropTargetInInternalFrameTest/DropTargetInInternalFrameTest.html times out and fails in Windows
JDK-8265586 [windows] last button is not shown in AWT Frame with BorderLayout and MenuBar set.
JDK-8295774 Write a test to verify List sends ItemEvent/ActionEvent
JDK-8297489 Modify TextAreaTextEventTest.java as to verify the content change of TextComponent sends TextEvent
JDK-8297296 java/awt/Mouse/EnterExitEvents/DragWindowTest.java fails with "No MouseReleased event on label!"
JDK-8296275 Write a test to verify setAccelerator method of JMenuItem
JDK-8299296 Write a test to verify the components selection sends ItemEvent
JDK-8298921 Create a regression test for JDK-8139581
JDK-8306466 Open source more AWT Drag & Drop related tests
JDK-8318154 Improve stability of WheelModifier.java test
JDK-8169475 WheelModifier.java fails by timeout
JDK-8273506 java Robot API did the 'm' keypress and caused /awt/event/KeyEvent/KeyCharTest/KeyCharTest.html is timing out on macOS 12
JDK-8030121 java/awt/dnd/MissingDragExitEventTest/MissingDragExitEventTest.java fails
JDK-8286663 Resolve IDE warnings in WTrayIconPeer and SystemTray
JDK-8297481 Create a regression test for JDK-4424517
JDK-8302525 Write a test to check various components send Events while mouse and key are used simultaneously
JDK-8288332 Tier1 validate-source fails after 8279614
JDK-8272602 [macOS] not all KEY_PRESSED events sent when control modifier is used
JDK-8295685 Update Libpng to 1.6.38
JDK-8272806 [macOS] "Apple AWT Internal Exception" when input method is changed
JDK-8277299 STACK_OVERFLOW in Java_sun_awt_shell_Win32ShellFolder2_getIconBits
JDK-8274751 Drag And Drop hangs on Windows
JDK-8274939 Incorrect size of the pixel storage is used by the robot on macOS
JDK-8193543 Regression automated test '/open/test/jdk/java/awt/TrayIcon/SystemTrayInstance/SystemTrayInstanceTest.java' fails
JDK-8255439 System Tray icons get corrupted when Windows scaling changes
JDK-8279614 The left line of the TitledBorder is not painted on 150 scale factor
JDK-8288854 getLocalGraphicsEnvironment() on for multi-screen setups throws exception NPE
JDK-8294254 [macOS] javax/swing/plaf/aqua/CustomComboBoxFocusTest.java failure
JDK-8296496 Overzealous check in sizecalc.h prevents large memory allocation
JDK-8252713 jtreg time out of CtrlASCII.java seems to hang the Xserver.
JDK-8296957 One more cast in SAFE_SIZE_NEW_ARRAY2
JDK-8302849 SurfaceManager might expose partially constructed object
JDK-8305815 Update Libpng to 1.6.39
JDK-8307165 java/awt/dnd/NoFormatsDropTest/NoFormatsDropTest.java timed out
JDK-8310054 ScrollPane insets are incorrect
JDK-8313164 src/java.desktop/windows/native/libawt/windows/awt_Robot.cpp GetRGBPixels adjust releasing of resources
JDK-8273387 remove some unreferenced gtk-related functions
JDK-8273808 Cleanup AddFontsToX11FontPath
JDK-8275131 Exceptions after a touchpad gesture on macOS
JDK-8274160 java/awt/Window/ShapedAndTranslucentWindows/Common.java delay is too high
JDK-8233558 [TESTBUG] WindowOwnedByEmbeddedFrameTest.java fails on macos
JDK-8275689 [TESTBUG] Use color tolerance only for XRender in BlitRotateClippedArea test
JDK-8233557 [TESTBUG] DoubleClickTitleBarTest.java fails on macOs
JDK-8079267 [TEST_BUG] Test java/awt/Frame/MiscUndecorated/RepaintTest.java fails
JDK-8225122 Test AncestorResized.java fails when Windows desktop is scaled.
JDK-8280956 Re-examine copyright headers on files in src/java.desktop/macosx/native/libawt_lwawt/awt/a11y
JDK-8202836 [macosx] test java/awt/Graphics/TextAAHintsTest.java fails
JDK-8249592 Robot.mouseMove moves cursor to incorrect location when display scale varies and Java runs in DPI Unaware mode
JDK-8159694 HiDPI, Unity, java/awt/dnd/DropTargetEnterExitTest/MissedDragExitTest.java
JDK-8159599 [TEST_BUG] java/awt/Modal/ModalInternalFrameTest/ModalInternalFrameTest.java
JDK-8129827 [TEST_BUG] Test java/awt/Robot/RobotWheelTest/RobotWheelTest.java fails
JDK-8202790 DnD test DisposeFrameOnDragTest.java does not clean up
JDK-8222323 ChildAlwaysOnTopTest.java fails with "RuntimeException: Failed to unset alwaysOnTop"
JDK-8284956 Potential leak awtImageData/color_data when initializes X11GraphicsEnvironment
JDK-6829250 Reg test: java/awt/Toolkit/ScreenInsetsTest/ScreenInsetsTest.java fails in Windows
JDK-8286872 Refactor add/modify notification icon (TrayIcon)
JDK-8213531 Test javax/swing/border/TestTitledBorderLeak.java fails
JDK-8169187 [macosx] Aqua: java/awt/image/multiresolution/MultiresolutionIconTest.java
JDK-8292866 Java_sun_awt_shell_Win32ShellFolder2_getLinkLocation check MultiByteToWideChar return value for failures
JDK-8288325 [windows] Actual and Preferred Size of AWT Non-resizable frame are different
JDK-8295554 Move the "sizecalc.h" to the correct location
JDK-8296632 Write a test to verify the content change of TextArea sends TextEvent
JDK-8239801 [macos] java/awt/Focus/UnaccessibleChoice/AccessibleChoiceTest.java fails
JDK-8297523 Various GetPrimitiveArrayCritical miss result - NULL check
JDK-8271519 java/awt/event/SequencedEvent/MultipleContextsFunctionalTest.java failed with "Total [200] - Expected [400]"
JDK-8298093 improve cleanup and error handling of awt_parseColorModel in awt_parseImage.c
JDK-8202931 [macos] java/awt/Choice/ChoicePopupLocation/ChoicePopupLocation.java fails
JDK-8288415 java/awt/PopupMenu/PopupMenuLocation.java is unstable in MacOS machines
JDK-8300727 java/awt/List/ListGarbageCollectionTest/AwtListGarbageCollectionTest.java failed with "List wasn't garbage collected"
JDK-8304054 Linux: NullPointerException from FontConfiguration.getVersion in case no fonts are installed
JDK-8306134 Open source some AWT tests relating to Button and a few other classes
JDK-8306372 Open source AWT CardLayout and Checkbox tests
JDK-8306060 Open source few AWT Insets related tests
JDK-8306430 Open source some AWT tests related to TextComponent and Toolkit
JDK-8306076 Open source AWT misc tests
JDK-8306566 Open source several clipboard AWT tests
JDK-8306484 Open source several AWT Choice jtreg tests
JDK-8306682 Open source a few more AWT Choice tests
JDK-8306133 Open source few AWT Drag & Drop related tests
JDK-8306681 Open source more AWT DnD related tests
JDK-8307079 Update test java/awt/Choice/DragOffNoSelect.java
JDK-8307135 java/awt/dnd/NotReallySerializableTest/NotReallySerializableTest.java failed
JDK-8306871 Open source more AWT Drag & Drop tests
JDK-8306638 Open source some AWT tests related to datatransfer and Toolkit
JDK-8307083 Open source some drag and drop tests 3
JDK-8307299 Move more DnD tests to open
JDK-8306137 Open source several AWT ScrollPane related tests
JDK-8306812 Open source several AWT Miscellaneous tests
JDK-8313252 Java_sun_awt_windows_ThemeReader_paintBackground release resources in early returns
JDK-8315726 Open source several AWT applet tests
JDK-8316947 Write a test to check textArea triggers MouseEntered/MouseExited events properly
JDK-8318955 Add ReleaseIntArrayElements in Java_sun_awt_X11_XlibWrapper_SetBitmapShape XlbWrapper.c to early return
JDK-8288993 Make AwtFramePackTest generic by removing @requires tag

client-libs/java.awt:i18n

Fix Versions Bug Synopsis
8 9 10 11 12 13 14 15 16 17 18 19 20 21 22 23
JDK-8278472 Invalid value set to CANDIDATEFORM structure
JDK-8282422 JTable.print() failed with UnsupportedCharsetException on AIX ko_KR locale

client-libs/java.beans

Fix Versions Bug Synopsis
8 9 10 11 12 13 14 15 16 17 18 19 20 21 22 23
JDK-8280132 Incorrect comparator com.sun.beans.introspect.MethodInfo.MethodOrder
JDK-8308152 PropertyDescriptor should work with overridden generic getter method

client-libs/javax.accessibility

Fix Versions Bug Synopsis
8 9 10 11 12 13 14 15 16 17 18 19 20 21 22 23
JDK-8282771 Create test case for JDK-8262981
JDK-8292328 AccessibleActionsTest.java test instruction for show popup on JLabel did not specify shift key
JDK-8283383 [macos] a11y : Screen magnifier shows extra characters (0) at the end JButton accessibility name
JDK-8262031 Create implementation for NSAccessibilityNavigableStaticText protocol
JDK-8267385 Create NSAccessibilityElement implementation for JavaComponentAccessibility
JDK-8267387 Create implementation for NSAccessibilityOutline protocol
JDK-8267388 Create implementation for NSAccessibilityTable protocol
JDK-8277922 Unable to click JCheckBox in JTable through Java Access Bridge
JDK-8284014 Menu items with submenus in JPopupMenu are not spoken on macOS
JDK-8283087 Create a test or JDK-4715503
JDK-8283015 Create a test for JDK-4715496
JDK-8283245 Create a test for JDK-4670319
JDK-8282933 Create a test for JDK-4529616
JDK-8284077 Create an automated test for JDK-4170173
JDK-8285693 Create an automated test for JDK-4702199
JDK-8282778 Create a regression test for JDK-4699544
JDK-8282857 Create a regression test for JDK-4702690
JDK-8285305 Create an automated test for JDK-4495286
JDK-8285373 Create an automated test for JDK-4702233
JDK-8282777 Create a Regression test for JDK-4515031
JDK-8289559 java/awt/a11y/AccessibleJPopupMenuTest.java test fails with java.lang.NullPointerException
JDK-8284524 Create an automated test for JDK-4422362
JDK-8284767 Create an automated test for JDK-4422535
JDK-8286313 [macos] Voice over reads the boolean value as null in the JTable
JDK-8311160 [macOS, Accessibility] VoiceOver: No announcements on JRadioButtonMenuItem and JCheckBoxMenuItem
JDK-8317771 [macos14] Expand/collapse a JTree using keyboard freezes the application in macOS 14 Sonoma
JDK-8283400 [macos] a11y : Screen magnifier does not reflect JRadioButton value change
JDK-8274381 missing CAccessibility definitions in JNI code
JDK-8275809 crash in [CommonComponentAccessibility getCAccessible:withEnv:]
JDK-8277195 missing CAccessibility definition in [CommonComponentAccessibility accessibilityHitTest]
JDK-8278612 [macos] test/jdk/java/awt/dnd/RemoveDropTargetCrashTest crashes with VoiceOver on macOS
JDK-8287826 javax/accessibility/4702233/AccessiblePropertiesTest.java fails to compile
JDK-8309733 [macOS, Accessibility] VoiceOver: Incorrect announcements of JRadioButton
JDK-8274056 JavaAccessibilityUtilities leaks JNI objects
JDK-8274326 [macos] Ensure initialisation of sun/lwawt/macosx/CAccessibility in JavaComponentAccessibility.m
JDK-8274383 JNI call of getAccessibleSelection on a wrong thread
JDK-8271071 accessibility of a table on macOS lacks cell navigation
JDK-8273678 TableAccessibility and TableRowAccessibility miss autorelease
JDK-8275720 CommonComponentAccessibility.createWithParent isWrapped causes mem leak
JDK-8275819 [TableRowAccessibility accessibilityChildren] method is ineffective
JDK-8275071 [macos] A11y cursor gets stuck when combobox is closed
JDK-8277497 Last column cell in the JTable row is read as empty cell
JDK-8278609 [macos] accessibility frame is misplaced on a secondary monitor on macOS
JDK-8279227 Access Bridge: Wrong frame position and hit test result on HiDPI display
JDK-8279586 [macos] custom JCheckBox and JRadioBox with custom icon set: focus is still displayed after unchecking
JDK-8286266 [macos] VoiceOver : Moving JTable column to be the first column JVM crashes
JDK-8284690 [macos] VoiceOver : Getting java.lang.IllegalArgumentException: Invalid location on Editable JComboBox
JDK-8287740 NSAccessibilityShowMenuAction not working for text editors
JDK-8283347 [macos] Bad JNI lookup accessibilityHitTest is shown when Screen magnifier is enabled

client-libs/javax.imageio

Fix Versions Bug Synopsis
8 9 10 11 12 13 14 15 16 17 18 19 20 21 22 23
JDK-8302151 BMPImageReader throws an exception reading BMP images
JDK-8274735 javax.imageio.IIOException: Unsupported Image Type while processing a valid JPEG image
JDK-8272998 ImageIO.read() throws incorrect exception type
JDK-7131823 bug in GIFImageReader
JDK-8297480 GetPrimitiveArrayCritical in imageioJPEG misses result - NULL check

client-libs/javax.sound

Fix Versions Bug Synopsis
8 9 10 11 12 13 14 15 16 17 18 19 20 21 22 23
JDK-7188098 TEST_BUG: closed/javax/sound/midi/Synthesizer/Receiver/bug6186488.java fails
JDK-8301846 Invalid TargetDataLine after screen lock when using JFileChooser or COM library
JDK-8178698 javax/sound/midi/Sequencer/MetaCallback.java failed with timeout
JDK-8269091 javax/sound/sampled/Clip/SetPositionHang.java failed with ArrayIndexOutOfBoundsException: Array index out of range: -4
JDK-8312535 MidiSystem.getSoundbank() throws unexpected SecurityException
JDK-8301310 The SendRawSysexMessage test may cause a JVM crash
JDK-8275170 Some jtreg sound tests should be marked with sound keyword

client-libs/javax.swing

Fix Versions Bug Synopsis
8 9 10 11 12 13 14 15 16 17 18 19 20 21 22 23
JDK-8281745 Create a regression test for JDK-4514331
JDK-8282343 Create a regression test for JDK-4518432
JDK-8282548 Create a regression test for JDK-4330998
JDK-8286620 Create regression test for verifying setMargin() of JRadioButton
JDK-8225012 sanity/client/SwingSet/src/ToolTipDemoTest.java fails on Windows
JDK-8285635 javax/swing/JRootPane/DefaultButtonTest.java failed with Default Button not pressed for L&F: com.sun.java.swing.plaf.motif.MotifLookAndFeel
JDK-8306755 Open source few Swing JComponent and AbstractButton tests
JDK-8307381 Open Source JFrame, JIF related Swing Tests
JDK-8306996 Open source Swing MenuItem related tests
JDK-8307311 Timeouts on one macOS 12.6.1 host of two Swing JTableHeader tests
JDK-8315602 Open source swing security manager test
JDK-8315611 Open source swing text/html and tree test
JDK-8264286 Create implementation for NSAccessibilityColumn protocol peer
JDK-8264287 Create implementation for NSAccessibilityComboBox protocol peer
JDK-8264291 Create implementation for NSAccessibilityCell protocol peer
JDK-8264292 Create implementation for NSAccessibilityList protocol peer
JDK-8264298 Create implementation for NSAccessibilityRow protocol peer
JDK-8264303 Create implementation for NSAccessibilityTabGroup protocol peer
JDK-8239502 [TEST_BUG] Test javax/swing/text/FlowView/6318524/bug6318524.java never fails
JDK-8264293 Create implementation for NSAccessibilityMenu protocol peer
JDK-8264294 Create implementation for NSAccessibilityMenuBar protocol peer
JDK-8264295 Create implementation for NSAccessibilityMenuItem protocol peer
JDK-8264297 Create implementation for NSAccessibilityProgressIndicator protocol peer
JDK-4819544 SwingSet2 JTable Demo throws NullPointerException
JDK-8270116 Expand ButtonGroupLayoutTraversalTest.java to run in all LaFs, including Aqua on macOS
JDK-8273578 javax/swing/JMenu/4515762/bug4515762.java fails on macOS 12
JDK-8280913 Create a regression test for JRootPane.setDefaultButton() method
JDK-8280948 Write a regression test for JDK-4659800
JDK-8281296 Create a regression test for JDK-4515999
JDK-8281535 Create a regression test for JDK-4670051
JDK-8281988 Create a regression test for JDK-4618767
JDK-8281738 Create a regression test for checking the 'Space' key activation of focused Button
JDK-8282402 Create a regression test for JDK-4666101
JDK-8282234 Create a regression test for JDK-4532513
JDK-8282789 Create a regression test for the JTree usecase of JDK-4618767
JDK-8282937 Write a regression test for JDK-4820080
JDK-8282860 Write a regression test for JDK-4164779
JDK-8283493 Create an automated regression test for RFE 4231298
JDK-8282936 Write a regression test for JDK-4615365
JDK-8283621 Write a regression test for CCC4400728
JDK-8283623 Create an automated regression test for JDK-4525475
JDK-8284294 Create an automated regression test for RFE 4138746
JDK-8283507 Create a regression test for RFE 4287690
JDK-8284521 Write an automated regression test for RFE 4371575
JDK-8251177 [macosx] The text "big" is truncated in JTabbedPane
JDK-8283624 Create an automated regression test for RFE-4390885
JDK-8285698 Create a test to check the focus stealing of JPopupMenu from JComboBox
JDK-8065097 [macosx] javax/swing/Popup/TaskbarPositionTest.java fails because Popup is one pixel off
JDK-8286172 Create an automated test for JDK-4516019
JDK-8289547 Update javax/swing/Popup/TaskbarPositionTest.java
JDK-8271315 Redo: Nimbus JTree renderer properties persist across L&F changes
JDK-8296878 Document Filter attached to JPasswordField and setText("") is not cleared instead inserted characters replaced with unicode null characters
JDK-8172065 javax/swing/JTree/4908142/bug4908142.java The selected index should be "aad"
JDK-8139173 [macosx] JInternalFrame shadow is not properly drawn
JDK-7132796 [macosx] closed/javax/swing/JComboBox/4517214/bug4517214.java fails on MacOS
JDK-8290399 [macos] Aqua LAF does not fire an action event if combo box menu is displayed
JDK-8054572 [macosx] JComboBox paints the border incorrectly
JDK-7148092 [macosx] When Alt+down arrow key is pressed, the combobox popup does not appear.
JDK-8041447 Test javax/swing/dnd/7171812/bug7171812.java fails with java.lang.RuntimeException: Test failed, scroll on drag doesn't work
JDK-8311585 Add JRadioButtonMenuItem to bug8031573.java
JDK-8277407 javax/swing/plaf/synth/SynthButtonUI/6276188/bug6276188.java fails to compile after JDK-8276058
JDK-8300269 The selected item in an editable JComboBox with titled border is not visible in Aqua LAF
JDK-8269269 [macos11] SystemIconTest fails with ClassCastException
JDK-8266510 Nimbus JTree default tree cell renderer does not use selected text color
JDK-8269951 [macos] Focus not painted in JButton when setBorderPainted(false) is invoked
JDK-8273366 [testbug] javax/swing/UIDefaults/6302464/bug6302464.java fails on macOS12
JDK-8276058 Some swing test fails on specific CI macos system
JDK-8282958 Rendering Issues with Borders on Windows High-DPI systems
JDK-8227257 javax/swing/JFileChooser/4847375/bug4847375.java fails with AssertionError
JDK-6928542 Chinese characters in RTF are not decoded
JDK-8294427 Check boxes and radio buttons have rendering issues on Windows in High DPI env
JDK-8268284 javax/swing/JComponent/7154030/bug7154030.java fails with "Exception: Failed to hide opaque button"
JDK-8137101 [TEST_BUG] javax/swing/plaf/basic/BasicHTML/4251579/bug4251579.java failure due to timing
JDK-8271895 UnProblemList javax/swing/JComponent/7154030/bug7154030.java in JDK18
JDK-8273043 [TEST_BUG] Automate NimbusJTreeSelTextColor.java
JDK-8273638 javax/swing/JTable/4235420/bug4235420.java fails in GTK L&F
JDK-8273634 [TEST_BUG] Improve javax/swing/text/ParagraphView/6364882/bug6364882.java
JDK-8274465 Fix javax/swing/text/ParagraphView/6364882/bug6364882.java failures
JDK-8017175 [TESTBUG] javax/swing/JPopupMenu/4634626/bug4634626.java sometimes failed on mac
JDK-8277396 [TESTBUG] In DefaultButtonModelCrashTest.java, frame is accessed from main thread
JDK-8284884 Replace polling with waiting in javax/swing/text/html/parser/Parser/8078268/bug8078268.java
JDK-8286846 test/jdk/javax/swing/plaf/aqua/CustomComboBoxFocusTest.java fails on mac aarch64
JDK-8287876 The recently de-problemlisted TestTitledBorderLeak test is unstable
JDK-6445283 ProgressMonitorInputStream not large file aware (>2GB)
JDK-8293811 Provide a reason for PassFailJFrame.forceFail
JDK-8277775 Fixup bugids in RemoveDropTargetCrashTest.java - add 4357905
JDK-8297450 ScaledTextFieldBorderTest.java fails when run with -show parameter
JDK-8300205 Swing test bug8078268 make latch timeout configurable
JDK-8306955 Open source several JComboBox jtreg tests
JDK-8307080 Open source some more JComboBox jtreg tests
JDK-8299713 Test javax/swing/JTableHeader/6889007/bug6889007.java failed: Wrong type of cursor
JDK-8307133 Open source some JTable jtreg tests
JDK-8307130 Open source few Swing JMenu tests
JDK-8309095 Remove UTF-8 character from TaskbarPositionTest.java
JDK-8310238 [test bug] javax/swing/JTableHeader/6889007/bug6889007.java fails
JDK-8294535 Add screen capture functionality to PassFailJFrame
JDK-8315600 Open source few more headless Swing misc tests
JDK-8315606 Open source few swing text/html tests
JDK-8315594 Open source few headless Swing misc tests
JDK-8315761 Open source few swing JList and JMenuBar tests
JDK-8315731 Open source several Swing Text related tests
JDK-8316106 Open source few swing JInternalFrame and JMenuBar tests
JDK-8316053 Open some swing tests 3
JDK-8315986 [macos14] javax/swing/JMenuItem/4654927/bug4654927.java: component must be showing on the screen to determine its location
JDK-8321151 JDK-8294427 breaks Windows L&F on all older Windows versions
JDK-8301342 Prefer ArrayList to LinkedList in LayoutComparator

core-libs

Fix Versions Bug Synopsis
8 9 10 11 12 13 14 15 16 17 18 19 20 21 22 23
JDK-8275735 [linux] Remove deprecated Metrics api (kernel memory limit)
JDK-8278028 [test-library] Warnings cleanup of the test library
JDK-8286029 Add classpath exemption to globals_vectorApiSupport_***.S.inc
JDK-8287596 Reorg jdk.test.lib.util.ForceGC
JDK-8286705 GCC 12 reports use-after-free potential bugs
JDK-8287867 Bad merge of jdk/test/lib/util/ForceGC.java causing test compilation error
JDK-8269850 Most JDK releases report macOS version 12 as 10.16 instead of 12.0
JDK-8284992 Fix misleading Vector API doc for LSHR operator
JDK-8287663 Add a regression test for JDK-8287073
JDK-8319922 libCreationTimeHelper.so fails to link in JDK 21
JDK-8272866 java.util.random package summary contains incorrect mixing function in table
JDK-8273450 Fix the copyright header of SVML files
JDK-8273315 Parallelize and increase timeouts for java/foreign/TestMatrix.java test
JDK-8273351 bad tag in jdk.random module-info.java
JDK-8276572 Fake libsyslookup.so library causes tooling issues
JDK-8278014 [vectorapi] Remove test run script
JDK-8282143 Objects.requireNonNull should be ForceInline
JDK-8283059 Uninitialized warning in check_code.c with GCC 11.2
JDK-8286473 Drop --enable-preview from Record related tests
JDK-8286694 Incorrect argument processing in java launcher
JDK-8287073 NPE from CgroupV2Subsystem.getInstance()
JDK-8284977 MetricsTesterCgroupV2.getLongValueEntryFromFile fails when named value doesn't exist
JDK-8230374 maxOutputSize, instead of javatest.maxOutputSize, should be used in TEST.properties
JDK-8293887 AArch64 build failure with GCC 12 due to maybe-uninitialized warning in libfdlibm k_rem_pio2.c
JDK-8294837 unify Windows 2019 version check in os_windows and java_props_md
JDK-8301190 [vectorapi] The typeChar of LaneType is incorrect when default locale is tr

core-libs/java.io

Fix Versions Bug Synopsis
8 9 10 11 12 13 14 15 16 17 18 19 20 21 22 23
JDK-8315034 File.mkdirs() occasionally fails to create folders on Windows shared folder
JDK-8275536 Add test to check that File::lastModified returns same time stamp as Files.getLastModifiedTime
JDK-8320798 Console read line with zero out should zero out underlying buffer
JDK-8291911 java/io/File/GetXSpace.java fails with "53687091200 != 161051996160"
JDK-8298619 java/io/File/GetXSpace.java is failing
JDK-8274122 java/io/File/createTempFile/SpecialTempFile.java fails in Windows 11
JDK-8272369 java/io/File/GetXSpace.java failed with "RuntimeException: java.nio.file.NoSuchFileException: /run/user/0"
JDK-8251466 test/java/io/File/GetXSpace.java fails on Windows with mapped network drives.
JDK-8309216 Cast from jchar* to char* in test java/io/GetXSpace.java
JDK-8275145 file.encoding system property has an incorrect value on Windows
JDK-8275650 Problemlist java/io/File/createTempFile/SpecialTempFile.java for Windows 11
JDK-8285445 cannot open file "NUL:"
JDK-8208077 File.listRoots performance degradation
JDK-8305646 compile error on Alpine with gcc12 after 8298619 in libGetXSpace.c
JDK-8273961 jdk/nio/zipfs/ZipFSTester.java fails if file path contains '+' character
JDK-8274750 java/io/File/GetXSpace.java failed: '/dev': 191488 != 190976
JDK-8276623 JDK-8275650 accidentally pushed "out" file
JDK-8285523 Improve test java/io/FileOutputStream/OpenNUL.java
JDK-8292698 Improve performance of DataInputStream
JDK-8319958 test/jdk/java/io/File/libGetXSpace.c does not compile on Windows 32-bit
JDK-8322417 Console read line with zero out should zero out when throwing exception
JDK-8322772 Clean up code after JDK-8322417

core-libs/java.io:serialization

Fix Versions Bug Synopsis
8 9 10 11 12 13 14 15 16 17 18 19 20 21 22 23
JDK-8277093 Vector should throw ClassNotFoundException for a missing class of an element
JDK-8277072 ObjectStreamClass caches keep ClassLoaders alive
JDK-8278065 Refactor subclassAudits to use ClassValue
JDK-8268595 java/io/Serializable/serialFilter/GlobalFilterTest.java#id1 failed in timeout
JDK-8280041 Retry loop issues in java.io.ClassCache
JDK-8283276 java/io/ObjectStreamClass/ObjectStreamClassCaching.java fails with various GCs

core-libs/java.lang

Fix Versions Bug Synopsis
8 9 10 11 12 13 14 15 16 17 18 19 20 21 22 23
JDK-8272600 (test) Use native "sleep" in Basic.java
JDK-8276880 Remove java/lang/RuntimeTests/exec/ExecWithDir as unnecessary
JDK-8280124 Reduce branches decoding latin-1 chars from UTF-8 encoded bytes
JDK-8313621 test/jdk/jdk/internal/math/FloatingDecimal/TestFloatingDecimal should use RandomFactory
JDK-8287541 Files.writeString fails to throw IOException for charset "windows-1252"
JDK-8285987 executing shell scripts without #! fails on Alpine linux
JDK-8297530 java.lang.IllegalArgumentException: Negative length on strings concatenation
JDK-8286191 misc tests fail due to JDK-8285987
JDK-8279833 Loop optimization issue in String.encodeUTF8_UTF16
JDK-8275703 System.loadLibrary fails on Big Sur for libraries hidden from filesystem
JDK-8282219 jdk/java/lang/ProcessBuilder/Basic.java fails on AIX
JDK-8282008 Incorrect handling of quoted arguments in ProcessBuilder
JDK-8286287 Reading file as UTF-16 causes Error which "shouldn't happen"
JDK-8288589 Files.readString ignores encoding errors for UTF-16
JDK-8276651 java/lang/ProcessHandle tests fail with "RuntimeException: Input/output error" in java.lang.ProcessHandleImpl$Info.info0
JDK-8307990 jspawnhelper must close its writing side of a pipe before reading from it
JDK-8310265 (process) jspawnhelper should not use argv[0]
JDK-8311645 Memory leak in jspawnhelper spawnChild after JDK-8307990
JDK-8211002 test/jdk/java/lang/Math/PowTests.java skips testing for non-corner-case values
JDK-8270476 Make floating-point test infrastructure more lambda and method reference friendly
JDK-8284165 Add pid to process reaper thread name
JDK-8285690 CloneableReference subtest should not throw CloneNotSupportedException
JDK-8289569 [test] java/lang/ProcessBuilder/Basic.java fails on Alpine/musl
JDK-8290899 java/lang/String/StringRepeat.java test requests too much heap on windows x86
JDK-8304314 StackWalkTest.java fails after CODETOOLS-7903373
JDK-8310838 Correct range notations in MethodTypeDesc specification
JDK-8314094 java/lang/ProcessHandle/InfoTest.java fails on Windows when run as user with Administrator privileges
JDK-8317834 java/lang/Thread/IsAlive.java timed out

core-libs/java.lang.invoke

Fix Versions Bug Synopsis
8 9 10 11 12 13 14 15 16 17 18 19 20 21 22 23
JDK-8272836 Limit run time for java/lang/invoke/LFCaching tests
JDK-8274848 LambdaMetaFactory::metafactory on REF_invokeSpecial impl method has incorrect behavior
JDK-8287671 Adjust ForceGC to invoke System::gc fewer times for negative case
JDK-8281168 Micro-optimize VarForm.getMemberName for interpreter
JDK-8292443 Weak CAS VarHandle/Unsafe tests should test always-failing cases
JDK-8292407 Improve Weak CAS VarHandle/Unsafe tests resilience under spurious failures
JDK-8300693 Lower the compile threshold and reduce the iterations of warmup loop in VarHandles tests

core-libs/java.lang.module

Fix Versions Bug Synopsis
8 9 10 11 12 13 14 15 16 17 18 19 20 21 22 23
JDK-8282444 Module finder incorrectly assumes default file system path-separator character
JDK-8275509 ModuleDescriptor.hashCode isn't reproducible across builds
JDK-8257856 Make ClassFileVersionsTest.java robust to JDK version updates
JDK-8290041 ModuleDescriptor.hashCode is inconsistent

core-libs/java.lang:class_loading

Fix Versions Bug Synopsis
8 9 10 11 12 13 14 15 16 17 18 19 20 21 22 23
JDK-8302791 Add specific ClassLoader object to Proxy IllegalArgumentException message
JDK-8287917 System.loadLibrary does not work on Big Sur if JDK is built with macOS SDK 10.15 and earlier
JDK-8293659 Improve UnsatisfiedLinkError error message to include dlopen error details

core-libs/java.lang:reflect

Fix Versions Bug Synopsis
8 9 10 11 12 13 14 15 16 17 18 19 20 21 22 23
JDK-8319436 Proxy.newProxyInstance throws NPE if loader is null and interface not visible from class loader
JDK-8261404 Class.getReflectionFactory() is not thread-safe
JDK-8286474 Drop --enable-preview from Sealed Classes related tests

core-libs/java.math

Fix Versions Bug Synopsis
8 9 10 11 12 13 14 15 16 17 18 19 20 21 22 23
JDK-8272541 Incorrect overflow test in Toom-Cook branch of BigInteger multiplication
JDK-8271616 oddPart in MutableBigInteger::mutableModInverse contains info on final result

core-libs/java.net

Fix Versions Bug Synopsis
8 9 10 11 12 13 14 15 16 17 18 19 20 21 22 23
JDK-8279842 HTTPS Channel Binding support for Java GSS/Kerberos
JDK-8298588 WebSockets: HandshakeUrlEncodingTest unnecessarily depends on a response body
JDK-8268464 Remove dependancy of TestHttpsServer, HttpTransaction, HttpCallback from open/test/jdk/sun/net/www/protocol/https/ tests
JDK-8263364 sun/net/www/http/KeepAliveStream/KeepAliveStreamCloseWithWrongContentLength.java wedged in getInputStream
JDK-8273655 content-types.properties files are missing some common types
JDK-8273142 Remove dependancy of TestHttpServer, HttpTransaction, HttpCallback from open/test/jdk/sun/net/www/protocol/http/ tests
JDK-8278312 Update SimpleSSLContext keystore to use SANs for localhost IP addresses
JDK-8278961 Enable debug logging in java/net/DatagramSocket/SendDatagramToBadAddress.java
JDK-8284892 java/net/httpclient/http2/TLSConnection.java fails intermittently
JDK-8286873 Improve websocket test execution time
JDK-8287593 ShortResponseBody could be made more resilient to rogue connections
JDK-8294958 java/net/httpclient/ConnectTimeout tests are slow
JDK-8295777 java/net/httpclient/ConnectExceptionTest.java should not rely on system resolver
JDK-8299018 java/net/httpclient/HttpsTunnelAuthTest.java fails with java.io.IOException: HTTP/1.1 header parser received no bytes
JDK-8299827 Add resolved IP address in connection exception for sockets
JDK-8301306 java/net/httpclient/* fail with -Xcomp
JDK-8301701 java/net/DatagramSocket/DatagramSocketMulticasting.java should be hardened
JDK-8305858 Resolve multiple definition of 'handleSocketError' when statically linking with JDK native libraries
JDK-8305763 Parsing a URI with an underscore goes through a silent exception, negatively impacting performance
JDK-8305906 HttpClient may use incorrect key when finding pooled HTTP/2 connection for IPv6 address
JDK-8308593 Add KEEPALIVE Extended Socket Options Support for Windows
JDK-8263256 Test java/net/Inet6Address/serialize/Inet6AddressSerializationTest.java fails due to dynamic reconfigurations of network interface during test
JDK-8297569 URLPermission constructor throws IllegalArgumentException: Invalid characters in hostname after JDK-8294378
JDK-8294378 URLPermission constructor exception when using tr locale
JDK-8278067 Make HttpURLConnection default keep alive timeout configurable
JDK-8054022 HttpURLConnection timeouts with Expect: 100-Continue and no chunking
JDK-8308336 Test java/net/HttpURLConnection/HttpURLConnectionExpectContinueTest.java failed: java.net.BindException: Address already in use
JDK-8272702 Resolving URI relative path with no / may lead to incorrect toString
JDK-8299015 Ensure that HttpResponse.BodySubscribers.ofFile writes all bytes
JDK-8309591 Socket.setOption(TCP_QUICKACK) uses wrong level
JDK-8268294 Reusing HttpClient in a WebSocket.Listener hangs.
JDK-8297211 Expensive fillInStackTrace operation in HttpURLConnection.getOutputStream0 when no content-length in response
JDK-8312065 Socket.connect does not timeout when profiling
JDK-8205076 [17u] Inet6AddressImpl.c: `lookupIfLocalHost` accesses `int InetAddress.preferIPv6Address` as a boolean
JDK-8282017 sun/net/www/protocol/https/HttpsURLConnection/B6216082.java fails with "SocketException: Unexpected end of file from server"
JDK-8258951 java/net/httpclient/HandshakeFailureTest.java failed with "RuntimeException: Not found expected SSLHandshakeException in java.io.IOException"
JDK-8274779 HttpURLConnection: HttpClient and HttpsClient incorrectly check request method when set to POST
JDK-8276774 Cookie stored in CookieHandler not sent if user headers contain cookie
JDK-8282293 Domain value for system property jdk.https.negotiate.cbt should be case-insensitive
JDK-8285836 sun/net/www/http/KeepAliveCache/KeepAliveProperty.java failed with "RuntimeException: Failed in server"
JDK-8291637 HttpClient default keep alive timeout not followed if server sends invalid value
JDK-8292381 java/net/httpclient/SpecialHeadersTest.java fails with "ERROR: Shutting down connection: HTTP/2 client stopped"
JDK-8291226 Create Test Cases to cover scenarios for JDK-8278067
JDK-8291638 Keep-Alive timeout of 0 should close connection immediately
JDK-8301787 java/net/httpclient/SpecialHeadersTest failing after JDK-8301306
JDK-8269481 SctpMultiChannel never releases own file descriptor
JDK-8269993 [Test]: java/net/httpclient/DigestEchoClientSSL.java contains redundant @run tags
JDK-8263531 Remove unused buffer int
JDK-8238274 (sctp) JDK-7118373 is not fixed for SctpChannel
JDK-8270290 NTLM authentication fails if HEAD request is used
JDK-8274561 sun/net/ftp/TestFtpTimeValue.java timed out on slow machines
JDK-8267256 Extend minimal retry for loopback connections on Windows to PlainSocketImpl
JDK-8269258 java/net/httpclient/ManyRequestsLegacy.java failed with connection timeout
JDK-8280414 Memory leak in DefaultProxySelector
JDK-8280868 LineBodyHandlerTest.java creates and discards too many clients
JDK-8061729 Update java/net tests to eliminate dependency on sun.net.www.MessageHeader and some other internal APIs
JDK-8286293 Tests ShortResponseBody and ShortResponseBodyWithRetry should use less resources
JDK-8286962 java/net/httpclient/ServerCloseTest.java failed once with ConnectException
JDK-8290083 ResponseBodyBeforeError: AssertionError or SSLException: Unsupported or unrecognized SSL message
JDK-8292586 simplify cleanups in NTLMAuthSequence getCredentialsHandle
JDK-8293562 KeepAliveCache Blocks Threads while Closing Connections
JDK-8223783 sun/net/www/http/HttpClient/MultiThreadTest.java sometimes detect threads+1 connections
JDK-8304174 Remove delays from httpserver tests
JDK-8309340 Provide sctpHandleSocketErrorWithMessage
JDK-8301457 Code in SendPortZero.java is uncommented even after JDK-8236852 was fixed
JDK-8314517 some tests fail in case ipv6 is disabled on the machine
JDK-8320168 handle setsocktopt return values
JDK-8314164 java/net/HttpURLConnection/HttpURLConnectionExpectContinueTest.java fails intermittently in timeout

core-libs/java.nio

Fix Versions Bug Synopsis
8 9 10 11 12 13 14 15 16 17 18 19 20 21 22 23
JDK-8298726 (fs) Change PollingWatchService to record last modified time as FileTime rather than milliseconds
JDK-8280944 Enable Unix domain sockets in Windows Selector notification mechanism
JDK-8283756 (zipfs) ZipFSOutputStreamTest.testOutputStream should only check inflated bytes
JDK-8285956 (fs) Excessive default poll interval in PollingWatchService
JDK-8290197 test/jdk/java/nio/file/Files/probeContentType/Basic.java fails on some systems for the ".rar" extension
JDK-8316304 (fs) Add support for BasicFileAttributes.creationTime() for Linux
JDK-8269280 (bf) Replace StringBuffer in *Buffer.toString()
JDK-8294717 (bf) DirectByteBuffer constructor will leak if allocating Deallocator or Cleaner fails with OOME
JDK-8174819 java/nio/file/WatchService/LotsOfEvents.java fails intermittently
JDK-8140241 (fc) Data transfer from FileChannel to itself causes hang in case of overlap
JDK-8277159 Fix java/nio/file/FileStore/Basic.java test by ignoring /run/user/* mount points
JDK-8272095 ProblemList java/nio/channels/FileChannel/Transfer2GPlus.java on linux-aarch64
JDK-8272047 java/nio/channels/FileChannel/Transfer2GPlus.java failed with Unexpected transfer size: 2147418112
JDK-8233020 (fs) UnixFileSystemProvider should use StaticProperty.userDir().
JDK-8271308 (fc) FileChannel.transferTo() transfers no more than Integer.MAX_VALUE bytes in one call
JDK-8265261 java/nio/file/Files/InterruptCopy.java fails with java.lang.RuntimeException: Copy was not interrupted
JDK-8274562 (fs) UserDefinedFileAttributeView doesn't correctly determine if supported when using OverlayFS
JDK-8280233 Temporarily disable Unix domain sockets in Windows PipeImpl
JDK-8190753 (zipfs): Accessing a large entry (> 2^31 bytes) leads to a negative initial size for ByteArrayOutputStream
JDK-8251329 (zipfs) Files.walkFileTree walks infinitely if zip has dir named "." inside
JDK-8272964 java/nio/file/Files/InterruptCopy.java fails with java.lang.RuntimeException: Copy was not interrupted
JDK-8273935 (zipfs) Files.getFileAttributeView() throws UOE instead of returning null when view not supported
JDK-8274171 java/nio/file/Files/probeContentType/Basic.java failed on "Content type" mismatches
JDK-8276260 (se) Remove java/nio/channels/Selector/Wakeup.java from ProblemList (win)
JDK-8276845 (fs) java/nio/file/spi/SetDefaultProvider.java fails on x86_32
JDK-8278172 java/nio/channels/FileChannel/BlockDeviceSize.java should only run on Linux
JDK-8278346 java/nio/file/Files/probeContentType/Basic.java fails on Linux SLES15 machine
JDK-8279536 jdk/nio/zipfs/ZipFSOutputStreamTest.java timed out
JDK-8280241 (aio) AsynchronousSocketChannel init fails in IPv6 only Windows env
JDK-8280896 java/nio/file/Files/probeContentType/Basic.java fails on Windows 11
JDK-8289584 (fs) Print size values in java/nio/file/FileStore/Basic.java when they differ by > 1GiB
JDK-8292636 (dc) Problem listing of java/nio/channels/DatagramChannel/Unref.java has incorrect issue ID
JDK-8305993 Add handleSocketErrorWithMessage to extend nio Net.c exception message
JDK-8307425 Socket input stream read burns CPU cycles with back-to-back poll(0) calls
JDK-8281149 (fs) java/nio/file/FileStore/Basic.java fails with java.lang.RuntimeException: values differ by more than 1GB
JDK-8308300 enhance exceptions in MappedMemoryUtils.c
JDK-8309778 java/nio/file/Files/CopyAndMove.java fails when using second test directory
JDK-8309302 java/net/Socket/Timeouts.java fails with AssertionError on test temporal post condition
JDK-8317603 Improve exception messages thrown by sun.nio.ch.Net native methods (win)
JDK-8310807 java/nio/channels/DatagramChannel/Connect.java timed out

core-libs/java.nio.charsets

Fix Versions Bug Synopsis
8 9 10 11 12 13 14 15 16 17 18 19 20 21 22 23
JDK-8275863 Use encodeASCII for ASCII-compatible DoubleByte encodings
JDK-8310631 test/jdk/sun/nio/cs/TestCharsetMapping.java is spuriously passing
JDK-8301119 Support for GB18030-2022

core-libs/java.rmi

Fix Versions Bug Synopsis
8 9 10 11 12 13 14 15 16 17 18 19 20 21 22 23
JDK-8318705 [macos] ProblemList java/rmi/registry/multipleRegistries/MultipleRegistries.java
JDK-8286114 [test] show real exception in bomb call in sun/rmi/runtime/Log/checkLogging/CheckLogging.java

core-libs/java.sql

Fix Versions Bug Synopsis
8 9 10 11 12 13 14 15 16 17 18 19 20 21 22 23
JDK-8266974 duplicate property key in java.sql.rowset resource bundle

core-libs/java.text

Fix Versions Bug Synopsis
8 9 10 11 12 13 14 15 16 17 18 19 20 21 22 23
JDK-8299617 CurrencySymbols.properties is missing the copyright notice
JDK-8282929 Localized monetary symbols are not reflected in `toLocalizedPattern` return value
JDK-8295564 Norwegian Nynorsk Locale is missing formatting
JDK-8299439 java/text/Format/NumberFormat/CurrencyFormat.java fails for hr_HR
JDK-8264792 The NumberFormat for locale sq_XK formats price incorrectly.
JDK-8190748 java/text/Format/DateFormat/DateFormatTest.java and NonGregorianFormatTest fail intermittently
JDK-8299483 ProblemList java/text/Format/NumberFormat/CurrencyFormat.java

core-libs/java.time

Fix Versions Bug Synopsis
8 9 10 11 12 13 14 15 16 17 18 19 20 21 22 23
JDK-8296108 (tz) Update Timezone Data to 2022f
JDK-8305505 NPE in javazic compiler
JDK-8276536 Update TimeZoneNames files to follow the changes made by JDK-8275766
JDK-8274407 (tz) Update Timezone Data to 2021c
JDK-8275766 (tz) Update Timezone Data to 2021e
JDK-8275849 TestZoneInfo310.java fails with tzdata2021e
JDK-8278434 timeouts in test java/time/test/java/time/format/TestZoneTextPrinterParser.java
JDK-8283350 (tz) Update Timezone Data to 2022a
JDK-8294357 (tz) Update Timezone Data to 2022d
JDK-8295173 (tz) Update Timezone Data to 2022e
JDK-8305113 (tz) Update Timezone Data to 2023c
JDK-8322725 (tz) Update Timezone Data to 2023d
JDK-8325150 (tz) Update Timezone Data to 2024a
JDK-8272473 Parsing epoch seconds at a DST transition with a non-UTC parser is wrong
JDK-8291825 java/time/nontestng/java/time/zone/CustomZoneNameTest.java fails if defaultLocale and defaultFormatLocale are different
JDK-8293834 Update CLDR data following tzdata 2022c update
JDK-8304976 Optimize DateTimeFormatterBuilder.ZoneTextPrinterParser.getTree()
JDK-8308880 [17u] micro bench ZoneStrings missed in backport of 8278434

core-libs/java.util

Fix Versions Bug Synopsis
8 9 10 11 12 13 14 15 16 17 18 19 20 21 22 23
JDK-8276904 Optional.toString() is unnecessarily expensive
JDK-8295000 java/util/Formatter/Basic test cleanup
JDK-8280550 SplittableRandom#nextDouble(double,double) can return result >= bound
JDK-8299677 Formatter.format might take a long time to format an integer or floating-point
JDK-8273514 java/util/DoubleStreamSums/CompensatedSums.java failure
JDK-8280950 RandomGenerator:NextDouble() default behavior non conformant after JDK-8280550 fix
JDK-8281183 RandomGenerator:NextDouble() default behavior partially fixed by JDK-8280950
JDK-8284771 java/util/zip/CloseInflaterDeflaterTest.java failed with "AssertionError: Expected IOException to be thrown, but nothing was thrown"
JDK-8273162 AbstractSplittableWithBrineGenerator does not create a random salt
JDK-8272326 java/util/Random/RandomTestMoments.java had two Gaussian fails
JDK-8273056 java.util.random does not correctly sample exponential or Gaussian distributions
JDK-8282551 Properly initialize L32X64MixRandom state
JDK-8284866 Add test to JDK-8273056
JDK-8274517 java/util/DoubleStreamSums/CompensatedSums.java fails with expected [true] but found [false]
JDK-8308803 Improve java/util/UUID/UUIDTest.java
JDK-8314883 Java_java_util_prefs_FileSystemPreferences_lockFile0 write result errno in missing case
JDK-8315751 RandomTestBsi1999 fails often with timeouts on Linux ppc64le

core-libs/java.util.concurrent

Fix Versions Bug Synopsis
8 9 10 11 12 13 14 15 16 17 18 19 20 21 22 23
JDK-8292877 java/util/concurrent/atomic/Serial.java uses {Double,Long}Accumulator incorrectly
JDK-8274349 ForkJoinPool.commonPool() does not work with 1 CPU
JDK-8301637 ThreadLocalRandom.current().doubles().parallel() contention
JDK-8300098 java/util/concurrent/ConcurrentHashMap/ConcurrentAssociateTest.java fails with internal timeout when executed with TieredCompilation1/3
JDK-8301216 ForkJoinPool invokeAll() ignores timeout
JDK-8308047 java/util/concurrent/ScheduledThreadPoolExecutor/BasicCancelTest.java timed out and also had jcmd pipe errors
JDK-8315683 Parallelize java/util/concurrent/tck/JSR166TestCase.java
JDK-8317960 [17u] Excessive CPU usage on AbstractQueuedSynchronized.isEnqueued

core-libs/java.util.jar

Fix Versions Bug Synopsis
8 9 10 11 12 13 14 15 16 17 18 19 20 21 22 23
JDK-8295530 Update Zlib Data Compression Library to Version 1.2.13
JDK-8299748 java/util/zip/Deinflate.java failing on s390x
JDK-8193682 Infinite loop in ZipOutputStream.close()
JDK-8278794 Infinite loop in DeflaterOutputStream.finish()
JDK-8277087 ZipException: zip END header not found at ZipFile#Source.findEND
JDK-8282036 Change java/util/zip/ZipFile/DeleteTempJar.java to stop HttpServer cleanly in case of exceptions
JDK-8313765 Invalid CEN header (invalid zip64 extra data field size)
JDK-8286582 Build fails on macos aarch64 when using --with-zlib=bundled
JDK-8286623 Bundle zlib by default with JDK on macos aarch64
JDK-8307403 java/util/zip/DeInflate.java timed out

core-libs/java.util.logging

Fix Versions Bug Synopsis
8 9 10 11 12 13 14 15 16 17 18 19 20 21 22 23
JDK-8283719 java/util/logging/CheckZombieLockTest.java failing intermittently
JDK-8314263 Signed jars triggering Logger finder recursion and StackOverflowError
JDK-8315696 SignedLoggerFinderTest.java test failed
JDK-8293819 sun/util/logging/PlatformLoggerTest.java failed with "RuntimeException: Retrieved backing PlatformLogger level null is not the expected CONFIG"
JDK-8316087 Test SignedLoggerFinderTest.java is still failing

core-libs/java.util.regex

Fix Versions Bug Synopsis
8 9 10 11 12 13 14 15 16 17 18 19 20 21 22 23
JDK-8271302 Regex Test Refresh
JDK-8269753 Misplaced caret in PatternSyntaxException's detail message
JDK-8273169 java/util/regex/NegativeArraySize.java failed after JDK-8271302
JDK-8299388 java/util/regex/NegativeArraySize.java fails on Alpine and sometimes Windows

core-libs/java.util.stream

Fix Versions Bug Synopsis
8 9 10 11 12 13 14 15 16 17 18 19 20 21 22 23
JDK-8214761 Bug in parallel Kahan summation implementation
JDK-8247980 Exclusive execution of java/util/stream tests slows down tier1
JDK-8294705 Disable an assertion in test/jdk/java/util/DoubleStreamSums/CompensatedSums.java

core-libs/java.util:i18n

Fix Versions Bug Synopsis
8 9 10 11 12 13 14 15 16 17 18 19 20 21 22 23
JDK-8274658 ISO 4217 Amendment 170 Update
JDK-8283277 ISO 4217 Amendment 171 Update
JDK-8289549 ISO 4217 Amendment 172 Update
JDK-8292899 CustomTzIDCheckDST.java testcase failed on AIX platform
JDK-8294307 ISO 4217 Amendment 173 Update
JDK-8296239 ISO 4217 Amendment 174 Update
JDK-8305400 ISO 4217 Amendment 175 Update
JDK-8321480 ISO 4217 Amendment 176 Update
JDK-8274864 Remove Amman/Cairo hacks in ZoneInfoFile
JDK-8286154 Fix 3rd party notices in test files
JDK-8287180 Update IANA Language Subtag Registry to Version 2022-08-08
JDK-8310923 Refactor Currency tests to use JUnit
JDK-8273924 ArrayIndexOutOfBoundsException thrown in java.util.JapaneseImperialCalendar.add()
JDK-8273790 Potential cyclic dependencies between Gregorian and CalendarSystem
JDK-8275721 Name of UTC timezone in a locale changes depending on previous code
JDK-8282227 Locale information for nb is not working properly
JDK-8272352 Java launcher can not parse Chinese character when system locale is set to UTF-8
JDK-8296715 CLDR v42 update for tzdata 2022f
JDK-8299194 CustomTzIDCheckDST.java may fail at future date
JDK-8303440 The "ZonedDateTime.parse" may not accept the "UTC+XX" zone id
JDK-8282887 Potential memory leak in sun.util.locale.provider.HostLocaleProviderAdapterImpl.getNumberPattern() on Windows
JDK-8267038 Update IANA Language Subtag Registry to Version 2022-03-02
JDK-8287896 PropertiesTest.sh fail on msys2
JDK-8287902 UnreadableRB case in MissingResourceCauseTest is not working reliably on Windows
JDK-8288377 [REDO] DST not applying properly with zone id offset set with TZ env variable
JDK-6381945 (cal) Japanese calendar unit test system should avoid multiple static imports
JDK-8210410 Refactor java.util.Currency:i18n shell tests to plain java tests

core-libs/javax.naming

Fix Versions Bug Synopsis
8 9 10 11 12 13 14 15 16 17 18 19 20 21 22 23
JDK-8287672 jtreg test com/sun/jndi/ldap/LdapPoolTimeoutTest.java fails intermittently in nightly run
JDK-8301367 Add exception handler method to the BaseLdapServer
JDK-8277795 LDAP connection timeout not honoured under contention
JDK-8313657 com.sun.jndi.ldap.Connection.cleanup does not close connections on SocketTimeoutErrors
JDK-8314063 The socket is not closed in Connection::createSocket when the handshake failed for LDAP connection
JDK-8272996 JNDI DNS provider fails to resolve SRV entries when IPV6 stack is enabled
JDK-8275535 Retrying a failed authentication on multiple LDAP servers can lead to users blocked
JDK-8317307 test/jdk/com/sun/jndi/ldap/LdapPoolTimeoutTest.java fails with ConnectException: Connection timed out: no further information

core-libs/javax.script

Fix Versions Bug Synopsis
8 9 10 11 12 13 14 15 16 17 18 19 20 21 22 23
JDK-8319668 Fixup of jar filename typo in BadFactoryTest.sh

core-svc

Fix Versions Bug Synopsis
8 9 10 11 12 13 14 15 16 17 18 19 20 21 22 23
JDK-8283279 [Testbug] Improve TestGetSwapSpaceSize
JDK-8274716 JDWP Spec: the description for the Dispose command confuses suspend with resume.
JDK-8293540 [Metrics] Incorrectly detected resource limits with additional cgroup fs mounts
JDK-8294740 Add cgroups keyword to TestDockerBasic.java
JDK-8277992 Add fast jdk_svc subtests to jdk:tier3
JDK-8289695 [TESTBUG] TestMemoryAwareness.java fails on cgroups v2 and crun
JDK-8307347 serviceability/sa/ClhsdbDumpclass.java could leave files owned by root on macOS

core-svc/debugger

Fix Versions Bug Synopsis
8 9 10 11 12 13 14 15 16 17 18 19 20 21 22 23
JDK-8210927 JDB tests do not update source path after doing a redefine class
JDK-8279669 test/jdk/com/sun/jdi/TestScaffold.java uses wrong condition
JDK-8294881 test/hotspot/jtreg/vmTestbase/nsk/jdi/VirtualMachine/dispose/dispose003/TestDescription.java fails
JDK-8283717 vmTestbase/nsk/jdi/ThreadStartEvent/thread/thread001 failed due to SocketTimeoutException
JDK-8276990 Memory leak in invoker.c fillInvokeRequest() during JDI operations
JDK-8284094 Memory leak in invoker_completeInvokeRequest()
JDK-8317920 JDWP-agent sends broken exception event with onthrow option
JDK-8281615 Deadlock caused by jdwp agent
JDK-8256811 Delayed/missed jdwp class unloading events
JDK-8291650 Add delay to ClassUnloadEventTest before exiting to give time for JVM to send all events before VMDeath
JDK-8289400 Improve com/sun/jdi/TestScaffold error reporting
JDK-8270434 JDI+UT: Unexpected event in JDI tests
JDK-8273909 vmTestbase/nsk/jdi/Event/request/request001 can still fail with "ERROR: new event is not ThreadStartEvent"
JDK-8273921 Refactor NSK/JDI tests to create thread using factory
JDK-8274621 NullPointerException because listenAddress[0] is null
JDK-8274687 JDWP deadlocks if some Java thread reaches wait in blockOnDebuggerSuspend
JDK-8176567 nsk/jdi/ReferenceType/instances/instances002: TestFailure: Unexpected size of referenceType.instances(nsk.share.jdi.TestInterfaceImplementer1): 11, expected: 10
JDK-8231491 JDI tc02x004 failed again due to wrong # of breakpoints
JDK-8286844 com/sun/jdi/RedefineCrossEvent.java failed with 1 threads completed while VM suspended
JDK-8244976 vmTestbase/nsk/jdi/Event/request/request001.java doesn' initialize eName
JDK-8292880 Improve debuggee logging for com/sun/jdi/ClassUnloadEventTest.java
JDK-8308232 nsk/jdb tests don't pass -verbose flag to the debuggee
JDK-8232839 JDI AfterThreadDeathTest.java failed due to "FAILED: Did not get expected IllegalThreadStateException on a StepRequest.enable()"
JDK-8310551 vmTestbase/nsk/jdb/interrupt/interrupt001/interrupt001.java timed out due to missing prompt
JDK-8318957 Enhance agentlib:jdwp help output by info about allow option
JDK-8318736 com/sun/jdi/JdwpOnThrowTest.java failed with "transport error 202: bind failed: Address already in use"

core-svc/java.lang.instrument

Fix Versions Bug Synopsis
8 9 10 11 12 13 14 15 16 17 18 19 20 21 22 23
JDK-8280889 java/lang/instrument/GetObjectSizeIntrinsicsTest.java fails with -XX:-UseCompressedOops
JDK-8292778 EncodingSupport_md.c convertUtf8ToPlatformString wrong placing of free
JDK-8273575 memory leak in appendBootClassPath(), paths must be deallocated
JDK-8280166 Extend java/lang/instrument/GetObjectSizeIntrinsicsTest.java test cases
JDK-8292261 adjust timeouts in JLI GetObjectSizeIntrinsicsTest.java
JDK-8295424 adjust timeout for another JLI GetObjectSizeIntrinsicsTest.java subtest
JDK-8299957 Enhance error logging in instrument coding with additional jplis_assert_msg
JDK-8301377 adjust timeout for JLI GetObjectSizeIntrinsicsTest.java subtest again
JDK-8318410 jdk/java/lang/instrument/BootClassPath/BootClassPathTest.sh fails on Japanese Windows

core-svc/java.lang.management

Fix Versions Bug Synopsis
8 9 10 11 12 13 14 15 16 17 18 19 20 21 22 23
JDK-8300659 Refactor TestMemoryAwareness to use WhiteBox api for host values
JDK-8268361 Fix the infinite loop in next_line
JDK-8289440 Remove vmTestbase/nsk/monitoring/MemoryPoolMBean/isCollectionUsageThresholdExceeded/isexceeded003 from ProblemList.txt
JDK-8292066 Convert TestInputArgument.sh and TestSystemLoadAvg.sh to java version
JDK-8300119 CgroupMetrics.getTotalMemorySize0() can report invalid results on 32 bit systems
JDK-8198668 MemoryPoolMBean/isUsageThresholdExceeded/isexceeded001/TestDescription.java still failing
JDK-8292541 [Metrics] Reported memory limit may exceed physical machine memory
JDK-8274522 java/lang/management/ManagementFactory/MXBeanException.java test fails with Shenandoah
JDK-8274523 java/lang/management/MemoryMXBean/MemoryTest.java test should handle Shenandoah
JDK-8283903 GetContainerCpuLoad does not return the correct result in share mode
JDK-8288599 com/sun/management/OperatingSystemMXBean/TestTotalSwap.java: Expected total swap size ... but getTotalSwapSpaceSize returned ...
JDK-8290909 MemoryPoolMBean/isUsageThresholdExceeded tests failed with "isUsageThresholdExceeded() returned false, and is still false, while threshold = MMMMMMM and used peak = NNNNNNN"
JDK-8305502 adjust timeouts in three more M&M tests
JDK-8304074 [JMX] Add an approximation of total bytes allocated on the Java heap by the JVM
JDK-8316445 Mark com/sun/management/HotSpotDiagnosticMXBean/CheckOrigin.java as vm.flagless

core-svc/javax.management

Fix Versions Bug Synopsis
8 9 10 11 12 13 14 15 16 17 18 19 20 21 22 23
JDK-8281377 Remove vmTestbase/nsk/monitoring/ThreadMXBean/ThreadInfo/Deadlock/JavaDeadlock001/TestDescription.java from problemlist.
JDK-8292067 Convert test/sun/management/jmxremote/bootstrap shell tests to java version
JDK-8293335 sun/management/jmxremote/bootstrap/RmiBootstrapTest.java#id1failed with "Agent communication error: java.io.EOFException"
JDK-8293657 sun/management/jmxremote/bootstrap/RmiBootstrapTest.java#id1 failed with "SSLHandshakeException: Remote host terminated the handshake"
JDK-8206187 javax/management/remote/mandatory/connection/DefaultAgentFilterTest.java fails with Port already in use
JDK-8293343 sun/management/jmxremote/bootstrap/RmiSslNoKeyStoreTest.java failed with "Agent communication error: java.io.EOFException"
JDK-6779701 Wrong defect ID in the code of test LocalRMIServerSocketFactoryTest.java

core-svc/tools

Fix Versions Bug Synopsis
8 9 10 11 12 13 14 15 16 17 18 19 20 21 22 23
JDK-8317705 ProblemList sun/tools/jstat/jstatLineCountsX.sh on linux-ppc64le and aix due to JDK-8248691
JDK-8195809 [TESTBUG] jps and jcmd -l support for containers is not tested
JDK-8268433 serviceability/dcmd/framework/VMVersionTest.java fails with Unable to send object throw not established PipeIO Listener Thread connection
JDK-8209595 MonitorVmStartTerminate.java timed out
JDK-8303937 Corrupted heap dumps due to missing retries for os::write()
JDK-8267666 Add option to jcmd GC.heap_dump to use existing file
JDK-8269616 serviceability/dcmd/framework/VMVersionTest.java fails with Address already in use error
JDK-8272318 Improve performance of HeapDumpAllTest
JDK-8276139 TestJpsHostName.java not reliable, better to expand HostIdentifierCreate.java test
JDK-8313815 The exception messages printed by jcmd ManagementAgent.start are corrupted on Japanese Windows

docs

Fix Versions Bug Synopsis
8 9 10 11 12 13 14 15 16 17 18 19 20 21 22 23
JDK-8306408 Fix the format of several tables in building.md
JDK-8303130 Document required Accessibility permissions on macOS

docs/hotspot

Fix Versions Bug Synopsis
8 9 10 11 12 13 14 15 16 17 18 19 20 21 22 23
JDK-8280543 Update the "java" and "jcmd" tool specification for CDS

globalization/translation

Fix Versions Bug Synopsis
8 9 10 11 12 13 14 15 16 17 18 19 20 21 22 23
JDK-8283870 jdeprscan --help causes an exception when the locale is ja, zh_CN or de

hotspot

Fix Versions Bug Synopsis
8 9 10 11 12 13 14 15 16 17 18 19 20 21 22 23
JDK-8297656 AArch64: Enable AES/GCM Intrinsics
JDK-8272970 Parallelize runtime/InvocationTests/

hotspot/compiler

Fix Versions Bug Synopsis
8 9 10 11 12 13 14 15 16 17 18 19 20 21 22 23
JDK-8272791 java -XX:BlockZeroingLowLimit=1 crashes after 8270947
JDK-8271008 appcds/*/MethodHandlesAsCollectorTest.java tests time out because of excessive GC (CodeCache GC Threshold) in loom
JDK-8244675 assert(IncrementalInline || (_late_inlines.length() == 0 && !has_mh_late_inlines()))
JDK-8275643 C2's unaryOp vector intrinsic does not properly handle LongVector.neg
JDK-8286625 C2 fails with assert(!n->is_Store() && !n->is_LoadStore()) failed: no node with a side effect
JDK-8270447 [IR Framework] Add missing compilation level restriction when using FlipC1C2 stress option
JDK-8276711 compiler/codecache/cli tests failing when SegmentedCodeCache used with -Xint
JDK-8284980 Test vmTestbase/nsk/stress/except/except010.java times out with -Xcomp -XX:+DeoptimizeALot
JDK-8317507 C2 compilation fails with "Exceeded _node_regs array"
JDK-8318889 C2: add bailout after assert Bad graph detected in build_loop_late
JDK-8270947 AArch64: C1: use zero_words to initialize all objects
JDK-8272736 [JVMCI] Add API for reading and writing JVMCI thread locals
JDK-8279412 [JVMCI] failed speculations list must outlive any nmethod that refers to it
JDK-8272094 compiler/codecache/TestStressCodeBuffers.java crashes with "failed to allocate space for trampoline"
JDK-8242115 C2 SATB barriers are not safepoint-safe
JDK-8295066 Folding of loads is broken in C2 after JDK-8242115
JDK-8285835 SIGSEGV in PhaseIdealLoop::build_loop_late_post_work
JDK-8299570 [JVMCI] Insufficient error handling when CodeBuffer is exhausted
JDK-8300590 [JVMCI] BytecodeFrame.equals is broken
JDK-8302172 [JVMCI] HotSpotResolvedJavaMethodImpl.canBeInlined must respect ForceInline
JDK-8296136 Use correct register in aarch64_enc_fast_unlock()
JDK-8294902 Undefined Behavior in C2 regalloc with null references
JDK-8301489 C1: ShortLoopOptimizer might lift instructions before their inputs
JDK-8316414 C2: large byte array clone triggers "failed: malformed control flow" assertion failure on linux-x86
JDK-8324050 Issue store-store barrier after re-materializing objects during deoptimization
JDK-8287217 C2: PhaseCCP: remove not visited nodes, prevent type inconsistency
JDK-8290822 C2: assert in PhaseIdealLoop::do_unroll() is subject to undefined behavior
JDK-8272574 C2: assert(false) failed: Bad graph detected in build_loop_late
JDK-8276108 Wrong instruction generation in aarch64 backend
JDK-8279837 C2: assert(is_Loop()) failed: invalid node class: Region
JDK-8293044 C1: Missing access check on non-accessible class
JDK-8303154 Investigate and improve instruction cache flushing during compilation
JDK-8313402 C1: Incorrect LoadIndexed value numbering
JDK-8275645 [JVMCI] avoid unaligned volatile reads on AArch64
JDK-8275874 [JVMCI] only support aligned reads in c2v_readFieldValue
JDK-8279076 C2: Bad AD file when matching SqrtF with UseSSE=0
JDK-8280867 Cpuid1Ecx feature parsing is incorrect for AMD CPUs
JDK-8279822 CI: Constant pool entries in error state are not supported
JDK-8283408 Fix a C2 crash when filling arrays with unsafe
JDK-8282528 AArch64: Incorrect replicate2L_zero rule
JDK-8285923 [REDO] JDK-8285802 AArch64: Consistently handle offsets in MacroAssembler as 64-bit quantities
JDK-8284944 assert(cnt++ < 40) failed: infinite cycle in loop optimization
JDK-8287396 LIR_Opr::vreg_number() and data() can return negative number
JDK-8290705 StringConcat::validate_mem_flow asserts with "unexpected user: StoreI"
JDK-8290451 Incorrect result when switching to C2 OSR compilation from C1
JDK-8292301 [REDO v2] C2 crash when allocating array of size too large
JDK-8297968 Crash in PrintOptoAssembly
JDK-8296318 use-def assert: special case undetected loops nested in infinite loops
JDK-8296412 Special case infinite loops with unmerged backedges in IdealLoopTree::check_safepts
JDK-8302595 use-after-free related to GraphKit::clone_map
JDK-8201516 DebugNonSafepoints generates incorrect information
JDK-8303564 C2: "Bad graph detected in build_loop_late" after a CMove is wrongly split thru phi
JDK-8308192 Error in parsing replay file when staticfield is an array of single dimension
JDK-8302736 Major performance regression in Math.log on aarch64
JDK-8310126 C1: Missing receiver null check in Reference::get intrinsic
JDK-8312440 assert(cast != nullptr) failed: must have added a cast to pin the node
JDK-8304954 SegmentedCodeCache fails when using large pages
JDK-8312909 C1 should not inline through interface calls with non-subtype receiver
JDK-8313626 C2 crash due to unexpected exception control flow
JDK-8316679 C2 SuperWord: wrong result, load should not be moved before store if not comparable
JDK-8272973 Incorrect compile command used by TestIllegalArrayCopyBeforeInfiniteLoop
JDK-8271855 [TESTBUG] Wrong weakCompareAndSet assumption in UnsafeIntrinsicsTest
JDK-8278016 Add compiler tests to tier{2,3}
JDK-8277893 Arraycopy stress tests
JDK-8279668 x86: AVX2 versions of vpxor should be asserted
JDK-8271055 Crash during deoptimization with "assert(bb->is_reachable()) failed: getting result from unreachable basicblock" with -XX:+VerifyStack
JDK-8282049 AArch64: Use ZR for integer zero immediate volatile stores
JDK-8283187 C2: loop candidate for superword not always unrolled fully if superword fails
JDK-8280872 Reorder code cache segments to improve code density
JDK-8286263 compiler/c1/TestPinnedIntrinsics.java failed with "RuntimeException: testCurrentTimeMillis failed with -3"
JDK-8287425 Remove unnecessary register push for MacroAssembler::check_klass_subtype_slow_path
JDK-8289512 Fix GCC 12 warnings for adlc output_c.cpp
JDK-8288992 AArch64: CMN should be handled the same way as CMP
JDK-8292385 assert(ctrl == kit.control()) failed: Control flow was added although the intrinsic bailed out
JDK-8294217 Assertion failure: parsing found no loops but there are some
JDK-8294947 Use 64bit atomics in patch_verified_entry on x86_64
JDK-8302594 use-after-free in Node::destruct
JDK-8313676 Amend TestLoadIndexedMismatch test to target intrinsic directly
JDK-8316178 Better diagnostic header for CodeBlobs
JDK-8316514 Better diagnostic header for VtableStub
JDK-8314220 Configurable InlineCacheBuffer size
JDK-8276036 The value of full_count in the message of insufficient codecache is wrong
JDK-8282045 When loop strip mining fails, safepoints are removed from loop anyway
JDK-8301338 Identical branch conditions in CompileBroker::print_heapinfo
JDK-8305690 [X86] Do not emit two REX prefixes in Assembler::prefix
JDK-8307147 [x86] Dangling pointer warning for Assembler::_attributes
JDK-8315549 CITime misreports code/total nmethod sizes
JDK-8271589 Fatal error with variable shift count integer rotate operation.
JDK-8274060 C2: Incorrect computation after JDK-8273454
JDK-8274527 Minimal VM build fails after JDK-8273459
JDK-8277928 Fix compilation on macosx-aarch64 after 8276108
JDK-8289856 [PPC64] SIGSEGV in C2Compiler::init_c2_runtime() after JDK-8289060
JDK-8322985 [BACKOUT] 8318562: Computational test more than 2x slower when AVX instructions are used
JDK-8270098 ZGC: ZBarrierSetC2::clone_at_expansion fails with "Guard against surprises" assert
JDK-8271925 ZGC: Arraycopy stub passes invalid oop to load barrier
JDK-8272131 PhaseMacroExpand::generate_slow_arraycopy crash when clone null CallProjections.fallthrough_ioproj
JDK-8271276 C2: Wrong JVM state used for receiver null check
JDK-8272570 C2: crash in PhaseCFG::global_code_motion
JDK-8273165 GraphKit::combine_exception_states fails with "matching stack sizes" assert
JDK-8270533 AArch64: size_fits_all_mem_uses should return false if its output is a CAS
JDK-8271954 C2: assert(false) failed: Bad graph detected in build_loop_late
JDK-8271459 C2: Missing NegativeArraySizeException when creating StringBuilder with negative capacity
JDK-8274145 C2: condition incorrectly made redundant with dominating main loop exit condition
JDK-8276157 C2: Compiler stack overflow during escape analysis on Linux x86_32
JDK-8276112 Inconsistent scalar replacement debug info at safepoints
JDK-8277529 SIGSEGV in C2 CompilerThread Node::rematerialize() compiling Packet::readUnsignedTrint
JDK-8273108 RunThese24H crashes with SEGV in markWord::displaced_mark_helper() after JDK-8268276
JDK-8275638 GraphKit::combine_exception_states fails with "matching stack sizes" assert
JDK-8278871 [JVMCI] assert((uint)reason < 2* _trap_hist_limit) failed: oob
JDK-8279356 Method linking fails with guarantee(mh->adapter() != NULL) failed: Adapter blob must already exist!
JDK-8276799 Implementation of JEP 422: Linux/RISC-V Port
JDK-8282555 Missing memory edge when spilling MoveF2I, MoveD2L etc
JDK-8286638 C2: CmpU needs to do more precise over/underflow analysis
JDK-8287091 aarch64 : guarantee(val < (1ULL << nbits)) failed: Field too big for insn
JDK-8287491 compiler/jvmci/errors/TestInvalidDebugInfo.java fails new assert: assert((uint)t < T_CONFLICT + 1) failed: invalid type #
JDK-8287432 C2: assert(tn->in(0) != __null) failed: must have live top node
JDK-8288360 CI: ciInstanceKlass::implementor() is not consistent for well-known classes
JDK-8289197 [17u] Push of backport of 8286177 did not remove assertion
JDK-8288445 AArch64: C2 compilation fails with guarantee(!true || (true && (shift != 0))) failed: impossible encoding
JDK-8290082 [PPC64] ZGC C2 load barrier stub needs to preserve vector registers
JDK-8289127 Apache Lucene triggers: DEBUG MESSAGE: duplicated predicate failed which is impossible
JDK-8290529 C2: assert(BoolTest(btest).is_canonical()) failure
JDK-8292158 AES-CTR cipher state corruption with AVX-512
JDK-8294538 missing is_unloading() check in SharedRuntime::fixup_callers_callsite()
JDK-8296821 compiler/jvmci/jdk.vm.ci.code.test/src/jdk/vm/ci/code/test/NativeCallTest.java fails after JDK-8262901
JDK-8295788 C2 compilation hits "assert((mode == ControlAroundStripMined && use == sfpt) || !use->is_reachable_from_root()) failed: missed a node"
JDK-8300584 Accelerate AVX-512 CRC32C for small buffers
JDK-8307572 AArch64: Vector registers are clobbered by some macroassemblers
JDK-8313262 C2: Sinking node may cause required cast to be dropped
JDK-8314024 SIGSEGV in PhaseIdealLoop::build_loop_late_post_work due to bad immediate dominator info
JDK-8316392 compiler/interpreter/TestVerifyStackAfterDeopt.java failed with SIGBUS in PcDescContainer::find_pc_desc_internal
JDK-8321599 Data loss in AVX3 Base64 decoding
JDK-8288302 Shenandoah: SIGSEGV in vm maybe related to jit compiling xerces
JDK-8268261 C2: assert(n != __null) failed: Bad immediate dominator info.
JDK-8268019 C2: assert(no_dead_loop) failed: dead loop detected
JDK-8270886 Crash in PhaseIdealLoop::verify_strip_mined_scheduling
JDK-8271203 C2: assert(iff->Opcode() == Op_If || iff->Opcode() == Op_CountedLoopEnd || iff->Opcode() == Op_RangeCheck) failed: Check this code when new subtype is added
JDK-8223923 C2: Missing interference with mismatched unsafe accesses