LABEL HISTORY REPORT: jdk17u-fix-yes

Report generated: Thu Feb 29 16:34:41 CET 2024

Date Added Added By Bug Synopsis
2024-02-29 Goetz Lindenmaier JDK-8325496 Make TrimNativeHeapInterval a product switch
2024-02-29 Goetz Lindenmaier JDK-8325213 Flags introduced by configure script are not passed to ADLC build
2024-02-29 Goetz Lindenmaier JDK-8323717 Introduce test keyword for tests that need external dependencies
2024-02-28 Christoph Langer JDK-8326942 [17u] Backout "8325254: CKA_TOKEN private and secret keys are not necessarily sensitive"
2024-02-28 Goetz Lindenmaier JDK-8324723 GHA: Upgrade some actions to avoid deprecated Node 16
2024-02-28 Goetz Lindenmaier JDK-8294156 Allow PassFailJFrame.Builder to create test UI
2024-02-28 Goetz Lindenmaier JDK-8316053 Open some swing tests 3
2024-02-28 Goetz Lindenmaier JDK-8315726 Open source several AWT applet tests
2024-02-27 Goetz Lindenmaier JDK-8325254 CKA_TOKEN private and secret keys are not necessarily sensitive
2024-02-27 Goetz Lindenmaier JDK-8324050 Issue store-store barrier after re-materializing objects during deoptimization
2024-02-27 Goetz Lindenmaier JDK-8326794 Bump update version for OpenJDK: jdk-17.0.12
2024-02-27 Christoph Langer JDK-8310380 Handle problems in core-related tests on macOS when codesign tool does not work
2024-02-27 Christoph Langer JDK-8278312 Update SimpleSSLContext keystore to use SANs for localhost IP addresses
2024-02-26 Christoph Langer JDK-8305962 update jcstress to 0.16
2024-02-26 Goetz Lindenmaier JDK-8326000 Remove obsolete comments for class sun.security.ssl.SunJSSE
2024-02-26 Goetz Lindenmaier JDK-8294158 HTML formatting for PassFailJFrame instructions
2024-02-23 Goetz Lindenmaier JDK-8294535 Add screen capture functionality to PassFailJFrame
2024-02-23 Christoph Langer JDK-8290041 ModuleDescriptor.hashCode is inconsistent
2024-02-23 Christoph Langer JDK-8288846 misc tests fail "assert(ms < 1000) failed: Un-interruptable sleep, short time use only"
2024-02-23 Goetz Lindenmaier JDK-8323515 Create test alias "all" for all test roots
2024-02-23 Goetz Lindenmaier JDK-8324647 Invalid test group of lib-test after JDK-8323515
2024-02-23 Goetz Lindenmaier JDK-8321151 JDK-8294427 breaks Windows L&F on all older Windows versions
2024-02-22 Robo Duke JDK-8321408 Add Certainly roots R1 and E1
2024-02-21 Severin Gehwolf JDK-8323640 [TESTBUG]testMemoryFailCount in jdk/internal/platform/docker/TestDockerMemoryMetrics.java always fail because OOM killed
2024-02-21 Goetz Lindenmaier JDK-8314830 runtime/ErrorHandling/ tests ignore external VM flags
2024-02-21 Goetz Lindenmaier JDK-8311893 Interactive component with ARIA role 'tabpanel' does not have a programmatically associated name
2024-02-21 Goetz Lindenmaier JDK-8314164 java/net/HttpURLConnection/HttpURLConnectionExpectContinueTest.java fails intermittently in timeout
2024-02-20 Robo Duke JDK-8306408 Fix the format of several tables in building.md
2024-02-19 Goetz Lindenmaier JDK-8325585 Remove no longer necessary calls to set/unset-in-asgct flag in JDK 17
2024-02-19 Goetz Lindenmaier JDK-8318468 compiler/tiered/LevelTransitionTest.java fails with -XX:CompileThreshold=100 -XX:TieredStopAtLevel=1
2024-02-19 Goetz Lindenmaier JDK-8308336 Test java/net/HttpURLConnection/HttpURLConnectionExpectContinueTest.java failed: java.net.BindException: Address already in use
2024-02-16 Christoph Langer JDK-8290203 ProblemList vmTestbase/nsk/jvmti/scenarios/capability/CM03/cm03t001/TestDescription.java on linux-all
2024-02-15 Goetz Lindenmaier JDK-8318603 Parallelize sun/java2d/marlin/ClipShapeTest.java
2024-02-15 Goetz Lindenmaier JDK-8324347 Enable "maybe-uninitialized" warning for FreeType 2.13.1
2024-02-15 Goetz Lindenmaier JDK-8324514 ClassLoaderData::print_on should print address of class loader
2024-02-14 Goetz Lindenmaier JDK-8274122 java/io/File/createTempFile/SpecialTempFile.java fails in Windows 11
2024-02-14 Goetz Lindenmaier JDK-8315602 Open source swing security manager test
2024-02-09 Goetz Lindenmaier JDK-8322783 prioritize /etc/os-release over /etc/SuSE-release in hs_err/info output
2024-02-09 Goetz Lindenmaier JDK-8323331 fix typo hpage_pdm_size
2024-02-09 Goetz Lindenmaier JDK-8322098 os::Linux::print_system_memory_info enhance the THP output with /sys/kernel/mm/transparent_hugepage/hpage_pmd_size
2024-02-09 Severin Gehwolf JDK-8325150 (tz) Update Timezone Data to 2024a
2024-02-07 Goetz Lindenmaier JDK-8325096 Test java/security/cert/CertPathBuilder/akiExt/AKISerialNumber.java is failing
2024-02-05 Goetz Lindenmaier JDK-8321480 ISO 4217 Amendment 176 Update
2024-02-05 Goetz Lindenmaier JDK-8320168 handle setsocktopt return values
2024-02-03 Christoph Langer JDK-8324937 GHA: Avoid multiple test suites per job
2024-02-03 Christoph Langer JDK-8323637 Capture hotspot replay files in GHA
2024-02-01 Goetz Lindenmaier JDK-8310923 Refactor Currency tests to use JUnit
2024-02-01 Goetz Lindenmaier JDK-8280241 (aio) AsynchronousSocketChannel init fails in IPv6 only Windows env
2024-01-30 Robo Duke JDK-8321815 Shenandoah: gc state should be synchronized to java threads only once per safepoint
2024-01-30 Goetz Lindenmaier JDK-8315611 Open source swing text/html and tree test
2024-01-29 Christoph Langer JDK-8317144 Exclude sun/security/pkcs11/sslecc/ClientJSSEServerJSSE.java on Linux ppc64le
2024-01-29 Goetz Lindenmaier JDK-8310807 java/nio/channels/DatagramChannel/Connect.java timed out
2024-01-29 Goetz Lindenmaier JDK-8315986 [macos14] javax/swing/JMenuItem/4654927/bug4654927.java: component must be showing on the screen to determine its location
2024-01-29 Goetz Lindenmaier JDK-8319922 libCreationTimeHelper.so fails to link in JDK 21
2024-01-29 Goetz Lindenmaier JDK-8318607 Enable parallelism in vmTestbase/nsk/stress/jni tests
2024-01-29 Goetz Lindenmaier JDK-8209595 MonitorVmStartTerminate.java timed out
2024-01-29 Goetz Lindenmaier JDK-8316304 (fs) Add support for BasicFileAttributes.creationTime() for Linux
2024-01-29 Goetz Lindenmaier JDK-8316106 Open source few swing JInternalFrame and JMenuBar tests
2024-01-29 Goetz Lindenmaier JDK-8311081 KeytoolReaderP12Test.java fail on localized Windows platform
2024-01-29 Goetz Lindenmaier JDK-8309870 Using -proc:full should be considered requesting explicit annotation processing
2024-01-29 Goetz Lindenmaier JDK-8261404 Class.getReflectionFactory() is not thread-safe
2024-01-29 Goetz Lindenmaier JDK-8276125 RunThese24H.java SIGSEGV in JfrThreadGroup::thread_group_id
2024-01-29 Goetz Lindenmaier JDK-8324659 GHA: Generic jtreg errors are not reported
2024-01-29 Goetz Lindenmaier JDK-8315761 Open source few swing JList and JMenuBar tests
2024-01-29 Goetz Lindenmaier JDK-8315600 Open source few more headless Swing misc tests
2024-01-26 Goetz Lindenmaier JDK-8324280 RISC-V: Incorrect implementation in VM_Version::parse_satp_mode
2024-01-25 Goetz Lindenmaier JDK-8316947 Write a test to check textArea triggers MouseEntered/MouseExited events properly
2024-01-24 Christoph Langer JDK-8210410 Refactor java.util.Currency:i18n shell tests to plain java tests
2024-01-24 Christoph Langer JDK-8296631 NSS tests failing on OL9 linux-aarch64 hosts
2024-01-24 Christoph Langer JDK-8313575 Refactor PKCS11Test tests
2024-01-24 Christoph Langer JDK-8306014 Update javax.net.ssl TLS tests to use SSLContextTemplate or SSLEngineTemplate
2024-01-24 Christoph Langer JDK-8281585 Remove unused imports under test/lib and jtreg/gc
2024-01-24 Goetz Lindenmaier JDK-8324184 Windows VS2010 build failed with "error C2275: 'int64_t'"
2024-01-24 Goetz Lindenmaier JDK-8323243 JNI invocation of an abstract instance method corrupts the stack
2024-01-24 Goetz Lindenmaier JDK-8323086 Shenandoah: Heap could be corrupted by oom during evacuation
2024-01-24 Goetz Lindenmaier JDK-8310238 [test bug] javax/swing/JTableHeader/6889007/bug6889007.java fails
2024-01-24 Goetz Lindenmaier JDK-8308245 Add -proc:full to describe current default annotation processing policy
2024-01-24 Goetz Lindenmaier JDK-8281543 Remove unused code/headerfile dtraceAttacher.hpp
2024-01-24 Goetz Lindenmaier JDK-8272811 Document the effects of building with _GNU_SOURCE in os_posix.hpp
2024-01-23 Goetz Lindenmaier JDK-8322321 Add man page doc for -XX:+VerifySharedSpaces
2024-01-23 Goetz Lindenmaier JDK-8319436 Proxy.newProxyInstance throws NPE if loader is null and interface not visible from class loader
2024-01-23 Goetz Lindenmaier JDK-8307955 Prefer to PTRACE_GETREGSET instead of PTRACE_GETREGS in method 'ps_proc.c::process_get_lwp_regs'
2024-01-22 Christoph Langer JDK-8318490 Increase timeout for JDK tests that are close to the limit when run with libgraal
2024-01-22 Christoph Langer JDK-8317807 JAVA_FLAGS removed from jtreg running in JDK-8317039
2024-01-22 Christoph Langer JDK-8317039 Enable specifying the JDK used to run jtreg
2024-01-22 Christoph Langer JDK-8312428 PKCS11 tests fail with NSS 3.91
2024-01-22 Christoph Langer JDK-8313206 PKCS11 tests silently skip execution
2024-01-22 Christoph Langer JDK-8309305 sun/security/ssl/SSLSocketImpl/BlockedAsyncClose.java fails with jtreg test timeout
2024-01-22 Christoph Langer JDK-8311581 Remove obsolete code and comments in TestLVT.java
2024-01-22 Christoph Langer JDK-8319213 Compatibility.java reads both stdout and stderr of JdkUtils
2024-01-22 Goetz Lindenmaier JDK-8169475 WheelModifier.java fails by timeout
2024-01-19 Christoph Langer JDK-8319124 Update XML Security for Java to 3.0.3
2024-01-19 Robo Duke JDK-8317771 [macos14] Expand/collapse a JTree using keyboard freezes the application in macOS 14 Sonoma
2024-01-18 Christoph Langer JDK-8323008 filter out harmful -std* flags added by autoconf from CXX
2024-01-17 Christoph Langer JDK-8323806 [17u] VS2017 build fails with warning after 8293117.
2024-01-17 Christoph Langer JDK-8318971 Better Error Handling for Jar Tool When Processing Non-existent Files
2024-01-17 Christoph Langer JDK-8320300 Adjust hs_err output in malloc/mmap error cases
2024-01-17 Christoph Langer JDK-8310631 test/jdk/sun/nio/cs/TestCharsetMapping.java is spuriously passing
2024-01-17 Christoph Langer JDK-8305972 Update XML Security for Java to 3.0.2
2024-01-17 Christoph Langer JDK-8311986 Disable runtime/os/TestTracePageSizes.java for ShenandoahGC
2024-01-17 Goetz Lindenmaier JDK-8315594 Open source few headless Swing misc tests
2024-01-17 Goetz Lindenmaier JDK-8318154 Improve stability of WheelModifier.java test
2024-01-15 Christoph Langer JDK-8309462 [AIX] vmTestbase/nsk/jvmti/RunAgentThread/agentthr001/TestDescription.java crashing due to empty while loop
2024-01-15 Goetz Lindenmaier JDK-8323428 Shenandoah: Unused memory in regions compacted during a full GC should be mangled
2024-01-15 Goetz Lindenmaier JDK-8305906 HttpClient may use incorrect key when finding pooled HTTP/2 connection for IPv6 address
2024-01-10 Christoph Langer JDK-8307185 pkcs11 native libraries make JNI calls into java code while holding GC lock
2024-01-10 Christoph Langer JDK-8309302 java/net/Socket/Timeouts.java fails with AssertionError on test temporal post condition
2024-01-10 Christoph Langer JDK-8272853 improve `JavadocTester.runTests`
2024-01-10 Goetz Lindenmaier JDK-8310844 [AArch64] C1 compilation fails because monitor offset in OSR buffer is too large for immediate
2024-01-09 Goetz Lindenmaier JDK-8322583 RISC-V: Enable fast class initialization checks
2024-01-09 Goetz Lindenmaier JDK-6928542 Chinese characters in RTF are not decoded
2024-01-09 Goetz Lindenmaier JDK-8322725 (tz) Update Timezone Data to 2023d
2024-01-08 Christoph Langer JDK-8322883 [BACKOUT] 8225377: type annotations are not visible to javac plugins across compilation boundaries
2024-01-08 Goetz Lindenmaier JDK-8322772 Clean up code after JDK-8322417
2024-01-07 Christoph Langer JDK-8303605 Memory leaks in Metaspace gtests
2024-01-07 Christoph Langer JDK-8278028 [test-library] Warnings cleanup of the test library
2024-01-07 Christoph Langer JDK-8321599 Data loss in AVX3 Base64 decoding
2024-01-07 Christoph Langer JDK-8318608 Enable parallelism in vmTestbase/nsk/stress/threads tests
2024-01-07 Christoph Langer JDK-8316693 Simplify at-requires checkDockerSupport()
2024-01-06 Goetz Lindenmaier JDK-8322985 [BACKOUT] 8318562: Computational test more than 2x slower when AVX instructions are used
2024-01-06 Goetz Lindenmaier JDK-8286045 Use ForceGC for cleaner test cases
2024-01-06 Goetz Lindenmaier JDK-8323021 Shenandoah: Encountered reference count always attributed to first worker thread
2024-01-05 Goetz Lindenmaier JDK-8320208 Update Public Suffix List to b5bf572
2024-01-05 Goetz Lindenmaier JDK-8293547 Add relaxed add_and_fetch for macos aarch64 atomics
2024-01-05 Goetz Lindenmaier JDK-8320921 GHA: Parallelize hotspot_compiler test jobs
2024-01-05 Goetz Lindenmaier JDK-8315731 Open source several Swing Text related tests
2024-01-04 Goetz Lindenmaier JDK-8322968 [17u] Amend Atomics gtest with 1-byte tests
2024-01-04 Goetz Lindenmaier JDK-8315042 NPE in PKCS7.parseOldSignedData
2024-01-03 Goetz Lindenmaier JDK-8318961 increase javacserver connection timeout values and max retry attempts
2024-01-02 Goetz Lindenmaier JDK-8320937 support latest VS2022 MSC_VER in abstract_vm_version.cpp
2023-12-30 Christoph Langer JDK-8316414 C2: large byte array clone triggers "failed: malformed control flow" assertion failure on linux-x86
2023-12-30 Christoph Langer JDK-8316001 GC: Make TestArrayAllocatorMallocLimit use createTestJvm
2023-12-30 Christoph Langer JDK-8304696 Duplicate class names in dynamicArchive tests can lead to test failure
2023-12-29 Christoph Langer JDK-8322417 Console read line with zero out should zero out when throwing exception
2023-12-29 Goetz Lindenmaier JDK-8318957 Enhance agentlib:jdwp help output by info about allow option
2023-12-26 Goetz Lindenmaier JDK-8281377 Remove vmTestbase/nsk/monitoring/ThreadMXBean/ThreadInfo/Deadlock/JavaDeadlock001/TestDescription.java from problemlist.
2023-12-23 Christoph Langer JDK-8315034 File.mkdirs() occasionally fails to create folders on Windows shared folder
2023-12-23 Christoph Langer JDK-8261837 SIGSEGV in ciVirtualCallTypeData::translate_from
2023-12-22 Christoph Langer JDK-8316679 C2 SuperWord: wrong result, load should not be moved before store if not comparable
2023-12-22 Christoph Langer JDK-8315920 C2: "control input must dominate current control" assert failure
2023-12-22 Christoph Langer JDK-8274621 NullPointerException because listenAddress[0] is null
2023-12-22 Christoph Langer JDK-8319668 Fixup of jar filename typo in BadFactoryTest.sh
2023-12-22 Christoph Langer JDK-8316392 compiler/interpreter/TestVerifyStackAfterDeopt.java failed with SIGBUS in PcDescContainer::find_pc_desc_internal
2023-12-22 Christoph Langer JDK-8305356 Fix ignored bad CompileCommands in tests
2023-12-22 Christoph Langer JDK-8278363 Create extented container test groups
2023-12-22 Christoph Langer JDK-8318983 Fix comment typo in PKCS12Passwd.java
2023-12-22 Christoph Langer JDK-8319456 jdk/jfr/event/gc/collection/TestGCCauseWith[Serial|Parallel].java : GC cause 'GCLocker Initiated GC' not in the valid causes
2023-12-22 Christoph Langer JDK-8318689 jtreg is confused when folder name is the same as the test name
2023-12-22 Christoph Langer JDK-8316445 Mark com/sun/management/HotSpotDiagnosticMXBean/CheckOrigin.java as vm.flagless
2023-12-22 Goetz Lindenmaier JDK-8321972 test runtime/Unsafe/InternalErrorTest.java timeout on linux-riscv64 platform
2023-12-21 Goetz Lindenmaier JDK-8313816 Accessing jmethodID might lead to spurious crashes
2023-12-21 Goetz Lindenmaier JDK-8318955 Add ReleaseIntArrayElements in Java_sun_awt_X11_XlibWrapper_SetBitmapShape XlbWrapper.c to early return
2023-12-21 Goetz Lindenmaier JDK-8316028 Update FreeType to 2.13.2
2023-12-21 Goetz Lindenmaier JDK-8318410 jdk/java/lang/instrument/BootClassPath/BootClassPathTest.sh fails on Japanese Windows
2023-12-20 Christoph Langer JDK-8317307 test/jdk/com/sun/jndi/ldap/LdapPoolTimeoutTest.java fails with ConnectException: Connection timed out: no further information
2023-12-20 Christoph Langer JDK-8311160 [macOS, Accessibility] VoiceOver: No announcements on JRadioButtonMenuItem and JCheckBoxMenuItem
2023-12-20 Goetz Lindenmaier JDK-8313082 Enable CreateCoredumpOnCrash for testing in makefiles
2023-12-20 Robo Duke JDK-8205076 [17u] Inet6AddressImpl.c: `lookupIfLocalHost` accesses `int InetAddress.preferIPv6Address` as a boolean
2023-12-20 Robo Duke JDK-8318183 C2: VM may crash after hitting node limit
2023-12-20 Robo Duke JDK-8307926 Support byte-sized atomic bitset operations
2023-12-20 Robo Duke JDK-8286312 Stop mixing signed and unsigned types in bit operations
2023-12-19 Robo Duke JDK-8263256 Test java/net/Inet6Address/serialize/Inet6AddressSerializationTest.java fails due to dynamic reconfigurations of network interface during test
2023-12-19 Robo Duke JDK-8313621 test/jdk/jdk/internal/math/FloatingDecimal/TestFloatingDecimal should use RandomFactory
2023-12-18 Christoph Langer JDK-8309733 [macOS, Accessibility] VoiceOver: Incorrect announcements of JRadioButton
2023-12-18 Goetz Lindenmaier JDK-8318562 Computational test more than 2x slower when AVX instructions are used
2023-12-15 Christoph Langer JDK-8320798 Console read line with zero out should zero out underlying buffer
2023-12-15 Christoph Langer JDK-8283400 [macos] a11y : Screen magnifier does not reflect JRadioButton value change
2023-12-15 Christoph Langer JDK-8274060 C2: Incorrect computation after JDK-8273454
2023-12-15 Goetz Lindenmaier JDK-8283626 AArch64: Set relocInfo::offset_unit to 4
2023-12-15 Goetz Lindenmaier JDK-8314220 Configurable InlineCacheBuffer size
2023-12-15 Goetz Lindenmaier JDK-8315680 java/lang/ref/ReachabilityFenceTest.java should run with -Xbatch
2023-12-15 Goetz Lindenmaier JDK-8320597 RSA signature verification fails on signed data that does not encode params correctly
2023-12-14 Severin Gehwolf JDK-8321215 Incorrect x86 instruction encoding for VSIB addressing mode
2023-12-14 Goetz Lindenmaier JDK-8302017 Allocate BadPaddingException only if it will be thrown
2023-12-14 Goetz Lindenmaier JDK-8297968 Crash in PrintOptoAssembly
2023-12-14 Goetz Lindenmaier JDK-8273454 C2: Transform (-a)*(-b) into a*b
2023-12-14 Goetz Lindenmaier JDK-8295068 SSLEngine throws NPE parsing CertificateRequests
2023-12-14 Goetz Lindenmaier JDK-8293117 Add atomic bitset functions
2023-12-14 Goetz Lindenmaier JDK-8274632 Possible pointer overflow in PretouchTask chunk claiming
2023-12-13 Christoph Langer JDK-7167356 (javac) investigate failing tests in JavacParserTest
2023-12-13 Christoph Langer JDK-8294254 [macOS] javax/swing/plaf/aqua/CustomComboBoxFocusTest.java failure
2023-12-13 Christoph Langer JDK-8274634 Use String.equals instead of String.compareTo in java.desktop
2023-12-13 Goetz Lindenmaier JDK-8317507 C2 compilation fails with "Exceeded _node_regs array"
2023-12-13 Goetz Lindenmaier JDK-8316415 Parallelize sun/security/rsa/SignedObjectChain.java subtests
2023-12-13 Goetz Lindenmaier JDK-8054022 HttpURLConnection timeouts with Expect: 100-Continue and no chunking
2023-12-13 Goetz Lindenmaier JDK-8295124 Atomic::add to pointer type may return wrong value
2023-12-13 Goetz Lindenmaier JDK-8271616 oddPart in MutableBigInteger::mutableModInverse contains info on final result
2023-12-12 Goetz Lindenmaier JDK-8316929 Shenandoah: Shenandoah degenerated GC and full GC need to cleanup old OopMapCache entries
2023-12-12 Goetz Lindenmaier JDK-8271118 C2: StressGCM should have higher priority than frequency-based policy
2023-12-08 Christoph Langer JDK-8310838 Correct range notations in MethodTypeDesc specification
2023-12-08 Christoph Langer JDK-8299494 Test vmTestbase/nsk/stress/except/except011.java failed: ExceptionInInitializerError: target class not found
2023-12-08 Christoph Langer JDK-8300269 The selected item in an editable JComboBox with titled border is not visible in Aqua LAF
2023-12-08 Christoph Langer JDK-8286846 test/jdk/javax/swing/plaf/aqua/CustomComboBoxFocusTest.java fails on mac aarch64
2023-12-08 Goetz Lindenmaier JDK-8320001 javac crashes while adding type annotations to the return type of a constructor
2023-12-08 Goetz Lindenmaier JDK-8283994 Make Xerces DatatypeException stackless
2023-12-07 Christoph Langer JDK-8310106 sun.security.ssl.SSLHandshake.getHandshakeProducer() incorrectly checks handshakeConsumers
2023-12-07 Christoph Langer JDK-7148092 [macosx] When Alt+down arrow key is pressed, the combobox popup does not appear.
2023-12-07 Christoph Langer JDK-8054572 [macosx] JComboBox paints the border incorrectly
2023-12-07 Christoph Langer JDK-8290399 [macos] Aqua LAF does not fire an action event if combo box menu is displayed
2023-12-07 Christoph Langer JDK-7132796 [macosx] closed/javax/swing/JComboBox/4517214/bug4517214.java fails on MacOS
2023-12-07 Goetz Lindenmaier JDK-8313081 MonitoringSupport_lock should be unconditionally initialized after 8304074
2023-12-07 Goetz Lindenmaier JDK-8304074 [JMX] Add an approximation of total bytes allocated on the Java heap by the JVM
2023-12-06 Severin Gehwolf JDK-8301310 The SendRawSysexMessage test may cause a JVM crash
2023-12-06 Christoph Langer JDK-8313643 Update HarfBuzz to 8.2.2
2023-12-06 Christoph Langer JDK-8311645 Memory leak in jspawnhelper spawnChild after JDK-8307990
2023-12-06 Christoph Langer JDK-8307990 jspawnhelper must close its writing side of a pipe before reading from it
2023-12-06 Christoph Langer JDK-8301787 java/net/httpclient/SpecialHeadersTest failing after JDK-8301306
2023-12-06 Christoph Langer JDK-8301306 java/net/httpclient/* fail with -Xcomp
2023-12-04 Christoph Langer JDK-8301846 Invalid TargetDataLine after screen lock when using JFileChooser or COM library
2023-12-04 Christoph Langer JDK-8318951 Additional negative value check in JPEG decoding
2023-12-04 Christoph Langer JDK-8316030 Update Libpng to 1.6.40
2023-12-04 Christoph Langer JDK-8316418 containers/docker/TestMemoryWithCgroupV1.java get OOM killed with Parallel GC
2023-12-04 Christoph Langer JDK-8312434 SPECjvm2008/xml.transform with CDS fails with "can't seal package nu.xom"
2023-12-04 Christoph Langer JDK-8308043 Deadlock in TestCSLocker.java due to blocking GC while allocating
2023-12-04 Christoph Langer JDK-8298087 XML Schema Validation reports an required attribute twice via ErrorHandler
2023-12-04 Christoph Langer JDK-8269258 java/net/httpclient/ManyRequestsLegacy.java failed with connection timeout
2023-12-01 Robo Duke JDK-8287832 jdk/jfr/event/runtime/TestActiveSettingEvent.java failed with "Expected two batches of Active Setting events"
2023-11-30 Christoph Langer JDK-8302149 Speed up compiler/jsr292/methodHandleExceptions/TestAMEnotNPE.java
2023-11-30 Christoph Langer JDK-8292946 GC lock/jni/jnilock001 test failed "assert(gch->gc_cause() == GCCause::_scavenge_alot || !gch->incremental_collection_failed()) failed: Twice in a row"
2023-11-30 Christoph Langer JDK-8289764 gc/lock tests failed with "OutOfMemoryError: Java heap space: failed reallocation of scalar replaced objects"
2023-11-29 Goetz Lindenmaier JDK-8317960 [17u] Excessive CPU usage on AbstractQueuedSynchronized.isEnqueued
2023-11-29 Goetz Lindenmaier JDK-8320363 ppc64 TypeEntries::type_unknown logic looks wrong, missed optimization opportunity
2023-11-29 Goetz Lindenmaier JDK-8288663 JFR: Disabling the JfrThreadSampler commits only a partially disabled state
2023-11-29 Goetz Lindenmaier JDK-8295274 HelidonAppTest.java fails "assert(event->should_commit()) failed: invariant" from compiled frame"
2023-11-29 Goetz Lindenmaier JDK-8320885 Bump update version for OpenJDK: jdk-17.0.11
2023-11-28 Christoph Langer JDK-8315692 Parallelize gc/stress/TestStressRSetCoarsening.java test
2023-11-28 Christoph Langer JDK-8277307 Pre shared key sent under both session_ticket and pre_shared_key extensions
2023-11-28 Christoph Langer JDK-8271566 DSA signature length value is not accurate in P11Signature
2023-11-27 Christoph Langer JDK-8319187 Add three eMudhra emSign roots
2023-11-23 Goetz Lindenmaier JDK-8313781 Add regression tests for large page logging and user-facing error messages
2023-11-23 Goetz Lindenmaier JDK-8313782 Add user-facing warning if THPs are enabled but cannot be used
2023-11-22 Christoph Langer JDK-8293335 sun/management/jmxremote/bootstrap/RmiBootstrapTest.java#id1failed with "Agent communication error: java.io.EOFException"
2023-11-22 Christoph Langer JDK-8293343 sun/management/jmxremote/bootstrap/RmiSslNoKeyStoreTest.java failed with "Agent communication error: java.io.EOFException"
2023-11-22 Goetz Lindenmaier JDK-8316746 Top of lock-stack does not match the unlocked object
2023-11-21 Goetz Lindenmaier JDK-8320209 VectorMaskGen clobbers rflags on x86_64
2023-11-21 Goetz Lindenmaier JDK-8319961 JvmtiEnvBase doesn't zero _ext_event_callbacks
2023-11-21 Goetz Lindenmaier JDK-8310656 RISC-V: __builtin___clear_cache can fail silently.
2023-11-21 Goetz Lindenmaier JDK-8279856 Parallel: Use PreservedMarks to record promotion-failed objects
2023-11-21 Christoph Langer JDK-8317834 java/lang/Thread/IsAlive.java timed out
2023-11-21 Christoph Langer JDK-8320053 GHA: Cross-compile gtest code
2023-11-21 Christoph Langer JDK-8317603 Improve exception messages thrown by sun.nio.ch.Net native methods (win)
2023-11-21 Christoph Langer JDK-8302109 Trivial fixes to btree tests
2023-11-21 Christoph Langer JDK-8292067 Convert test/sun/management/jmxremote/bootstrap shell tests to java version
2023-11-21 Christoph Langer JDK-8262186 Call X509KeyManager.chooseClientAlias once for all key types
2023-11-20 Christoph Langer JDK-8318759 Add four DigiCert root certificates
2023-11-20 Christoph Langer JDK-8307311 Timeouts on one macOS 12.6.1 host of two Swing JTableHeader tests
2023-11-20 Christoph Langer JDK-8294402 Add diagnostic logging to VMProps.checkDockerSupport
2023-11-20 Goetz Lindenmaier JDK-8316645 RISC-V: Remove dependency on libatomic by adding cmpxchg 1b
2023-11-17 Goetz Lindenmaier JDK-8319958 test/jdk/java/io/File/libGetXSpace.c does not compile on Windows 32-bit
2023-11-16 Robo Duke JDK-8315195 RISC-V: Update hwprobe query for new extensions
2023-11-16 Goetz Lindenmaier JDK-8319184 RISC-V: improve MD5 intrinsic
2023-11-14 Christoph Langer JDK-8285785 CheckCleanerBound test fails with PasswordCallback object is not released
2023-11-13 Christoph Langer JDK-8268433 serviceability/dcmd/framework/VMVersionTest.java fails with Unable to send object throw not established PipeIO Listener Thread connection
2023-11-09 Goetz Lindenmaier JDK-8319525 RISC-V: Rename *_riscv64.ad files to *_riscv.ad under riscv/gc
2023-11-09 Goetz Lindenmaier JDK-8318736 com/sun/jdi/JdwpOnThrowTest.java failed with "transport error 202: bind failed: Address already in use"
2023-11-09 Goetz Lindenmaier JDK-8225377 type annotations are not visible to javac plugins across compilation boundaries
2023-11-09 Robo Duke JDK-8312126 NullPointerException in CertStore.getCRLs after 8297955
2023-11-09 Goetz Lindenmaier JDK-8316859 RISC-V: Disable detection of V through HWCAP
2023-11-09 Goetz Lindenmaier JDK-8315206 RISC-V: hwprobe query is_set return wrong value
2023-11-09 Goetz Lindenmaier JDK-8292458 Atomic operations on scoped enums don't build with clang
2023-11-08 Christoph Langer JDK-8316461 Fix: make test outputs TEST SUCCESS after unsuccessful exit
2023-11-08 Christoph Langer JDK-8317374 Add Let's Encrypt ISRG Root X2
2023-11-07 Christoph Langer JDK-8299241 jdk/jfr/api/consumer/streaming/TestJVMCrash.java generates unnecessary core file
2023-11-07 Robo Duke JDK-8309258 RISC-V: Add riscv_hwprobe syscall
2023-11-06 Christoph Langer JDK-8315415 OutputAnalyzer.shouldMatchByLine() fails in some cases
2023-11-06 Christoph Langer JDK-8161536 sun/security/pkcs11/sslecc/ClientJSSEServerJSSE.java fails with ProviderException
2023-11-06 Christoph Langer JDK-8314242 Update applications/scimark/Scimark.java to accept VM flags
2023-11-06 Christoph Langer JDK-8307123 Fix deprecation warnings in DPrinter
2023-11-06 Goetz Lindenmaier JDK-8318889 C2: add bailout after assert Bad graph detected in build_loop_late
2023-11-02 Christoph Langer JDK-8318855 Extra file added by mistake during the backport of JDK-8283326
2023-11-02 Christoph Langer JDK-8317327 Remove JT_JAVA dead code in jib-profiles.js
2023-11-02 Christoph Langer JDK-8301457 Code in SendPortZero.java is uncommented even after JDK-8236852 was fixed
2023-11-02 Christoph Langer JDK-8309778 java/nio/file/Files/CopyAndMove.java fails when using second test directory
2023-11-02 Christoph Langer JDK-8298905 Test "java/awt/print/PrinterJob/ImagePrinting/PrintARGBImage.java" fails because the frames of instruction does not display
2023-11-02 Christoph Langer JDK-8269425 2 jdk/jfr/api/consumer/streaming tests failed to attach
2023-11-02 Christoph Langer JDK-8271826 mark hotspot runtime/condy tests which ignore external VM flags
2023-11-02 Goetz Lindenmaier JDK-8318953 RISC-V: Small refactoring for MacroAssembler::test_bit
2023-11-02 Goetz Lindenmaier JDK-8318669 Target OS detection in 'test-prebuilt' makefile target is incorrect when running on MSYS2
2023-11-02 Goetz Lindenmaier JDK-8317920 JDWP-agent sends broken exception event with onthrow option
2023-11-01 Robo Duke JDK-8312467 relax the builddir check in make/autoconf/basic.m4
2023-11-01 Robo Duke JDK-8312612 Handle WideCharToMultiByte return values
2023-11-01 Goetz Lindenmaier JDK-8310265 (process) jspawnhelper should not use argv[0]
2023-10-29 Christoph Langer JDK-8318705 [macos] ProblemList java/rmi/registry/multipleRegistries/MultipleRegistries.java
2023-10-29 Christoph Langer JDK-8314144 gc/g1/ihop/TestIHOPStatic.java fails due to extra concurrent mark with -Xcomp
2023-10-29 Christoph Langer JDK-6445283 ProgressMonitorInputStream not large file aware (>2GB)
2023-10-27 Robo Duke JDK-8275509 ModuleDescriptor.hashCode isn't reproducible across builds
2023-10-26 Christoph Langer JDK-8317373 Add Telia Root CA v2
2023-10-26 Christoph Langer JDK-8315499 build using devkit on Linux ppc64le RHEL puts path to devkit into libsplashscreen
2023-10-26 Christoph Langer JDK-8314883 Java_java_util_prefs_FileSystemPreferences_lockFile0 write result errno in missing case
2023-10-26 Christoph Langer JDK-8313164 src/java.desktop/windows/native/libawt/windows/awt_Robot.cpp GetRGBPixels adjust releasing of resources
2023-10-26 Christoph Langer JDK-8228990 JFR: TestNetworkUtilizationEvent.java expects 2+ Network interfaces on Linux but finding 1
2023-10-26 Christoph Langer JDK-8225313 serviceability/jvmti/HeapMonitor/MyPackage/HeapMonitorStatObjectCorrectnessTest.java failed with Unexpected high difference percentage
2023-10-25 Christoph Langer JDK-8313252 Java_sun_awt_windows_ThemeReader_paintBackground release resources in early returns
2023-10-25 Robo Duke JDK-8309216 Cast from jchar* to char* in test java/io/GetXSpace.java
2023-10-25 Robo Duke JDK-8305646 compile error on Alpine with gcc12 after 8298619 in libGetXSpace.c
2023-10-25 Christoph Langer JDK-8308910 Allow executeAndLog to accept running process
2023-10-25 Robo Duke JDK-8298619 java/io/File/GetXSpace.java is failing
2023-10-25 Robo Duke JDK-8291911 java/io/File/GetXSpace.java fails with "53687091200 != 161051996160"
2023-10-25 Christoph Langer JDK-8273629 compiler/uncommontrap/TestDeoptOOM.java fails with release VMs
2023-10-25 Christoph Langer JDK-8273456 Do not hold ttyLock around stack walking
2023-10-25 Christoph Langer JDK-8315644 increase timeout of sun/security/tools/jarsigner/Warning.java
2023-10-25 Christoph Langer JDK-8311511 Improve description of NativeLibrary JFR event
2023-10-25 Christoph Langer JDK-8299207 [Testbug] Add back test/jdk/java/awt/Graphics2D/DrawPrimitivesTest.java
2023-10-25 Christoph Langer JDK-8202931 [macos] java/awt/Choice/ChoicePopupLocation/ChoicePopupLocation.java fails
2023-10-25 Christoph Langer JDK-8239801 [macos] java/awt/Focus/UnaccessibleChoice/AccessibleChoiceTest.java fails
2023-10-25 Goetz Lindenmaier JDK-8316778 test hprof lib: invalid array element type from JavaValueArray.elementSize
2023-10-25 Goetz Lindenmaier JDK-8312592 New parentheses warnings after HarfBuzz 7.2.0 update
2023-10-24 Christoph Langer JDK-8293563 [macos-aarch64] SA core file tests failing with sun.jvm.hotspot.oops.UnknownOopException
2023-10-24 Christoph Langer JDK-8176567 nsk/jdi/ReferenceType/instances/instances002: TestFailure: Unexpected size of referenceType.instances(nsk.share.jdi.TestInterfaceImplementer1): 11, expected: 10
2023-10-24 Christoph Langer JDK-8275329 ZGC: vmTestbase/gc/gctests/SoftReference/soft004/soft004.java fails with assert(_phases->length() <= 1000) failed: Too many recored phases?
2023-10-23 Christoph Langer JDK-8268916 Tests for AffirmTrust roots
2023-10-23 Christoph Langer JDK-8317967 Enhance test/jdk/javax/net/ssl/TLSCommon/SSLEngineTestCase.java to handle default cases
2023-10-23 Christoph Langer JDK-8291154 Create a non static nested class without enclosing class throws VerifyError
2023-10-23 Christoph Langer JDK-8275333 Print count in "Too many recored phases?" assert
2023-10-20 Robo Duke JDK-8312395 Improve assertions in growableArray
2023-10-18 Robo Duke JDK-8312078 [PPC] JcmdScale.java Failing on AIX
2023-10-17 Christoph Langer JDK-8315214 Do not run sun/tools/jhsdb tests concurrently
2023-10-17 Christoph Langer JDK-8306280 Open source several choice AWT tests
2023-10-17 Christoph Langer JDK-8297296 java/awt/Mouse/EnterExitEvents/DragWindowTest.java fails with "No MouseReleased event on label!"
2023-10-17 Christoph Langer JDK-8296821 compiler/jvmci/jdk.vm.ci.code.test/src/jdk/vm/ci/code/test/NativeCallTest.java fails after JDK-8262901
2023-10-17 Christoph Langer JDK-8262901 [macos_aarch64] NativeCallTest expected:<-3.8194101E18> but was:<3.02668882E10>
2023-10-16 Goetz Lindenmaier JDK-8313691 use close after failing os::fdopen in vmError and ciEnv
2023-10-16 Goetz Lindenmaier JDK-8317772 NMT: Make peak values available in release builds
2023-10-16 Goetz Lindenmaier JDK-8315062 [GHA] get-bootjdk action should return the abolute path
2023-10-16 Goetz Lindenmaier JDK-8310268 RISC-V: misaligned memory access in String.Compare intrinsic
2023-10-16 Goetz Lindenmaier JDK-8300259 Add test coverage for processing of pending block files in signed JARs
2023-10-16 Goetz Lindenmaier JDK-8310321 make JDKOPT_CHECK_CODESIGN_PARAMS more verbose
2023-10-16 Goetz Lindenmaier JDK-8302525 Write a test to check various components send Events while mouse and key are used simultaneously
2023-10-16 Goetz Lindenmaier JDK-8301570 Test runtime/jni/nativeStack/ needs to detach the native thread
2023-10-16 Goetz Lindenmaier JDK-8300272 Improve readability of the test JarWithOneNonDisabledDigestAlg
2023-10-16 Goetz Lindenmaier JDK-8296275 Write a test to verify setAccelerator method of JMenuItem
2023-10-16 Christoph Langer JDK-8041447 Test javax/swing/dnd/7171812/bug7171812.java fails with java.lang.RuntimeException: Test failed, scroll on drag doesn't work
2023-10-16 Christoph Langer JDK-8297640 Increase buffer size for buf (insert_features_names) in Abstract_VM_Version::insert_features_names
2023-10-12 Christoph Langer JDK-8270199 Most SA tests are skipped on macosx-aarch64 because all executables are signed
2023-10-11 Goetz Lindenmaier JDK-8317705 ProblemList sun/tools/jstat/jstatLineCountsX.sh on linux-ppc64le and aix due to JDK-8248691
2023-10-11 Goetz Lindenmaier JDK-8317706 Exclude java/awt/Graphics2D/DrawString/RotTransText.java on linux
2023-10-11 Christoph Langer JDK-8316906 Clarify TLABWasteTargetPercent flag
2023-10-11 Christoph Langer JDK-8309974 some JVMCI tests fail when VM options include -XX:+EnableJVMCI
2023-10-11 Christoph Langer JDK-8232839 JDI AfterThreadDeathTest.java failed due to "FAILED: Did not get expected IllegalThreadStateException on a StepRequest.enable()"
2023-10-11 Christoph Langer JDK-8284047 Harmonize/Standardize the SSLSocket/SSLEngine/SSLSocketSSLEngine test templates
2023-10-11 Christoph Langer JDK-8300727 java/awt/List/ListGarbageCollectionTest/AwtListGarbageCollectionTest.java failed with "List wasn't garbage collected"
2023-10-11 Christoph Langer JDK-8294881 test/hotspot/jtreg/vmTestbase/nsk/jdi/VirtualMachine/dispose/dispose003/TestDescription.java fails
2023-10-11 Christoph Langer JDK-8273921 Refactor NSK/JDI tests to create thread using factory
2023-10-10 Christoph Langer JDK-8301247 JPackage app-image exe launches multiple exe's in JDK 17+
2023-10-10 Christoph Langer JDK-8287596 Reorg jdk.test.lib.util.ForceGC
2023-10-10 Christoph Langer JDK-8287867 Bad merge of jdk/test/lib/util/ForceGC.java causing test compilation error
2023-10-10 Christoph Langer JDK-8287671 Adjust ForceGC to invoke System::gc fewer times for negative case
2023-10-10 Christoph Langer JDK-8266593 vmTestbase/nsk/jvmti/PopFrame/popframe011 fails with "assert(java_thread == _state->get_thread()) failed: Must be"
2023-10-10 Robo Duke JDK-8309502 RISC-V: String.indexOf intrinsic may produce misaligned memory loads
2023-10-10 Christoph Langer JDK-8308116 jdk.test.lib.compiler.InMemoryJavaCompiler.compile does not close files
2023-10-09 Christoph Langer JDK-8311585 Add JRadioButtonMenuItem to bug8031573.java
2023-10-09 Christoph Langer JDK-8308223 failure handler missed jcmd.vm.info command
2023-10-09 Christoph Langer JDK-8290909 MemoryPoolMBean/isUsageThresholdExceeded tests failed with "isUsageThresholdExceeded() returned false, and is still false, while threshold = MMMMMMM and used peak = NNNNNNN"
2023-10-08 Goetz Lindenmaier JDK-8313779 RISC-V: use andn / orn in the MD5 instrinsic
2023-10-07 Christoph Langer JDK-8298868 Update EngineCloseOnAlert.java for changes to TLS implementation
2023-10-07 Goetz Lindenmaier JDK-8315683 Parallelize java/util/concurrent/tck/JSR166TestCase.java
2023-10-07 Goetz Lindenmaier JDK-8291550 RISC-V: jdk uses misaligned memory access when AvoidUnalignedAccess enabled
2023-10-06 Christoph Langer JDK-8315606 Open source few swing text/html tests
2023-10-06 Christoph Langer JDK-8308047 java/util/concurrent/ScheduledThreadPoolExecutor/BasicCancelTest.java timed out and also had jcmd pipe errors
2023-10-06 Christoph Langer JDK-8309104 [JVMCI] compiler/unsafe/UnsafeGetStableArrayElement test asserts wrong values with Graal
2023-10-06 Christoph Langer JDK-8281149 (fs) java/nio/file/FileStore/Basic.java fails with java.lang.RuntimeException: values differ by more than 1GB
2023-10-06 Christoph Langer JDK-8258951 java/net/httpclient/HandshakeFailureTest.java failed with "RuntimeException: Not found expected SSLHandshakeException in java.io.IOException"
2023-10-05 Christoph Langer JDK-8315377 C2: assert(u->find_out_with(Op_AddP) == nullptr) failed: more than 2 chained AddP nodes?
2023-10-05 Christoph Langer JDK-8312440 assert(cast != nullptr) failed: must have added a cast to pin the node
2023-10-05 Christoph Langer JDK-8308103 Massive (up to ~30x) increase in C2 compilation time since JDK 17
2023-10-05 Christoph Langer JDK-8301489 C1: ShortLoopOptimizer might lift instructions before their inputs
2023-10-05 Christoph Langer JDK-8299075 TestStringDeduplicationInterned.java fails because extra deduplication
2023-10-05 Christoph Langer JDK-8307403 java/util/zip/DeInflate.java timed out
2023-10-05 Christoph Langer JDK-8305505 NPE in javazic compiler
2023-10-05 Christoph Langer JDK-8301455 comments in TestTypeAnnotations still refer to resolved JDK-8068737
2023-10-05 Christoph Langer JDK-8303607 SunMSCAPI provider leaks memory and keys
2023-10-05 Christoph Langer JDK-8305502 adjust timeouts in three more M&M tests
2023-10-05 Christoph Langer JDK-8302607 increase timeout for ContinuousCallSiteTargetChange.java
2023-10-05 Christoph Langer JDK-8301377 adjust timeout for JLI GetObjectSizeIntrinsicsTest.java subtest again
2023-10-05 Christoph Langer JDK-8298872 Update CheckStatus.java for changes to TLS implementation
2023-10-05 Christoph Langer JDK-8298874 Update TestAllSuites.java for TLS v1.2 and 1.3
2023-10-05 Goetz Lindenmaier JDK-8316710 Exclude java/awt/font/Rotate/RotatedTextTest.java
2023-10-04 Christoph Langer JDK-8298298 NMT: count deltas are printed with 32-bit signed size
2023-10-04 Christoph Langer JDK-8297958 NMT: Display peak values
2023-10-04 Christoph Langer JDK-8292072 NMT: repurpose Tracking overhead counter as global malloc counter
2023-10-04 Christoph Langer JDK-8281015 Further simplify NMT backend
2023-10-04 Goetz Lindenmaier JDK-8316566 RISC-V: Zero extended narrow oop passed to Atomic::cmpxchg
2023-10-04 Goetz Lindenmaier JDK-8316743 RISC-V: Change UseVectorizedMismatchIntrinsic option result to warning
2023-10-04 Goetz Lindenmaier JDK-8316514 Better diagnostic header for VtableStub
2023-10-04 Goetz Lindenmaier JDK-8315937 Enable parallelism in vmTestbase/nsk/stress/numeric tests
2023-10-03 Goetz Lindenmaier JDK-8315766 Parallelize gc/stress/TestStressIHOPMultiThread.java test
2023-10-03 Christoph Langer JDK-8299748 java/util/zip/Deinflate.java failing on s390x
2023-10-03 Christoph Langer JDK-8298869 Update ConnectionTest.java for changes to TLS implementation
2023-10-03 Christoph Langer JDK-8301189 validate-source fails after JDK-8298873
2023-10-03 Christoph Langer JDK-8298873 Update IllegalRecordVersion.java for changes to TLS implementation
2023-10-03 Christoph Langer JDK-8297367 disable TestRedirectLinks.java in slowdebug mode
2023-10-03 Christoph Langer JDK-8295424 adjust timeout for another JLI GetObjectSizeIntrinsicsTest.java subtest
2023-10-03 Christoph Langer JDK-8198668 MemoryPoolMBean/isUsageThresholdExceeded/isexceeded001/TestDescription.java still failing
2023-10-03 Christoph Langer JDK-8271887 mark hotspot runtime/CDSCompressedKPtrs tests which ignore external VM flags
2023-10-03 Christoph Langer JDK-8271828 mark hotspot runtime/classFileParserBug tests which ignore external VM flags
2023-10-03 Christoph Langer JDK-8271829 mark hotspot runtime/Throwable tests which ignore external VM flags
2023-09-28 Christoph Langer JDK-8298867 Basics.java fails with SSL handshake exception
2023-09-28 Christoph Langer JDK-8296437 NMT incurs costs if disabled
2023-09-28 Christoph Langer JDK-8293156 Dcmd VM.classloaders fails to print the full hierarchy
2023-09-28 Christoph Langer JDK-8283670 gtest os.release_multi_mappings_vm is still racy
2023-09-28 Robo Duke JDK-8308592 Framework for CA interoperability testing
2023-09-28 Robo Duke JDK-8314121 test tools/jpackage/share/RuntimePackageTest.java#id0 fails on RHEL8
2023-09-28 Robo Duke JDK-8300997 Add curl support to createJMHBundle.sh
2023-09-28 Robo Duke JDK-8276054 JMH benchmarks for Fences
2023-09-28 Robo Duke JDK-8307732 build-test-lib is broken
2023-09-28 Robo Duke JDK-8303922 build-test-lib target is broken
2023-09-28 Robo Duke JDK-8274345 make build-test-lib is broken
2023-09-27 Christoph Langer JDK-8316206 Test StretchedFontTest.java fails for Baekmuk font
2023-09-27 Christoph Langer JDK-8304174 Remove delays from httpserver tests
2023-09-27 Christoph Langer JDK-8298735 Some tools/jpackage/windows/* tests fails with jtreg test timeout
2023-09-27 Christoph Langer JDK-8249826 5 javax/net/ssl/SSLEngine tests use @ignore w/o bug-id
2023-09-27 Christoph Langer JDK-8297798 Timeout with DTLSOverDatagram test template
2023-09-27 Christoph Langer JDK-8292261 adjust timeouts in JLI GetObjectSizeIntrinsicsTest.java
2023-09-27 Christoph Langer JDK-8288961 jpackage: test MSI installation fix
2023-09-27 Christoph Langer JDK-8286475 Drop --enable-preview from instanceof pattern matching related tests
2023-09-27 Christoph Langer JDK-8286473 Drop --enable-preview from Record related tests
2023-09-27 Christoph Langer JDK-8282011 test/jdk/tools/jpackage/windows/WinL10nTest.java test fails if light.exe is not in %PATH%
2023-09-27 Christoph Langer JDK-8281874 Can't unpack msi installers from test/jdk/tools/jpackage/windows/test/jdk/tools/jpackage/windows/WinShortcutPromptTest.java test
2023-09-27 Christoph Langer JDK-8275440 Remove VirtualSpaceList::is_full()
2023-09-27 Christoph Langer JDK-8274211 Test man page that options are documented
2023-09-27 Christoph Langer JDK-8272291 mark hotspot runtime/logging tests which ignore external VM flags
2023-09-27 Christoph Langer JDK-8272552 mark hotspot runtime/cds tests which ignore external VM flags
2023-09-27 Goetz Lindenmaier JDK-8311631 When multiple users run tools/jpackage/share/LicenseTest.java, Permission denied for writing /var/tmp/*.files
2023-09-26 Goetz Lindenmaier JDK-8315770 serviceability/sa/TestJmapCoreMetaspace.java should run with -XX:-VerifyDependencies
2023-09-26 Goetz Lindenmaier JDK-8313792 Verify 4th party information in src/jdk.internal.le/share/legal/jline.md
2023-09-25 Goetz Lindenmaier JDK-8313322 RISC-V: implement MD5 intrinsic
2023-09-25 Christoph Langer JDK-8292381 java/net/httpclient/SpecialHeadersTest.java fails with "ERROR: Shutting down connection: HTTP/2 client stopped"
2023-09-25 Christoph Langer JDK-8289584 (fs) Print size values in java/nio/file/FileStore/Basic.java when they differ by > 1GiB
2023-09-25 Christoph Langer JDK-8286969 Add a new test library API to execute kinit in SecurityTools.java
2023-09-25 Christoph Langer JDK-8285867 Convert applet manual tests SelectionVisible.java to Frame and automate
2023-09-25 Christoph Langer JDK-8286474 Drop --enable-preview from Sealed Classes related tests
2023-09-25 Christoph Langer JDK-8202790 DnD test DisposeFrameOnDragTest.java does not clean up
2023-09-25 Christoph Langer JDK-8271073 Improve testing with VM option VerifyArchivedFields
2023-09-25 Christoph Langer JDK-8272551 mark hotspot runtime/modules tests which ignore external VM flags
2023-09-25 Christoph Langer JDK-8271892 mark hotspot runtime/PrintStringTableStats/PrintStringTableStatsTest.java test as ignoring external VM flags
2023-09-25 Christoph Langer JDK-8272099 mark hotspot runtime/Monitor tests which ignore external VM flags
2023-09-25 Christoph Langer JDK-8271904 mark hotspot runtime/ClassFile tests which ignore external VM flags
2023-09-25 Christoph Langer JDK-8271905 mark hotspot runtime/Metaspace tests which ignore external VM flags
2023-09-25 Christoph Langer JDK-8271893 mark hotspot runtime/PerfMemDestroy/PerfMemDestroy.java test as ignoring external VM flags
2023-09-22 Christoph Langer JDK-8316087 Test SignedLoggerFinderTest.java is still failing
2023-09-22 Christoph Langer JDK-8315696 SignedLoggerFinderTest.java test failed
2023-09-22 Christoph Langer JDK-8314263 Signed jars triggering Logger finder recursion and StackOverflowError
2023-09-22 Christoph Langer JDK-8292636 (dc) Problem listing of java/nio/channels/DatagramChannel/Unref.java has incorrect issue ID
2023-09-22 Christoph Langer JDK-8193543 Regression automated test '/open/test/jdk/java/awt/TrayIcon/SystemTrayInstance/SystemTrayInstanceTest.java' fails
2023-09-22 Christoph Langer JDK-8271891 mark hotspot runtime/Safepoint tests which ignore external VM flags
2023-09-22 Christoph Langer JDK-8271890 mark hotspot runtime/Dictionary tests which ignore external VM flags
2023-09-22 Christoph Langer JDK-8271824 mark hotspot runtime/CompressedOops tests which ignore external VM flags
2023-09-22 Robo Duke JDK-8276036 The value of full_count in the message of insufficient codecache is wrong
2023-09-22 Christoph Langer JDK-8314063 The socket is not closed in Connection::createSocket when the handshake failed for LDAP connection
2023-09-22 Christoph Langer JDK-8288325 [windows] Actual and Preferred Size of AWT Non-resizable frame are different
2023-09-22 Christoph Langer JDK-8273522 Rename test property vm.cds.archived.java.heap to vm.cds.write.archived.java.heap
2023-09-21 Robo Duke JDK-8316178 Better diagnostic header for CodeBlobs
2023-09-20 Robo Duke JDK-8314045 ArithmeticException in GaloisCounterMode
2023-09-20 Robo Duke JDK-8308593 Add KEEPALIVE Extended Socket Options Support for Windows
2023-09-20 Robo Duke JDK-8311514 Incorrect regex in TestMetaSpaceLog.java
2023-09-20 Christoph Langer JDK-8315863 [GHA] Update checkout action to use v4
2023-09-20 Christoph Langer JDK-8314679 SA fails to properly attach to JVM after having just detached from a different JVM
2023-09-20 Christoph Langer JDK-8313657 com.sun.jndi.ldap.Connection.cleanup does not close connections on SocketTimeoutErrors
2023-09-20 Christoph Langer JDK-8294427 Check boxes and radio buttons have rendering issues on Windows in High DPI env
2023-09-20 Christoph Langer JDK-8288993 Make AwtFramePackTest generic by removing @requires tag
2023-09-20 Christoph Langer JDK-8265586 [windows] last button is not shown in AWT Frame with BorderLayout and MenuBar set.
2023-09-19 Goetz Lindenmaier JDK-8297142 jdk/jfr/event/runtime/TestShutdown.java fails on Linux ppc64le and Linux aarch64
2023-09-19 Christoph Langer JDK-8282017 sun/net/www/protocol/https/HttpsURLConnection/B6216082.java fails with "SocketException: Unexpected end of file from server"
2023-09-19 Christoph Langer JDK-8061729 Update java/net tests to eliminate dependency on sun.net.www.MessageHeader and some other internal APIs
2023-09-19 Christoph Langer JDK-8270447 [IR Framework] Add missing compilation level restriction when using FlipC1C2 stress option
2023-09-19 Christoph Langer JDK-8247351 [aarch64] NullPointerException during stack walking (clhsdb "where -a")
2023-09-15 Christoph Langer JDK-8312909 C1 should not inline through interface calls with non-subtype receiver
2023-09-15 Christoph Langer JDK-8312573 Failure during CompileOnly parsing leads to ShouldNotReachHere
2023-09-15 Christoph Langer JDK-8304954 SegmentedCodeCache fails when using large pages
2023-09-15 Robo Duke JDK-8311592 ECKeySizeParameterSpec causes too many exceptions on third party providers
2023-09-15 Christoph Langer JDK-8301065 Handle control characters in java_lang_String::print
2023-09-15 Christoph Langer JDK-8299255 Unexpected round errors in FreetypeFontScaler
2023-09-15 Christoph Langer JDK-8232933 Javac inferred type does not conform to equality constraint
2023-09-15 Robo Duke JDK-8293579 tools/jpackage/share/jdk/jpackage/tests/UnicodeArgsTest.java fails on Japanese Windows platform
2023-09-15 Goetz Lindenmaier JDK-8312065 Socket.connect does not timeout when profiling
2023-09-15 Goetz Lindenmaier JDK-8315020 The macro definition for LoongArch64 zero build is not accurate.
2023-09-14 Robo Duke JDK-8314094 java/lang/ProcessHandle/InfoTest.java fails on Windows when run as user with Administrator privileges
2023-09-13 Robo Duke JDK-8301701 java/net/DatagramSocket/DatagramSocketMulticasting.java should be hardened
2023-09-13 Robo Duke JDK-8315751 RandomTestBsi1999 fails often with timeouts on Linux ppc64le
2023-09-13 Robo Duke JDK-8276711 compiler/codecache/cli tests failing when SegmentedCodeCache used with -Xint
2023-09-13 Robo Duke JDK-8285516 clearPassword should be called in a finally try block
2023-09-12 Robo Duke JDK-8309032 jpackage does not work for module projects unless --module-path is specified
2023-09-12 Goetz Lindenmaier JDK-8311813 C1: Uninitialized PhiResolver::_loop field
2023-09-11 Robo Duke JDK-8315549 CITime misreports code/total nmethod sizes
2023-09-11 Robo Duke JDK-8312625 Test serviceability/dcmd/vm/TrimLibcHeapTest.java failed: RSS use increased
2023-09-11 Robo Duke JDK-8244289 fatal error: Possible safepoint reached by thread that does not allow it
2023-09-11 Robo Duke JDK-8272998 ImageIO.read() throws incorrect exception type
2023-09-11 Robo Duke JDK-8271886 mark hotspot runtime/InvocationTests tests which ignore external VM flags
2023-09-07 Christoph Langer JDK-8314024 SIGSEGV in PhaseIdealLoop::build_loop_late_post_work due to bad immediate dominator info
2023-09-07 Christoph Langer JDK-8299677 Formatter.format might take a long time to format an integer or floating-point
2023-09-05 Christoph Langer JDK-8314495 Update to use jtreg 7.3.1
2023-09-02 Goetz Lindenmaier JDK-8207166 jdk/jshell/JdiHangingLaunchExecutionControlTest.java - launch timeout
2023-08-31 Christoph Langer JDK-8313626 C2 crash due to unexpected exception control flow
2023-08-31 Christoph Langer JDK-8314139 TEST_BUG: runtime/os/THPsInThreadStackPreventionTest.java could fail on machine with large number of cores
2023-08-31 Christoph Langer JDK-8312585 Rename DisableTHPStackMitigation flag to THPStackMitigation
2023-08-31 Christoph Langer JDK-8286430 make test TEST="gtest:" exits with error when it shouldn't
2023-08-30 Christoph Langer JDK-8312620 WSL Linux build crashes after JDK-8310233
2023-08-30 Christoph Langer JDK-8312182 THPs cause huge RSS due to thread start timing issue
2023-08-30 Christoph Langer JDK-8312394 [linux] SIGSEGV if kernel was built without hugepage support
2023-08-30 Christoph Langer JDK-8295229 Try to verify gtest version
2023-08-30 Goetz Lindenmaier JDK-8312535 MidiSystem.getSoundbank() throws unexpected SecurityException
2023-08-30 Goetz Lindenmaier JDK-8292717 Clean up checking of testing requirements in configure
2023-08-30 Goetz Lindenmaier JDK-8276819 javax/print/PrintServiceLookup/FlushCustomClassLoader.java fails to free
2023-08-30 Goetz Lindenmaier JDK-8273831 PrintServiceLookup spawns 2 threads in the current classloader, getting orphaned
2023-08-29 Goetz Lindenmaier JDK-8312489 Increase jdk.jar.maxSignatureFileSize default which is too low for JARs such as WhiteSource/Mend unified agent jar
2023-08-28 Christoph Langer JDK-8314517 some tests fail in case ipv6 is disabled on the machine
2023-08-28 Christoph Langer JDK-8314020 Print instruction blocks in byte units
2023-08-28 Christoph Langer JDK-8311033 [macos] PrinterJob does not take into account Sides attribute
2023-08-28 Christoph Langer JDK-8310233 Fix THP detection on Linux
2023-08-28 Christoph Langer JDK-8284772 GHA: Use GCC Major Version Dependencies Only
2023-08-27 Goetz Lindenmaier JDK-8313874 JNI NewWeakGlobalRef throws exception for null arg
2023-08-27 Goetz Lindenmaier JDK-8313262 C2: Sinking node may cause required cast to be dropped
2023-08-27 Goetz Lindenmaier JDK-8295737 macOS: Print content cut off when width > height with portrait orientation
2023-08-27 Goetz Lindenmaier JDK-8313678 SymbolTable can leak Symbols during cleanup
2023-08-25 Goetz Lindenmaier JDK-8313815 The exception messages printed by jcmd ManagementAgent.start are corrupted on Japanese Windows
2023-08-25 Goetz Lindenmaier JDK-8314426 runtime/os/TestTrimNative.java is failing on slow machines
2023-08-25 Goetz Lindenmaier JDK-8314730 GHA: Drop libfreetype6-dev transitional package in favor of libfreetype-dev
2023-08-25 Goetz Lindenmaier JDK-8276651 java/lang/ProcessHandle tests fail with "RuntimeException: Input/output error" in java.lang.ProcessHandleImpl$Info.info0
2023-08-25 Goetz Lindenmaier JDK-8313701 GHA: RISC-V should use the official repository for bootstrap
2023-08-25 Goetz Lindenmaier JDK-8283724 Incorrect description for jtreg-failure-handler option
2023-08-23 Andrew Hughes JDK-8314552 Fix javadoc tests to work with jtreg 7
2023-08-22 Goetz Lindenmaier JDK-8314658 [17u] GHA: Sync up debian-version for cross-builds
2023-08-22 Goetz Lindenmaier JDK-8314501 Shenandoah: sun/tools/jhsdb/heapconfig/JMapHeapConfigTest.java fails
2023-08-22 Goetz Lindenmaier JDK-8314117 RISC-V: Incorrect VMReg encoding in RISCV64Frame.java
2023-08-22 Goetz Lindenmaier JDK-8310873 Re-enable locked_create_entry symbol check in runtime/NMT/CheckForProperDetailStackTrace.java for RISC-V
2023-08-22 Goetz Lindenmaier JDK-8293851 hs_err should print more stack in hex dump
2023-08-20 Goetz Lindenmaier JDK-8168469 Memory leak in JceSecurity
2023-08-20 Goetz Lindenmaier JDK-8299827 Add resolved IP address in connection exception for sockets
2023-08-18 Goetz Lindenmaier JDK-8314262 GHA: Cut down cross-compilation sysroots deeper
2023-08-18 Goetz Lindenmaier JDK-8314118 Update JMH devkit to 1.37
2023-08-18 Goetz Lindenmaier JDK-8313676 Amend TestLoadIndexedMismatch test to target intrinsic directly
2023-08-18 Goetz Lindenmaier JDK-8309591 Socket.setOption(TCP_QUICKACK) uses wrong level
2023-08-18 Goetz Lindenmaier JDK-8309254 Implement fast-path for ASCII-compatible CharsetEncoders on RISC-V
2023-08-18 Goetz Lindenmaier JDK-8284273 Early crashes in os::print_context on AArch64
2023-08-18 Andrew Hughes JDK-8313765 Invalid CEN header (invalid zip64 extra data field size)
2023-08-16 Goetz Lindenmaier JDK-8312525 New test runtime/os/TestTrimNative.java#trimNative is failing: did not see the expected RSS reduction
2023-08-16 Goetz Lindenmaier JDK-8293114 JVM should trim the native heap
2023-08-16 Goetz Lindenmaier JDK-8313796 AsyncGetCallTrace crash on unreadable interpreter method pointer
2023-08-16 Goetz Lindenmaier JDK-8313402 C1: Incorrect LoadIndexed value numbering
2023-08-16 Goetz Lindenmaier JDK-8304353 Add lib-test tier1 testing in GHA
2023-08-16 Goetz Lindenmaier JDK-8299330 Minor improvements in MSYS2 Workflow handling
2023-08-16 Goetz Lindenmaier JDK-8294956 GHA: qemu-debootstrap is deprecated, use the regular one
2023-08-16 Goetz Lindenmaier JDK-8294941 GHA: Cut down cross-compilation sysroots
2023-08-16 Goetz Lindenmaier JDK-8280032 Update jib-profiles.js to use JMH 1.34 devkit
2023-08-16 Goetz Lindenmaier JDK-8294149 JMH 1.34 and later requires jopt-simple 5.0.4
2023-08-16 Goetz Lindenmaier JDK-8277427 Update jib-profiles.js to use JMH 1.33 devkit
2023-08-14 Goetz Lindenmaier JDK-8309088 security/infra/java/security/cert/CertPathValidator/certification/AmazonCA.java fails
2023-08-11 Christoph Langer JDK-8310551 vmTestbase/nsk/jdb/interrupt/interrupt001/interrupt001.java timed out due to missing prompt
2023-08-11 Christoph Langer JDK-8156889 ListKeychainStore.sh fails in some virtualized environments
2023-08-11 Christoph Langer JDK-8308090 Add container tests for on-the-fly resource quota updates
2023-08-11 Christoph Langer JDK-8313707 GHA: Bootstrap sysroots with --variant=minbase
2023-08-11 Christoph Langer JDK-8313428 GHA: Bump GCC versions for July 2023 updates
2023-08-11 Christoph Langer JDK-8308232 nsk/jdb tests don't pass -verbose flag to the debuggee
2023-08-11 Christoph Langer JDK-8297350 Update JMH devkit to 1.36
2023-08-11 Christoph Langer JDK-8295213 Run GHA manually with user-specified make and configure arguments
2023-08-11 Christoph Langer JDK-8293361 GHA: dump config.log in case of configure failure
2023-08-11 Christoph Langer JDK-8293098 GHA: Harmonize GCC version handling for host and cross builds
2023-08-11 Christoph Langer JDK-8293107 GHA: Bump to Ubuntu 22.04
2023-08-09 Christoph Langer JDK-8307079 Update test java/awt/Choice/DragOffNoSelect.java
2023-08-09 Christoph Langer JDK-8255548 Missing coverage for javax.xml.crypto.dom.DOMCryptoContext
2023-08-09 Christoph Langer JDK-6381945 (cal) Japanese calendar unit test system should avoid multiple static imports
2023-08-09 Goetz Lindenmaier JDK-8309095 Remove UTF-8 character from TaskbarPositionTest.java
2023-08-09 Goetz Lindenmaier JDK-8302182 Update Public Suffix List to 88467c9
2023-08-09 Goetz Lindenmaier JDK-8301167 Update VerifySignedJar to actually exercise and test verification
2023-08-09 Goetz Lindenmaier JDK-8289797 tools/launcher/I18NArgTest.java fails on Japanese Windows environment
2023-08-09 Goetz Lindenmaier JDK-8267860 Off-by-one bug when searching arrays in AlpnGreaseTest
2023-08-09 Goetz Lindenmaier JDK-8195589 T6587786.java failed after JDK-8189997
2023-08-09 Goetz Lindenmaier JDK-8273092 Sort classlist in JDK image
2023-08-08 Christoph Langer JDK-8283276 java/io/ObjectStreamClass/ObjectStreamClassCaching.java fails with various GCs
2023-08-07 Paul Hohensee JDK-8290836 Improve test coverage for XPath functions: String Functions
2023-08-07 Goetz Lindenmaier JDK-8313576 GCC 7 reports compiler warning in bundled freetype 2.13.0
2023-08-01 Christoph Langer JDK-8311923 TestIRMatching.java fails on RISC-V
2023-08-01 Christoph Langer JDK-8307766 Linux: Provide the option to override the timer slack
2023-08-01 Christoph Langer JDK-8309746 Reconfigure check should include make/conf/version-numbers.conf
2023-08-01 Christoph Langer JDK-8307603 [AIX] Broken build after JDK-8307301
2023-08-01 Christoph Langer JDK-8273803 Zero: Handle "zero" variant in CommandLineOptionTest.java
2023-07-26 Christoph Langer JDK-8307526 [JFR] Better handling of tampered JFR repository
2023-07-25 Christoph Langer JDK-8307165 java/awt/dnd/NoFormatsDropTest/NoFormatsDropTest.java timed out
2023-07-25 Christoph Langer JDK-8301269 Update Commons BCEL to Version 6.7.0
2023-07-25 Christoph Langer JDK-8301367 Add exception handler method to the BaseLdapServer
2023-07-25 Christoph Langer JDK-8299617 CurrencySymbols.properties is missing the copyright notice
2023-07-25 Christoph Langer JDK-8296384 [TESTBUG] sun/security/provider/SecureRandom/AbstractDrbg/SpecTest.java intermittently timeout
2023-07-25 Christoph Langer JDK-8293177 Verify version numbers in legal files
2023-07-25 Christoph Langer JDK-8289510 Improve test coverage for XPath Axes: namespace
2023-07-25 Christoph Langer JDK-8270331 [TESTBUG] Error: Not a test or directory containing tests: java/awt/print/PrinterJob/InitToBlack.java
2023-07-24 Goetz Lindenmaier JDK-8312511 GHA: Bump cross-compile runner to Ubuntu 22.04
2023-07-24 Goetz Lindenmaier JDK-8311285 report some fontconfig related environment variables in hs_err file
2023-07-24 Goetz Lindenmaier JDK-8296796 Provide clean, platform-agnostic interface to C-heap trimming
2023-07-24 Goetz Lindenmaier JDK-8293166 jdk/jfr/jvm/TestDumpOnCrash.java fails on Linux ppc64le and Linux aarch64
2023-07-21 Christoph Langer JDK-8305670 Performance regression in LockSupport.unpark with lots of idle threads
2023-07-21 Christoph Langer JDK-8292683 Remove BadKeyUsageTest.java from Problem List
2023-07-21 Christoph Langer JDK-8275662 remove test/lib/sun/hotspot
2023-07-21 Christoph Langer JDK-8281717 Cover logout method for several LoginModule
2023-07-21 Christoph Langer JDK-8284090 com/sun/security/auth/module/AllPlatforms.java fails to compile
2023-07-21 Goetz Lindenmaier JDK-8303279 C2: crash in SubTypeCheckNode::sub() at IGVN split if
2023-07-21 Goetz Lindenmaier JDK-8306881 Update FreeType to 2.13.0
2023-07-21 Goetz Lindenmaier JDK-8302161 Upgrade jQuery UI to version 1.13.2
2023-07-21 Goetz Lindenmaier JDK-8289646 configure script failed on WSL
2023-07-21 Goetz Lindenmaier JDK-8286623 Bundle zlib by default with JDK on macos aarch64
2023-07-20 Goetz Lindenmaier JDK-8289745 JfrStructCopyFailed uses heap words instead of bytes for object sizes
2023-07-20 Goetz Lindenmaier JDK-8289917 Metadata for regionsRefilled of G1EvacuationStatistics event is wrong
2023-07-20 Goetz Lindenmaier JDK-8276333 jdk/jfr/event/oldobject/TestLargeRootSet.java failed "assert(!contains(edge->reference())) failed: invariant"
2023-07-20 Goetz Lindenmaier JDK-8275415 Prepare Leak Profiler for Lilliput
2023-07-19 Christoph Langer JDK-8312029 Add CriticalNative tests to ProblemList for 8312028
2023-07-19 Christoph Langer JDK-8295894 Remove SECOM certificate that is expiring in September 2023
2023-07-19 Christoph Langer JDK-8308803 Improve java/util/UUID/UUIDTest.java
2023-07-19 Christoph Langer JDK-8302736 Major performance regression in Math.log on aarch64
2023-07-19 Christoph Langer JDK-8307653 Adjust delay time and gc log argument in TestAbortOnVMOperationTimeout
2023-07-19 Christoph Langer JDK-8305766 ProblemList runtime/CompressedOops/CompressedClassPointers.java
2023-07-19 Christoph Langer JDK-8277353 java/security/MessageDigest/ThreadSafetyTest.java test times out
2023-07-18 Christoph Langer JDK-8311689 Wrong visible amount in Adjustable of ScrollPane
2023-07-18 Christoph Langer JDK-8310054 ScrollPane insets are incorrect
2023-07-18 Christoph Langer JDK-8297923 java.awt.ScrollPane broken after multiple scroll up/down
2023-07-18 Christoph Langer JDK-8307068 store a JavaThread* in the java.lang.Thread object after the JavaThread* is added to the main ThreadsList
2023-07-18 Christoph Langer JDK-8307067 remove broken EnableThreadSMRExtraValidityChecks option
2023-07-18 Christoph Langer JDK-8275303 sun/java2d/pipe/InterpolationQualityTest.java fails with D3D basic render driver
2023-07-18 Goetz Lindenmaier JDK-8311862 RISC-V: small improvements to shift immediate instructions
2023-07-18 Goetz Lindenmaier JDK-8308283 Build failure with GCC12 & GCC13
2023-07-14 Goetz Lindenmaier JDK-8307147 [x86] Dangling pointer warning for Assembler::_attributes
2023-07-14 Goetz Lindenmaier JDK-8306060 Open source few AWT Insets related tests
2023-07-14 Goetz Lindenmaier JDK-8289512 Fix GCC 12 warnings for adlc output_c.cpp
2023-07-14 Goetz Lindenmaier JDK-8283326 Implement SafeFetch statically
2023-07-14 Goetz Lindenmaier JDK-8288719 [arm32] SafeFetch32 thumb interleaving causes random crashes
2023-07-13 Christoph Langer JDK-8309266 C2: assert(final_con == (jlong)final_int) failed: final value should be integer
2023-07-13 Christoph Langer JDK-8310259 Pin msys2/setup-msys2 github action to a specific commit
2023-07-13 Goetz Lindenmaier JDK-8307555 Reduce memory reads in x86 MD5 intrinsic
2023-07-12 Christoph Langer JDK-8309119 [17u/11u] Redo JDK-8297951: C2: Create skeleton predicates for all If nodes in loop predication
2023-07-12 Christoph Langer JDK-8307683 Loop Predication should not hoist range checks with trap on success projection by negating their condition
2023-07-12 Christoph Langer JDK-8308192 Error in parsing replay file when staticfield is an array of single dimension
2023-07-12 Christoph Langer JDK-8301097 Update GHA XCode to 12.5.1
2023-07-12 Christoph Langer JDK-8292763 JDK-8292716 breaks configure without jtreg
2023-07-12 Christoph Langer JDK-8292716 Configure should check that jtreg is of the required version
2023-07-12 Goetz Lindenmaier JDK-8267517 async logging for stdout and stderr
2023-07-12 Christoph Langer JDK-8303154 Investigate and improve instruction cache flushing during compilation
2023-07-12 Christoph Langer JDK-8180266 Convert sun/security/provider/KeyStore/DKSTest.sh to Java Jtreg Test
2023-07-12 Christoph Langer JDK-8225012 sanity/client/SwingSet/src/ToolTipDemoTest.java fails on Windows
2023-07-11 Goetz Lindenmaier JDK-8297476 Increase InlineSmallCode default from 1000 to 2500 for RISC-V
2023-07-11 Goetz Lindenmaier JDK-8283929 GHA: Add RISC-V build config
2023-07-10 Christoph Langer JDK-8305421 Work around JDK-8305420 in CDSJDITest.java
2023-07-10 Christoph Langer JDK-8306718 Optimize and opensource some old AWT tests
2023-07-10 Christoph Langer JDK-8306636 Disable compiler/c2/Test6905845.java with -XX:TieredStopAtLevel=3
2023-07-10 Christoph Langer JDK-8285980 Several tests in compiler/c2/irTests miss @requires vm.compiler2.enabled
2023-07-08 Goetz Lindenmaier JDK-8306566 Open source several clipboard AWT tests
2023-07-08 Goetz Lindenmaier JDK-8306076 Open source AWT misc tests
2023-07-08 Goetz Lindenmaier JDK-8301700 Increase the default TLS Diffie-Hellman group size from 1024-bit to 2048-bit
2023-07-08 Goetz Lindenmaier JDK-8299158 Improve MD5 intrinsic on AArch64
2023-07-07 Goetz Lindenmaier JDK-8304725 AsyncGetCallTrace can cause SIGBUS on M1
2023-07-07 Goetz Lindenmaier JDK-8276799 Implementation of JEP 422: Linux/RISC-V Port
2023-07-07 Goetz Lindenmaier JDK-8277417 C1 LIR instruction for load-klass
2023-07-07 Goetz Lindenmaier JDK-8278141 LIR_OpLoadKlass::_info shadows the field of the same name from LIR_Op
2023-07-06 Christoph Langer JDK-8306137 Open source several AWT ScrollPane related tests
2023-07-06 Christoph Langer JDK-6176679 Application freezes when copying an animated gif image to the system clipboard
2023-07-06 Christoph Langer JDK-8299713 Test javax/swing/JTableHeader/6889007/bug6889007.java failed: Wrong type of cursor
2023-07-06 Christoph Langer JDK-8306765 Some client related jtreg problem list entries are malformed
2023-07-06 Christoph Langer JDK-8304314 StackWalkTest.java fails after CODETOOLS-7903373
2023-07-06 Goetz Lindenmaier JDK-8311249 Remove unused MemAllocator::obj_memory_range
2023-07-06 Goetz Lindenmaier JDK-8307348 Parallelize heap walk for ObjectCount(AfterGC) JFR event collection
2023-07-06 Goetz Lindenmaier JDK-8268852 AsyncLogWriter should not overide is_Named_thread()
2023-07-05 Christoph Langer JDK-8307078 Opensource and clean up five more AWT Focus related tests
2023-07-05 Christoph Langer JDK-8310549 avoid potential leaks in KeystoreImpl.m related to JNU_CHECK_EXCEPTION early returns
2023-07-05 Christoph Langer JDK-8289547 Update javax/swing/Popup/TaskbarPositionTest.java
2023-07-05 Christoph Langer JDK-8306638 Open source some AWT tests related to datatransfer and Toolkit
2023-07-05 Goetz Lindenmaier JDK-8308766 TLAB initialization may cause div by zero
2023-07-05 Goetz Lindenmaier JDK-8171221 Remove -XX:+CheckMemoryInitialization
2023-07-05 Goetz Lindenmaier JDK-8300693 Lower the compile threshold and reduce the iterations of warmup loop in VarHandles tests
2023-07-05 Goetz Lindenmaier JDK-8280885 Shenandoah: Some tests failed with "EA: missing allocation reference path"
2023-07-05 Goetz Lindenmaier JDK-8276696 ParallelObjectIterator freed at the wrong time in VM_HeapDumper
2023-07-04 Christoph Langer JDK-8300405 Screen capture for test JFileChooserSetLocationTest.java, failure case
2023-07-04 Goetz Lindenmaier JDK-8291444 GHA builds/tests won't run manually if disabled from automatic running
2023-07-04 Goetz Lindenmaier JDK-8306812 Open source several AWT Miscellaneous tests
2023-07-04 Goetz Lindenmaier JDK-8307083 Open source some drag and drop tests 3
2023-07-04 Goetz Lindenmaier JDK-8307299 Move more DnD tests to open
2023-07-04 Christoph Langer JDK-8308872 enhance logging and some exception in krb5/Config.java
2023-07-04 Christoph Langer JDK-8300098 java/util/concurrent/ConcurrentHashMap/ConcurrentAssociateTest.java fails with internal timeout when executed with TieredCompilation1/3
2023-07-04 Goetz Lindenmaier JDK-8282404 DrawStringWithInfiniteXform.java failed with "RuntimeException: drawString with InfiniteXform transform takes long time"
2023-07-04 Goetz Lindenmaier JDK-8293811 Provide a reason for PassFailJFrame.forceFail
2023-07-04 Goetz Lindenmaier JDK-8284760 Correct type/array element offset in LibraryCallKit::get_state_from_digest_object()
2023-07-04 Goetz Lindenmaier JDK-8277860 PPC: Remove duplicate info != NULL check
2023-07-04 Goetz Lindenmaier JDK-8270794 Avoid loading Klass* twice in TypeArrayKlass::oop_size()
2023-07-04 Goetz Lindenmaier JDK-8270894 Use acquire semantics in ObjectSynchronizer::read_stable_mark()
2023-06-30 Christoph Langer JDK-8306575 Clean up and open source four Dialog related tests
2023-06-30 Christoph Langer JDK-8306135 Clean up and open source some AWT tests
2023-06-30 Christoph Langer JDK-8303047 avoid NULL after 8301661
2023-06-30 Goetz Lindenmaier JDK-8290469 Add new positioning options to PassFailJFrame test framework
2023-06-30 Christoph Langer JDK-8306682 Open source a few more AWT Choice tests
2023-06-30 Christoph Langer JDK-8306484 Open source several AWT Choice jtreg tests
2023-06-30 Christoph Langer JDK-8306430 Open source some AWT tests related to TextComponent and Toolkit
2023-06-30 Christoph Langer JDK-8306372 Open source AWT CardLayout and Checkbox tests
2023-06-30 Christoph Langer JDK-8306134 Open source some AWT tests relating to Button and a few other classes
2023-06-30 Christoph Langer JDK-8289077 Add manual tests to open
2023-06-30 Goetz Lindenmaier JDK-8305763 Parsing a URI with an underscore goes through a silent exception, negatively impacting performance
2023-06-29 Christoph Langer JDK-8297887 Update Siphash
2023-06-29 Christoph Langer JDK-8301074 Replace NULL with nullptr in share/opto/
2023-06-29 Christoph Langer JDK-8297681 Unnecessary color conversion during 4BYTE_ABGR_PRE to INT_ARGB_PRE blit
2023-06-29 Christoph Langer JDK-8269466 Factor out the common code for initializing and starting internal VM JavaThreads
2023-06-28 Goetz Lindenmaier JDK-8308152 PropertyDescriptor should work with overridden generic getter method
2023-06-28 Goetz Lindenmaier JDK-8295812 Skip the "half float" support in LittleCMS during the build
2023-06-28 Goetz Lindenmaier JDK-8305950 Have -XshowSettings option display tzdata version
2023-06-28 Goetz Lindenmaier JDK-8289238 Refactoring changes to PassFailJFrame Test Framework
2023-06-26 Christoph Langer JDK-8310126 C1: Missing receiver null check in Reference::get intrinsic
2023-06-26 Christoph Langer JDK-8305425 Thread.isAlive0 doesn't need to call into the VM
2023-06-26 Christoph Langer JDK-8298974 Add ftcolor.c to imported freetype sources
2023-06-23 Goetz Lindenmaier JDK-8308643 Incorrect value of 'used' jvmstat counter
2023-06-23 Goetz Lindenmaier JDK-8309613 [Windows] hs_err files sometimes miss information about the code containing the error
2023-06-23 Goetz Lindenmaier JDK-8306281 function isWsl() returns false on WSL2
2023-06-23 Goetz Lindenmaier JDK-8303215 Make thread stacks not use huge pages
2023-06-23 Goetz Lindenmaier JDK-8306428 RunThese30M.java crashed with assert(early->flag() == current->flag() || early->flag() == mtNone)
2023-06-23 Goetz Lindenmaier JDK-8271406 Kitchensink failed with "assert(early->flag() == current->flag()) failed: Should be the same"
2023-06-23 Goetz Lindenmaier JDK-8229147 Linux os::create_thread() overcounts guardpage size with newer glibc (>=2.27)
2023-06-23 Christoph Langer JDK-8307604 gcc12 based Alpine build broken build after JDK-8307301
2023-06-23 Christoph Langer JDK-8307301 Update HarfBuzz to 7.2.0
2023-06-23 Christoph Langer JDK-8292182 [TESTLIB] Enhance JAXPPolicyManager to setup required permissions for jtreg version 7 jar
2023-06-23 Goetz Lindenmaier JDK-8153837 AArch64: Handle special cases for MaxINode & MinINode
2023-06-23 Goetz Lindenmaier JDK-8287227 Shenandoah: A couple of virtual thread tests failed with iu mode even without Loom enabled.
2023-06-22 Goetz Lindenmaier JDK-8304845 Update PCSC-Lite for Suse Linux to 1.9.9 and fix incomplete license wording
2023-06-22 Goetz Lindenmaier JDK-8306435 Juggle04/TestDescription.java should be a booleanArr test and not a byteArr one
2023-06-22 Goetz Lindenmaier JDK-8040793 vmTestbase/nsk/monitoring/stress/lowmem fails on calling isCollectionUsageThresholdExceeded()
2023-06-22 Goetz Lindenmaier JDK-8300659 Refactor TestMemoryAwareness to use WhiteBox api for host values
2023-06-22 Goetz Lindenmaier JDK-8283056 show abstract machine code in hs-err for all VM crashes
2023-06-21 Christoph Langer JDK-8307569 Build with gcc8 is broken after JDK-8307301
2023-06-21 Goetz Lindenmaier JDK-8291830 jvmti/RedefineClasses/StressRedefine failed: assert(!is_null(v)) failed: narrow klass value can never be zero
2023-06-21 Goetz Lindenmaier JDK-8252713 jtreg time out of CtrlASCII.java seems to hang the Xserver.
2023-06-21 Goetz Lindenmaier JDK-8263044 jdk/jfr/jvm/TestDumpOnCrash.java timed out
2023-06-21 Goetz Lindenmaier JDK-8274986 max code printed in hs-err logs should be configurable
2023-06-20 Christoph Langer JDK-8309228 Clarify EXPERIMENTAL flags comment in hotspot/share/runtime/globals.hpp
2023-06-20 Christoph Langer JDK-8309956 Shenandoah: Strengthen the mark word check in string dedup
2023-06-20 Christoph Langer JDK-8305236 Some LoadLoad barriers in the interpreter are unnecessary after JDK-8220051
2023-06-20 Christoph Langer JDK-8293012 ConstantPool::print_on can crash if _cache is NULL
2023-06-20 Christoph Langer JDK-8289688 jfr command hangs when it processes invalid file
2023-06-20 Christoph Langer JDK-8286481 Exception printed to stdout on Windows when storing transparent image in clipboard
2023-06-20 Christoph Langer JDK-8282665 [REDO] ByteBufferTest.java: replace endless recursion with RuntimeException in void ck(double x, double y)
2023-06-20 Christoph Langer JDK-8277102 Dubious PrintCompilation output
2023-06-20 Christoph Langer JDK-8275031 runtime/ErrorHandling/MachCodeFramesInErrorFile.java fails when hsdis is present
2023-06-20 Christoph Langer JDK-8272586 emit abstract machine code in hs-err logs
2023-06-19 Goetz Lindenmaier JDK-8309550 jdk.jfr.internal.Utils::formatDataAmount method should gracefully handle amounts equal to Long.MIN_VALUE
2023-06-19 Goetz Lindenmaier JDK-8307156 native_thread not protected by TLH
2023-06-19 Goetz Lindenmaier JDK-8295657 SA: Allow larger object alignments
2023-06-19 Goetz Lindenmaier JDK-8295811 serviceability/sa/TestObjectAlignment.java fails on x86_32
2023-06-19 Goetz Lindenmaier JDK-8290464 Optimize ResourceArea zapping on ResourceMark release
2023-06-19 Goetz Lindenmaier JDK-8279545 Buffer overrun in reverse_words of sharedRuntime_x86_64.cpp:3517
2023-06-19 Goetz Lindenmaier JDK-8267188 gc/stringdedup/TestStringDeduplicationInterned.java fails with Shenandoah
2023-06-19 Goetz Lindenmaier JDK-8272654 Mark word accesses should not use Access API
2023-06-19 Christoph Langer JDK-8305815 Update Libpng to 1.6.39
2023-06-19 Christoph Langer JDK-8292316 Tests should not rely on specific JAR file names (jpackage)
2023-06-19 Christoph Langer JDK-8292315 Tests should not rely on specific JAR file names (hotspot)
2023-06-19 Christoph Langer JDK-8286620 Create regression test for verifying setMargin() of JRadioButton
2023-06-19 Christoph Langer JDK-8285756 clean up use of bad arguments for `@clean` in langtools tests
2023-06-19 Christoph Langer JDK-8281507 Two javac tests have bad jtreg `@clean` tags
2023-06-19 Christoph Langer JDK-8280396 G1: Full gc mark stack draining should prefer to make work available to other threads
2023-06-19 Christoph Langer JDK-8267341 macos attempt_reserve_memory_at(arg1, arg2, true) failure
2023-06-19 Christoph Langer JDK-8209398 sun/security/pkcs11/KeyStore/SecretKeysBasic.sh failed with "PKCS11Exception: CKR_ATTRIBUTE_SENSITIVE"
2023-06-19 Christoph Langer JDK-8278456 Define jtreg jdk_desktop test group time-based sub-tasks for use by headful testing.
2023-06-16 Christoph Langer JDK-8301959 Compile command in compiler.loopopts.TestRemoveEmptyCountedLoop does not work
2023-06-16 Christoph Langer JDK-8289748 C2 compiled code crashes with SIGFPE with -XX:+StressLCM and -XX:+StressGCM
2023-06-16 Christoph Langer JDK-8271707 migrate tests to use jdk.test.whitebox.WhiteBox
2023-06-16 Goetz Lindenmaier JDK-8300584 Accelerate AVX-512 CRC32C for small buffers
2023-06-16 Goetz Lindenmaier JDK-8293252 Shenandoah: ThreadMXBean synchronizer tests crash with aggressive heuristics
2023-06-16 Goetz Lindenmaier JDK-8277654 Shenandoah: Don't produce new memory state in C2 LRB runtime call
2023-06-15 Goetz Lindenmaier JDK-8309862 Unsafe list operations in JfrStringPool
2023-06-15 Goetz Lindenmaier JDK-8309959 JFR: Display N/A for missing data amount
2023-06-15 Goetz Lindenmaier JDK-8309340 Provide sctpHandleSocketErrorWithMessage
2023-06-15 Christoph Langer JDK-8305858 Resolve multiple definition of 'handleSocketError' when statically linking with JDK native libraries
2023-06-14 Christoph Langer JDK-8302150 Speed up compiler/codegen/Test7100757.java
2023-06-14 Christoph Langer JDK-8282651 ZGC: vmTestbase/gc/ArrayJuggle/ tests fails intermittently with exit code 97
2023-06-14 Christoph Langer JDK-8299962 Speed up compiler/intrinsics/unsafe/DirectByteBufferTest.java and HeapByteBufferTest.java
2023-06-14 Christoph Langer JDK-8298921 Create a regression test for JDK-8139581
2023-06-14 Goetz Lindenmaier JDK-8305995 Footprint regression from JDK-8224957
2023-06-13 Christoph Langer JDK-8309297 Adjust ShenandoahHeap print_heap_regions_on
2023-06-13 Christoph Langer JDK-8308300 enhance exceptions in MappedMemoryUtils.c
2023-06-13 Christoph Langer JDK-8308156 VerifyCACerts.java misses blank in error output
2023-06-13 Goetz Lindenmaier JDK-8269091 javax/sound/sampled/Clip/SetPositionHang.java failed with ArrayIndexOutOfBoundsException: Array index out of range: -4
2023-06-12 Christoph Langer JDK-8309138 Fix container tests for jdks with symlinked conf dir
2023-06-12 Christoph Langer JDK-8304976 Optimize DateTimeFormatterBuilder.ZoneTextPrinterParser.getTree()
2023-06-06 Goetz Lindenmaier JDK-8283756 (zipfs) ZipFSOutputStreamTest.testOutputStream should only check inflated bytes
2023-06-02 Goetz Lindenmaier JDK-8307395 Add missing STS to Shenandoah
2023-06-02 Goetz Lindenmaier JDK-8301187 Memory leaks in OopMapCache
2023-05-31 Goetz Lindenmaier JDK-8300053 Shenandoah: Handle more GCCauses in ShenandoahControlThread::request_gc
2023-05-31 Goetz Lindenmaier JDK-8298138 Shenandoah: HdrSeq asserts "sub-bucket index (512) overflow for value ( 1.00)"
2023-05-30 Goetz Lindenmaier JDK-8306738 Select num workers for safepoint ParallelCleanupTask
2023-05-30 Goetz Lindenmaier JDK-8292698 Improve performance of DataInputStream
2023-05-30 Christoph Langer JDK-8308880 [17u] micro bench ZoneStrings missed in backport of 8278434
2023-05-30 Christoph Langer JDK-8287876 The recently de-problemlisted TestTitledBorderLeak test is unstable
2023-05-30 Goetz Lindenmaier JDK-8307572 AArch64: Vector registers are clobbered by some macroassemblers
2023-05-30 Goetz Lindenmaier JDK-8301637 ThreadLocalRandom.current().doubles().parallel() contention
2023-05-30 Goetz Lindenmaier JDK-8293492 ShenandoahControlThread missing from hs-err log and thread dump
2023-05-30 Goetz Lindenmaier JDK-8293295 Add type check asserts to java_lang_ref_Reference accessors
2023-05-29 Goetz Lindenmaier JDK-8294183 AArch64: Wrong macro check in SharedRuntime::generate_deopt_blob
2023-05-26 Goetz Lindenmaier JDK-8308884 [17u/11u] Backout JDK-8297951
2023-05-26 Goetz Lindenmaier JDK-8303809 Dispose context in SPNEGO NegotiatorImpl
2023-05-26 Goetz Lindenmaier JDK-8301119 Support for GB18030-2022
2023-05-26 Goetz Lindenmaier JDK-8286331 jni_GetStringUTFChars() uses wrong heap allocator
2023-05-26 Goetz Lindenmaier JDK-8286346 3-parameter version of AllocateHeap should not ignore AllocFailType
2023-05-25 Goetz Lindenmaier JDK-8307128 Open source some drag and drop tests 4
2023-05-25 Goetz Lindenmaier JDK-8301661 Enhance os::pd_print_cpu_info on macOS and Windows
2023-05-25 Goetz Lindenmaier JDK-8294717 (bf) DirectByteBuffer constructor will leak if allocating Deallocator or Cleaner fails with OOME
2023-05-25 Goetz Lindenmaier JDK-8292713 Unsafe.allocateInstance should be intrinsified without UseUnalignedAccesses
2023-05-25 Goetz Lindenmaier JDK-8283520 JFR: Memory leak in dcmd_arena
2023-05-25 Goetz Lindenmaier JDK-8274243 Implement fast-path for ASCII-compatible CharsetEncoders on aarch64
2023-05-25 Goetz Lindenmaier JDK-8307135 java/awt/dnd/NotReallySerializableTest/NotReallySerializableTest.java failed
2023-05-25 Goetz Lindenmaier JDK-8300939 sun/security/provider/certpath/OCSP/OCSPNoContentLength.java fails due to network errors
2023-05-25 Goetz Lindenmaier JDK-8275287 Relax memory ordering constraints on updating instance class and array class counters
2023-05-25 Goetz Lindenmaier JDK-8274615 Support relaxed atomic add for linux-aarch64
2023-05-24 Christoph Langer JDK-8308554 [17u] Fix commit of 8286191. vm.musl was not removed from ExternalEditorTest
2023-05-23 Goetz Lindenmaier JDK-8306954 Open source five Focus related tests
2023-05-23 Goetz Lindenmaier JDK-8306466 Open source more AWT Drag & Drop related tests
2023-05-23 Goetz Lindenmaier JDK-8306955 Open source several JComboBox jtreg tests
2023-05-23 Goetz Lindenmaier JDK-8307080 Open source some more JComboBox jtreg tests
2023-05-23 Goetz Lindenmaier JDK-8306681 Open source more AWT DnD related tests
2023-05-23 Goetz Lindenmaier JDK-8306133 Open source few AWT Drag & Drop related tests
2023-05-23 Goetz Lindenmaier JDK-8306432 Open source several AWT Text Component related tests
2023-05-23 Goetz Lindenmaier JDK-8306640 Open source several AWT TextArea related tests
2023-05-23 Goetz Lindenmaier JDK-8306409 Open source AWT KeyBoardFocusManger, LightWeightComponent related tests
2023-05-23 Goetz Lindenmaier JDK-8306850 Open source AWT Modal related tests
2023-05-23 Goetz Lindenmaier JDK-8306072 Open source several AWT MouseInfo related tests
2023-05-23 Goetz Lindenmaier JDK-8307347 serviceability/sa/ClhsdbDumpclass.java could leave files owned by root on macOS
2023-05-23 Goetz Lindenmaier JDK-8306652 Open source AWT MenuItem related tests
2023-05-23 Goetz Lindenmaier JDK-8306755 Open source few Swing JComponent and AbstractButton tests
2023-05-23 Goetz Lindenmaier JDK-8306752 Open source several container and component AWT tests
2023-05-23 Goetz Lindenmaier JDK-8306683 Open source several clipboard and color AWT tests
2023-05-23 Goetz Lindenmaier JDK-8287854 Dangling reference in ClassVerifier::verify_class
2023-05-23 Goetz Lindenmaier JDK-8275233 Incorrect line number reported in exception stack trace thrown from a lambda expression
2023-05-23 Goetz Lindenmaier JDK-8268582 javadoc throws NPE with --ignore-source-errors option
2023-05-22 Goetz Lindenmaier JDK-8307378 Allow collectors to provide specific values for GC notifications' actions
2023-05-22 Goetz Lindenmaier JDK-8307134 Add GTS root CAs
2023-05-22 Goetz Lindenmaier JDK-8306753 Open source several container AWT tests
2023-05-22 Goetz Lindenmaier JDK-8296343 CPVE thrown on missing content-length in OCSP response
2023-05-22 Goetz Lindenmaier JDK-8297154 Improve safepoint cleanup logging
2023-05-22 Goetz Lindenmaier JDK-8284331 Add sanity check for signal handler modification warning.
2023-05-22 Goetz Lindenmaier JDK-8227060 Optimize safepoint cleanup subtask order
2023-05-22 Goetz Lindenmaier JDK-8277407 javax/swing/plaf/synth/SynthButtonUI/6276188/bug6276188.java fails to compile after JDK-8276058
2023-05-19 Andrew Hughes JDK-8304350 Font.getStringBounds calculates wrong width for TextAttribute.TRACKING other than 0.0
2023-05-17 Christoph Langer JDK-8307130 Open source few Swing JMenu tests
2023-05-17 Christoph Langer JDK-8306941 Open source several datatransfer and dnd AWT tests
2023-05-17 Christoph Langer JDK-8307425 Socket input stream read burns CPU cycles with back-to-back poll(0) calls
2023-05-17 Christoph Langer JDK-8307381 Open Source JFrame, JIF related Swing Tests
2023-05-17 Christoph Langer JDK-8306871 Open source more AWT Drag & Drop tests
2023-05-17 Christoph Langer JDK-8307133 Open source some JTable jtreg tests
2023-05-17 Christoph Langer JDK-8306943 Open source several dnd AWT tests
2023-05-17 Christoph Langer JDK-8306489 Open source AWT List related tests
2023-05-17 Christoph Langer JDK-8304760 Add 2 Microsoft TLS roots
2023-05-17 Christoph Langer JDK-8248001 javadoc generates invalid HTML pages whose ftp:// links are broken
2023-05-16 Christoph Langer JDK-8306996 Open source Swing MenuItem related tests
2023-05-16 Christoph Langer JDK-8307346 Add missing gc+phases logging for ObjectCount(AfterGC) JFR event collection code
2023-05-16 Christoph Langer JDK-8305975 Add TWCA Global Root CA
2023-05-16 Christoph Langer JDK-8299544 Improve performance of CRC32C intrinsics (non-AVX-512) for small inputs
2023-05-16 Christoph Langer JDK-8295974 jni_FatalError and Xcheck:jni warnings should print the native stack when there are no Java frames
2023-05-12 Christoph Langer JDK-8282201 Consider removal of expiry check in VerifyCACerts.java test
2023-05-11 Goetz Lindenmaier JDK-8304054 Linux: NullPointerException from FontConfiguration.getVersion in case no fonts are installed
2023-05-11 Goetz Lindenmaier JDK-8305088 SIGSEGV in Method::is_method_handle_intrinsic
2023-05-11 Goetz Lindenmaier JDK-8304867 Explicitly disable dtrace for ppc builds
2023-05-11 Goetz Lindenmaier JDK-8276058 Some swing test fails on specific CI macos system
2023-05-10 Christoph Langer JDK-8297587 Upgrade JLine to 3.22.0
2023-05-10 Christoph Langer JDK-8296934 Write a test to verify whether Undecorated Frame can be iconified or not
2023-05-10 Christoph Langer JDK-8292206 TestCgroupMetrics.java fails as getMemoryUsage() is lower than expected
2023-05-10 Goetz Lindenmaier JDK-8307331 Correctly update line maps when class redefine rewrites bytecodes
2023-05-10 Goetz Lindenmaier JDK-8305993 Add handleSocketErrorWithMessage to extend nio Net.c exception message
2023-05-10 Goetz Lindenmaier JDK-8301216 ForkJoinPool invokeAll() ignores timeout
2023-05-09 Goetz Lindenmaier JDK-8305690 [X86] Do not emit two REX prefixes in Assembler::prefix
2023-05-08 Christoph Langer JDK-8299570 [JVMCI] Insufficient error handling when CodeBuffer is exhausted
2023-05-08 Christoph Langer JDK-8302508 Add timestamp to the output TraceCompilerThreads
2023-05-08 Christoph Langer JDK-8296084 javax/swing/JSpinner/4788637/bug4788637.java fails intermittently on a VM
2023-05-08 Christoph Langer JDK-8289509 Improve test coverage for XPath Axes: descendant, descendant-or-self, following, following-sibling
2023-05-08 Christoph Langer JDK-8297450 ScaledTextFieldBorderTest.java fails when run with -show parameter
2023-05-08 Christoph Langer JDK-8292990 Improve test coverage for XPath Axes: parent
2023-05-08 Christoph Langer JDK-8244976 vmTestbase/nsk/jdi/Event/request/request001.java doesn' initialize eName
2023-05-08 Christoph Langer JDK-8286398 Address possibly lossy conversions in jdk.internal.le
2023-05-08 Christoph Langer JDK-8286191 misc tests fail due to JDK-8285987
2023-05-08 Christoph Langer JDK-8285987 executing shell scripts without #! fails on Alpine linux
2023-05-08 Christoph Langer JDK-8283057 Update GCC to version 11.2.0 for Oracle builds on Linux
2023-05-08 Christoph Langer JDK-8275735 [linux] Remove deprecated Metrics api (kernel memory limit)
2023-05-05 Goetz Lindenmaier JDK-8306825 Monitor deflation might be accidentally disabled by zero intervals
2023-05-05 Goetz Lindenmaier JDK-8306774 Make runtime/Monitor/GuaranteedAsyncDeflationIntervalTest.java more reliable
2023-05-05 Goetz Lindenmaier JDK-8305994 Guarantee eventual async monitor deflation
2023-05-04 Goetz Lindenmaier JDK-8303861 Error handling step timeouts should never be blocked by OnError and others
2023-05-04 Goetz Lindenmaier JDK-8305481 gtest is_first_C_frame failing on ARM
2023-05-04 Goetz Lindenmaier JDK-8304291 [AIX] Broken build after JDK-8301998
2023-05-04 Goetz Lindenmaier JDK-8257856 Make ClassFileVersionsTest.java robust to JDK version updates
2023-05-04 Christoph Langer JDK-8303508 Vector.lane() gets wrong value on x86
2023-05-04 Christoph Langer JDK-8303069 Memory leak in CompilerOracle::parse_from_line
2023-05-04 Christoph Langer JDK-8303564 C2: "Bad graph detected in build_loop_late" after a CMove is wrongly split thru phi
2023-05-04 Christoph Langer JDK-8303511 C2: assert(get_ctrl(n) == cle_out) during unrolling
2023-04-28 Christoph Langer JDK-8301190 [vectorapi] The typeChar of LaneType is incorrect when default locale is tr
2023-04-28 Christoph Langer JDK-8287897 Augment src/jdk.internal.le/share/legal/jline.md with information on 4th party dependencies
2023-04-28 Goetz Lindenmaier JDK-8306976 UTIL_REQUIRE_SPECIAL warning on grep
2023-04-28 Goetz Lindenmaier JDK-8306883 Thread stacksize is reported with wrong units in os::create_thread logging
2023-04-28 Goetz Lindenmaier JDK-8289735 UTIL_LOOKUP_PROGS fails on pathes with space
2023-04-27 Christoph Langer JDK-8303476 Add the runtime version in the release file of a JDK image
2023-04-27 Christoph Langer JDK-8303130 Document required Accessibility permissions on macOS
2023-04-27 Christoph Langer JDK-8290822 C2: assert in PhaseIdealLoop::do_unroll() is subject to undefined behavior
2023-04-27 Christoph Langer JDK-8301491 C2: java.lang.StringUTF16::indexOfChar intrinsic called with negative character argument
2023-04-27 Christoph Langer JDK-8300079 SIGSEGV in LibraryCallKit::inline_string_copy due to constant NULL src argument
2023-04-27 Christoph Langer JDK-8297955 LDAP CertStore should use LdapName and not String for DNs
2023-04-27 Christoph Langer JDK-8224768 Test ActalisCA.java fails
2023-04-27 Goetz Lindenmaier JDK-8306664 GHA: Update MSVC version to latest stepping
2023-04-27 Goetz Lindenmaier JDK-8305403 Shenandoah evacuation workers may deadlock
2023-04-26 Christoph Langer JDK-8302595 use-after-free related to GraphKit::clone_map
2023-04-26 Christoph Langer JDK-8293858 Change PKCS7 code to use default SecureRandom impl instead of SHA1PRNG
2023-04-26 Christoph Langer JDK-8294673 JFR: Add SecurityProviderService#threshold to TestActiveSettingEvent.java
2023-04-26 Christoph Langer JDK-8254711 Add java.security.Provider.getService JFR Event
2023-04-26 Goetz Lindenmaier JDK-8306768 CodeCache Analytics reports wrong threshold
2023-04-25 Goetz Lindenmaier JDK-8296545 C2 Blackholes should allow load optimizations
2023-04-25 Goetz Lindenmaier JDK-8306658 GHA: MSVC installation could be optional since it might already be pre-installed
2023-04-25 Goetz Lindenmaier JDK-8283566 G1: Improve G1BarrierSet::enqueue performance
2023-04-25 Goetz Lindenmaier JDK-8252990 Intrinsify Unsafe.storeStoreFence
2023-04-24 Christoph Langer JDK-8302594 use-after-free in Node::destruct
2023-04-24 Christoph Langer JDK-8302172 [JVMCI] HotSpotResolvedJavaMethodImpl.canBeInlined must respect ForceInline
2023-04-24 Christoph Langer JDK-8301338 Identical branch conditions in CompileBroker::print_heapinfo
2023-04-24 Christoph Langer JDK-8296412 Special case infinite loops with unmerged backedges in IdealLoopTree::check_safepts
2023-04-24 Goetz Lindenmaier JDK-8306543 GHA: MSVC installation is failing
2023-04-24 Goetz Lindenmaier JDK-8278146 G1: Rework VM_G1Concurrent VMOp to clearly identify it as pause
2023-04-20 Christoph Langer JDK-8305400 ISO 4217 Amendment 175 Update
2023-04-20 Christoph Langer JDK-8304683 Memory leak in WB_IsMethodCompatible
2023-04-20 Christoph Langer JDK-8301123 Enable Symbol refcounting underflow checks in PRODUCT
2023-04-20 Christoph Langer JDK-8300823 UB: Compile::_phase_optimize_finished is initialized too late
2023-04-20 Christoph Langer JDK-8297730 C2: Arraycopy intrinsic throws incorrect exception
2023-04-20 Christoph Langer JDK-8299179 ArrayFill with store on backedge needs to reduce length by 1
2023-04-20 Christoph Langer JDK-8271519 java/awt/event/SequencedEvent/MultipleContextsFunctionalTest.java failed with "Total [200] - Expected [400]"
2023-04-20 Christoph Langer JDK-8304134 jib bootstrapper fails to quote filename when checking download filetype
2023-04-20 Christoph Langer JDK-8285635 javax/swing/JRootPane/DefaultButtonTest.java failed with Default Button not pressed for L&F: com.sun.java.swing.plaf.motif.MotifLookAndFeel
2023-04-20 Christoph Langer JDK-8268298 jdk/jfr/api/consumer/log/TestVerbosity.java fails: unexpected log message
2023-04-20 Christoph Langer JDK-8289949 Improve test coverage for XPath: operators
2023-04-20 Christoph Langer JDK-8282704 runtime/Thread/StopAtExit.java may leak memory
2023-04-20 Christoph Langer JDK-8273909 vmTestbase/nsk/jdi/Event/request/request001 can still fail with "ERROR: new event is not ThreadStartEvent"
2023-04-20 Christoph Langer JDK-8270434 JDI+UT: Unexpected event in JDI tests
2023-04-20 Christoph Langer JDK-8304295 harfbuzz build fails with GCC 7 after JDK-8301998
2023-04-20 Christoph Langer JDK-8301998 Update HarfBuzz to 7.0.1
2023-04-20 Christoph Langer JDK-8303482 Update LCMS to 2.15
2023-04-20 Christoph Langer JDK-8303588 [JVMCI] make JVMCI source directories conform with standard layout
2023-04-20 Christoph Langer JDK-8302151 BMPImageReader throws an exception reading BMP images
2023-04-20 Goetz Lindenmaier JDK-8201516 DebugNonSafepoints generates incorrect information
2023-04-20 Christoph Langer JDK-8178806 Better exception logging in crypto code
2023-04-20 Christoph Langer JDK-8299259 C2: Div/Mod nodes without zero check could be split through iv phi of loop resulting in SIGFPE
2023-04-20 Christoph Langer JDK-8296318 use-def assert: special case undetected loops nested in infinite loops
2023-04-20 Christoph Langer JDK-8298488 [macos13] tools/jpackage tests failing with "Exit code: 137" on macOS
2023-04-20 Christoph Langer JDK-8277775 Fixup bugids in RemoveDropTargetCrashTest.java - add 4357905
2023-04-19 Christoph Langer JDK-8270869 G1ServiceThread may not terminate
2023-04-18 Christoph Langer JDK-8299959 C2: CmpU::Value must filter overflow computation against local sub computation
2023-04-18 Christoph Langer JDK-8297000 [jib] Add more friendly warning for proxy issues
2023-04-18 Christoph Langer JDK-8295564 Norwegian Nynorsk Locale is missing formatting
2023-04-18 Christoph Langer JDK-8294906 Memory leak in PKCS11 NSS TLS server
2023-04-18 Christoph Langer JDK-8292755 Non-default method in interface leads to a stack overflow in JShell
2023-04-18 Christoph Langer JDK-8287007 [cgroups] Consistently use stringStream throughout parsing code
2023-04-18 Christoph Langer JDK-8287246 DSAKeyValue should check for missing params instead of relying on KeyFactory provider
2023-04-17 Goetz Lindenmaier JDK-8305113 (tz) Update Timezone Data to 2023c
2023-04-17 Goetz Lindenmaier JDK-8298887 On the latest macOS+XCode the Robot API may report wrong colors
2023-04-13 Christoph Langer JDK-8305721 add `make compile-commands` artifacts to .gitignore
2023-04-13 Christoph Langer JDK-8305711 Arm: C2 always enters slowpath for monitorexit
2023-04-13 Christoph Langer JDK-8302491 NoClassDefFoundError omits the original cause of an error
2023-04-13 Christoph Langer JDK-8288589 Files.readString ignores encoding errors for UTF-16
2023-04-13 Christoph Langer JDK-8274864 Remove Amman/Cairo hacks in ZoneInfoFile
2023-04-13 Christoph Langer JDK-8238274 (sctp) JDK-7118373 is not fixed for SctpChannel
2023-04-13 Christoph Langer JDK-8245877 assert(_value != __null) failed: resolving NULL _value in JvmtiExport::post_compiled_method_load
2023-04-04 Christoph Langer JDK-8293887 AArch64 build failure with GCC 12 due to maybe-uninitialized warning in libfdlibm k_rem_pio2.c
2023-04-04 Christoph Langer JDK-8294281 Allow warnings to be disabled on a per-file basis
2023-03-31 Christoph Langer JDK-8278434 timeouts in test java/time/test/java/time/format/TestZoneTextPrinterParser.java
2023-03-31 Christoph Langer JDK-8291638 Keep-Alive timeout of 0 should close connection immediately
2023-03-31 Christoph Langer JDK-8282227 Locale information for nb is not working properly
2023-03-31 Christoph Langer JDK-8275721 Name of UTC timezone in a locale changes depending on previous code
2023-03-31 Goetz Lindenmaier JDK-8304880 [PPC64] VerifyOops code in C1 doesn't work with ZGC
2023-03-29 Christoph Langer JDK-8304671 javac regression: Compilation with --release 8 fails on underscore in enum identifiers
2023-03-29 Christoph Langer JDK-8291226 Create Test Cases to cover scenarios for JDK-8278067
2023-03-29 Christoph Langer JDK-8291637 HttpClient default keep alive timeout not followed if server sends invalid value
2023-03-29 Christoph Langer JDK-8287541 Files.writeString fails to throw IOException for charset "windows-1252"
2023-03-29 Christoph Langer JDK-8286287 Reading file as UTF-16 causes Error which "shouldn't happen"
2023-03-29 Christoph Langer JDK-8283062 Uninitialized warnings in libgtest with GCC 11.2
2023-03-29 Christoph Langer JDK-8282077 PKCS11 provider C_sign() impl should handle CKR_BUFFER_TOO_SMALL error
2023-03-28 Christoph Langer JDK-8278834 Error "Cannot read field "sym" because "this.lvar[od]" is null" when compiling
2023-03-28 Christoph Langer JDK-8268288 jdk/jfr/api/consumer/streaming/TestOutOfProcessMigration.java fails with "Error: ShouldNotReachHere()"
2023-03-27 Goetz Lindenmaier JDK-8302849 SurfaceManager might expose partially constructed object
2023-03-24 Goetz Lindenmaier JDK-8303822 gtestMain should give more helpful output
2023-03-24 Goetz Lindenmaier JDK-8303102 jcmd: ManagementAgent.status truncates the text longer than O_BUFLEN
2023-03-24 Goetz Lindenmaier JDK-8227257 javax/swing/JFileChooser/4847375/bug4847375.java fails with AssertionError
2023-03-23 Goetz Lindenmaier JDK-8303575 adjust Xen handling on Linux aarch64
2023-03-23 Goetz Lindenmaier JDK-8300042 Improve CPU related JFR events descriptions
2023-03-20 Severin Gehwolf JDK-8292301 [REDO v2] C2 crash when allocating array of size too large
2023-03-20 Goetz Lindenmaier JDK-8304063 tools/jpackage/share/AppLauncherEnvTest.java fails when checking LD_LIBRARY_PATH
2023-03-17 Christoph Langer JDK-8303949 gcc10 warning Linux ppc64le - note: the layout of aggregates containing vectors with 8-byte alignment has changed in GCC 5
2023-03-16 Goetz Lindenmaier JDK-8303576 addIdentitiesToKeystore in KeystoreImpl.m needs CFRelease call in early potential CHECK_NULL return
2023-03-16 Goetz Lindenmaier JDK-8302791 Add specific ClassLoader object to Proxy IllegalArgumentException message
2023-03-16 Goetz Lindenmaier JDK-8303354 addCertificatesToKeystore in KeystoreImpl.m needs CFRelease call in early potential CHECK_NULL return
2023-03-16 Goetz Lindenmaier JDK-8301050 Detect Xen Virtualization on Linux aarch64
2023-03-15 Goetz Lindenmaier JDK-8302320 AsyncGetCallTrace obtains too few frames in sanity test
2023-03-14 Goetz Lindenmaier JDK-8303937 Corrupted heap dumps due to missing retries for os::write()
2023-03-13 Goetz Lindenmaier JDK-8292407 Improve Weak CAS VarHandle/Unsafe tests resilience under spurious failures
2023-03-10 Christoph Langer JDK-8303440 The "ZonedDateTime.parse" may not accept the "UTC+XX" zone id
2023-03-10 Christoph Langer JDK-8270859 Post JEP 411 refactoring: client libs with maximum covering > 10K
2023-03-03 Christoph Langer JDK-8289511 Improve test coverage for XPath Axes: child
2023-03-03 Christoph Langer JDK-8284524 Create an automated test for JDK-4422362
2023-03-03 Christoph Langer JDK-8284767 Create an automated test for JDK-4422535
2023-03-03 Christoph Langer JDK-8210927 JDB tests do not update source path after doing a redefine class
2023-03-03 Christoph Langer JDK-8048190 NoClassDefFoundError omits original ExceptionInInitializerError
2023-03-01 Christoph Langer JDK-8290197 test/jdk/java/nio/file/Files/probeContentType/Basic.java fails on some systems for the ".rar" extension
2023-02-28 Christoph Langer JDK-8294548 Problem list SA core file tests on macosx-x64 due to JDK-8294316
2023-02-28 Goetz Lindenmaier JDK-8213531 Test javax/swing/border/TestTitledBorderLeak.java fails
2023-02-27 Goetz Lindenmaier JDK-8302879 doc/building.md update link to jtreg builds
2023-02-24 Christoph Langer JDK-8280703 CipherCore.doFinal(...) causes potentially massive byte[] allocations during decryption
2023-02-24 Christoph Langer JDK-8245654 Add Certigna Root CA
2023-02-24 Christoph Langer JDK-8294902 Undefined Behavior in C2 regalloc with null references
2023-02-24 Christoph Langer JDK-8251177 [macosx] The text "big" is truncated in JTabbedPane
2023-02-24 Goetz Lindenmaier JDK-8289647 AssertionError during annotation processing of record related tests
2023-02-22 Goetz Lindenmaier JDK-8272702 Resolving URI relative path with no / may lead to incorrect toString
2023-02-21 Goetz Lindenmaier JDK-8300751 [17u] Remove duplicate entry in javac.properties
2023-02-21 Goetz Lindenmaier JDK-8266974 duplicate property key in java.sql.rowset resource bundle
2023-02-20 Goetz Lindenmaier JDK-8299970 Speed up compiler/arraycopy/TestArrayCopyConjoint.java
2023-02-20 Goetz Lindenmaier JDK-8301342 Prefer ArrayList to LinkedList in LayoutComparator
2023-02-20 Goetz Lindenmaier JDK-8302152 Speed up tests with infinite loops, sleep less
2023-02-17 Christoph Langer JDK-8288332 Tier1 validate-source fails after 8279614
2023-02-17 Goetz Lindenmaier JDK-8302692 [17u] Update GHA Boot JDK to 17.0.6
2023-02-16 Goetz Lindenmaier JDK-8301842 JFR: increase checkpoint event size for stacktrace and string pool
2023-02-15 Christoph Langer JDK-8282958 Rendering Issues with Borders on Windows High-DPI systems
2023-02-15 Christoph Langer JDK-8295777 java/net/httpclient/ConnectExceptionTest.java should not rely on system resolver
2023-02-15 Christoph Langer JDK-8294958 java/net/httpclient/ConnectTimeout tests are slow
2023-02-15 Christoph Langer JDK-8279614 The left line of the TitledBorder is not painted on 150 scale factor
2023-02-15 Christoph Langer JDK-8281170 Test jdk/tools/jpackage/windows/WinInstallerIconTest always fails on Windows 11
2023-02-15 Goetz Lindenmaier JDK-8297437 javadoc cannot link to old docs (with old style anchors)
2023-02-15 Goetz Lindenmaier JDK-8300266 Detect Virtualization on Linux aarch64
2023-02-14 Christoph Langer JDK-8288415 java/awt/PopupMenu/PopupMenuLocation.java is unstable in MacOS machines
2023-02-13 Christoph Langer JDK-8299671 Speed up compiler/intrinsics/string/TestStringLatin1IndexOfChar.java
2023-02-13 Christoph Langer JDK-8299018 java/net/httpclient/HttpsTunnelAuthTest.java fails with java.io.IOException: HTTP/1.1 header parser received no bytes
2023-02-13 Christoph Langer JDK-8297489 Modify TextAreaTextEventTest.java as to verify the content change of TextComponent sends TextEvent
2023-02-13 Christoph Langer JDK-8223783 sun/net/www/http/HttpClient/MultiThreadTest.java sometimes detect threads+1 connections
2023-02-13 Christoph Langer JDK-8186765 Speed up test sun/net/www/protocol/https/HttpsClient/ProxyAuthTest.java
2023-02-13 Goetz Lindenmaier JDK-8300205 Swing test bug8078268 make latch timeout configurable
2023-02-13 Goetz Lindenmaier JDK-8299957 Enhance error logging in instrument coding with additional jplis_assert_msg
2023-02-10 Christoph Langer JDK-8296675 Exclude linux-aarch64 in NSS tests
2023-02-10 Christoph Langer JDK-8295774 Write a test to verify List sends ItemEvent/ActionEvent
2023-02-10 Christoph Langer JDK-8295000 java/util/Formatter/Basic test cleanup
2023-02-10 Christoph Langer JDK-8292328 AccessibleActionsTest.java test instruction for show popup on JLabel did not specify shift key
2023-02-10 Christoph Langer JDK-8293819 sun/util/logging/PlatformLoggerTest.java failed with "RuntimeException: Retrieved backing PlatformLogger level null is not the expected CONFIG"
2023-02-10 Christoph Langer JDK-8286030 Avoid JVM crash when containers share the same /tmp dir
2023-02-10 Christoph Langer JDK-8290083 ResponseBodyBeforeError: AssertionError or SSLException: Unsupported or unrecognized SSL message
2023-02-10 Christoph Langer JDK-8195809 [TESTBUG] jps and jcmd -l support for containers is not tested
2023-02-10 Christoph Langer JDK-8301170 perfMemory_windows.cpp add free_security_attr to early returns
2023-02-09 Goetz Lindenmaier JDK-8301760 Fix possible leak in SpNegoContext dispose
2023-02-08 Christoph Langer JDK-8298073 gc/metaspace/CompressedClassSpaceSizeInJmapHeap.java causes test task timeout on macosx
2023-02-08 Christoph Langer JDK-8286962 java/net/httpclient/ServerCloseTest.java failed once with ConnectException
2023-02-07 Andrew Haley JDK-8298472 AArch64: Detect Ampere-1 and Ampere-1A CPUs and set default options
2023-02-06 Goetz Lindenmaier JDK-8300590 [JVMCI] BytecodeFrame.equals is broken
2023-02-06 Goetz Lindenmaier JDK-8296329 jar validator doesn't account for minor class file version
2023-02-03 Goetz Lindenmaier JDK-8294677 chunklevel::MAX_CHUNK_WORD_SIZE too small for some applications
2023-02-03 Goetz Lindenmaier JDK-8290838 Improve test coverage for XPath functions: Number Functions
2023-02-03 Goetz Lindenmaier JDK-8290837 Improve test coverage for XPath functions: Boolean Functions
2023-02-03 Goetz Lindenmaier JDK-8299194 CustomTzIDCheckDST.java may fail at future date
2023-02-03 Goetz Lindenmaier JDK-8299296 Write a test to verify the components selection sends ItemEvent
2023-02-02 Christoph Langer JDK-8293326 jdk/sun/security/tools/jarsigner/compatibility/SignTwice.java slow on Windows
2023-02-02 Christoph Langer JDK-8289400 Improve com/sun/jdi/TestScaffold error reporting
2023-02-02 Christoph Langer JDK-8292066 Convert TestInputArgument.sh and TestSystemLoadAvg.sh to java version
2023-02-02 Christoph Langer JDK-8292443 Weak CAS VarHandle/Unsafe tests should test always-failing cases
2023-02-02 Christoph Langer JDK-8291825 java/time/nontestng/java/time/zone/CustomZoneNameTest.java fails if defaultLocale and defaultFormatLocale are different
2023-02-02 Christoph Langer JDK-8286844 com/sun/jdi/RedefineCrossEvent.java failed with 1 threads completed while VM suspended
2023-02-02 Christoph Langer JDK-8287593 ShortResponseBody could be made more resilient to rogue connections
2023-02-01 Christoph Langer JDK-8289440 Remove vmTestbase/nsk/monitoring/MemoryPoolMBean/isCollectionUsageThresholdExceeded/isexceeded003 from ProblemList.txt
2023-02-01 Christoph Langer JDK-8282036 Change java/util/zip/ZipFile/DeleteTempJar.java to stop HttpServer cleanly in case of exceptions
2023-02-01 Christoph Langer JDK-8209935 Test to cover CodeSource.getCodeSigners()
2023-02-01 Christoph Langer JDK-8271838 AmazonCA.java interop test fails
2023-02-01 Christoph Langer JDK-8286154 Fix 3rd party notices in test files
2023-02-01 Christoph Langer JDK-6779701 Wrong defect ID in the code of test LocalRMIServerSocketFactoryTest.java
2023-01-31 Goetz Lindenmaier JDK-8298649 JFR: RemoteRecordingStream support for checkpoint event sizes beyond u4
2023-01-31 Goetz Lindenmaier JDK-8289948 Improve test coverage for XPath functions: Node Set Functions
2023-01-31 Goetz Lindenmaier JDK-8301397 [11u, 17u] Bump jtreg to fix issue with build JDK 11.0.18
2023-01-31 Goetz Lindenmaier JDK-8277990 NMT: Remove NMT shutdown capability
2023-01-29 Christoph Langer JDK-8280007 Enable Neoverse N1 optimizations for Arm Neoverse V1 & N2
2023-01-29 Christoph Langer JDK-8293000 Review running times of jshell regression tests
2023-01-29 Christoph Langer JDK-8294160 misc crash dump improvements
2023-01-29 Christoph Langer JDK-8230374 maxOutputSize, instead of javatest.maxOutputSize, should be used in TEST.properties
2023-01-29 Christoph Langer JDK-8285965 TestScenarios.java does not check for "" correctly
2023-01-29 Christoph Langer JDK-8286873 Improve websocket test execution time
2023-01-29 Christoph Langer JDK-8284115 [IR Framework] Compilation is not found due to rare safepoint while dumping PrintIdeal/PrintOptoAssembly
2023-01-29 Christoph Langer JDK-8276086 Increase size of metaspace mappings
2023-01-29 Christoph Langer JDK-8275704 Metaspace::contains() should be threadsafe
2023-01-27 Goetz Lindenmaier JDK-8300692 GCC 12 reports some compiler warnings in bundled freetype
2023-01-27 Goetz Lindenmaier JDK-8298129 Let checkpoint event sizes grow beyond u4 limit
2023-01-27 Goetz Lindenmaier JDK-8297963 Partially fix string expansion issues in UTIL_DEFUN_NAMED and related macros
2023-01-27 Goetz Lindenmaier JDK-8293466 libjsig should ignore non-modifying sigaction calls
2023-01-27 Goetz Lindenmaier JDK-8286694 Incorrect argument processing in java launcher
2023-01-27 Goetz Lindenmaier JDK-8192931 Regression test java/awt/font/TextLayout/CombiningPerf.java fails
2023-01-26 Goetz Lindenmaier JDK-8277946 NMT: Remove VM.native_memory shutdown jcmd command option
2023-01-26 Goetz Lindenmaier JDK-8280048 Missing comma in copyright header
2023-01-25 Christoph Langer JDK-8300773 Address the inconsistency between the constant array and pool size
2023-01-25 Christoph Langer JDK-8208077 File.listRoots performance degradation
2023-01-25 Christoph Langer JDK-8295685 Update Libpng to 1.6.38
2023-01-25 Goetz Lindenmaier JDK-8299497 Usage of constructors of primitive wrapper classes should be avoided in java.desktop API docs
2023-01-25 Goetz Lindenmaier JDK-6528710 sRGB-ColorSpace to sRGB-ColorSpace Conversion
2023-01-25 Goetz Lindenmaier JDK-8294705 Disable an assertion in test/jdk/java/util/DoubleStreamSums/CompensatedSums.java
2023-01-25 Goetz Lindenmaier JDK-8286562 GCC 12 reports some compiler warnings
2023-01-25 Goetz Lindenmaier JDK-8287491 compiler/jvmci/errors/TestInvalidDebugInfo.java fails new assert: assert((uint)t < T_CONFLICT + 1) failed: invalid type #
2023-01-25 Goetz Lindenmaier JDK-8293691 converting a defined BasicType value to a string should not crash the VM
2023-01-23 Christoph Langer JDK-8297264 C2: Cast node is not processed again in CCP and keeps a wrong too narrow type which is later replaced by top
2023-01-23 Christoph Langer JDK-8287180 Update IANA Language Subtag Registry to Version 2022-08-08
2023-01-23 Christoph Langer JDK-8292033 Move jdk.X509Certificate event logic to JCA layer
2023-01-23 Christoph Langer JDK-8231491 JDI tc02x004 failed again due to wrong # of breakpoints
2023-01-23 Christoph Langer JDK-8282771 Create test case for JDK-8262981
2023-01-23 Christoph Langer JDK-8285690 CloneableReference subtest should not throw CloneNotSupportedException
2023-01-23 Goetz Lindenmaier JDK-8300119 CgroupMetrics.getTotalMemorySize0() can report invalid results on 32 bit systems
2023-01-23 Goetz Lindenmaier JDK-8286705 GCC 12 reports use-after-free potential bugs
2023-01-20 Christoph Langer JDK-8287754 Update jib GNU make dependency on Windows to latest cygwin build
2023-01-20 Christoph Langer JDK-8272985 Reference discovery is confused about atomicity and degree of parallelism
2023-01-19 Severin Gehwolf JDK-8300642 [17u,11u] Fix DEFAULT_PROMOTED_VERSION_PRE=ea for -dev
2023-01-19 Goetz Lindenmaier JDK-8300490 Spaces in name of MacOS Code Signing Identity are not correctly handled after JDK-8293550
2023-01-18 Goetz Lindenmaier JDK-8285919 Remove debug printout from JDK-8285093
2023-01-18 Christoph Langer JDK-8299657 sun/tools/jhsdb/SAGetoptTest.java fails after 8299470
2023-01-18 Christoph Langer JDK-8285755 JDK-8285093 changed the default for --with-output-sync
2023-01-18 Christoph Langer JDK-8282143 Objects.requireNonNull should be ForceInline
2023-01-17 Goetz Lindenmaier JDK-8299470 sun/jvm/hotspot/SALauncher.java handling of negative rmiport args
2023-01-17 Christoph Langer JDK-8280896 java/nio/file/Files/probeContentType/Basic.java fails on Windows 11
2023-01-16 Christoph Langer JDK-8283719 java/util/logging/CheckZombieLockTest.java failing intermittently
2023-01-16 Christoph Langer JDK-8283717 vmTestbase/nsk/jdi/ThreadStartEvent/thread/thread001 failed due to SocketTimeoutException
2023-01-16 Christoph Langer JDK-8298568 Fastdebug build fails after JDK-8296389
2023-01-16 Christoph Langer JDK-8296389 C2: PhaseCFG::convert_NeverBranch_to_Goto must handle both orders of successors
2023-01-16 Christoph Langer JDK-8297642 PhaseIdealLoop::only_has_infinite_loops must detect all loops that never lead to termination
2023-01-16 Christoph Langer JDK-8290850 C2: create_new_if_for_predicate() does not clone pinned phi input nodes resulting in a broken graph
2023-01-16 Christoph Langer JDK-8278961 Enable debug logging in java/net/DatagramSocket/SendDatagramToBadAddress.java
2023-01-16 Christoph Langer JDK-8273154 Provide a JavadocTester method for non-overlapping, unordered output matching
2023-01-16 Christoph Langer JDK-8254267 javax/xml/crypto/dsig/LogParameters.java failed with "RuntimeException: Unexpected log output:"
2023-01-16 Goetz Lindenmaier JDK-8295211 Fix autoconf 2.71 warning "AC_CHECK_HEADERS: you should use literals"
2023-01-16 Goetz Lindenmaier JDK-8293493 Signal Handlers printout should show signal block state
2023-01-16 Goetz Lindenmaier JDK-8279351 [TESTBUG] SADebugDTest.java does not handle "Address already in use" error
2023-01-12 Goetz Lindenmaier JDK-8275582 Don't purge metaspace mapping lists
2023-01-12 Goetz Lindenmaier JDK-8299789 Compilation of gtest causes build to fail if runtime libraries are in different dirs
2023-01-12 Goetz Lindenmaier JDK-8299520 TestPrintXML.java output error messages in case compare fails
2023-01-12 Goetz Lindenmaier JDK-8299424 containers/docker/TestMemoryWithCgroupV1.java fails on SLES12 ppc64le when testing Memory and Swap Limit
2023-01-12 Goetz Lindenmaier JDK-8299388 java/util/regex/NegativeArraySize.java fails on Alpine and sometimes Windows
2023-01-12 Goetz Lindenmaier JDK-8295413 com/sun/jdi/EATests.java fails with compiler flag -XX:+StressReflectiveCode
2023-01-12 Goetz Lindenmaier JDK-8144030 [macosx] test java/awt/Frame/ShapeNotSetSometimes/ShapeNotSetSometimes.java fails (again)
2023-01-12 Christoph Langer JDK-8295116 C2: assert(dead->outcnt() == 0 && !dead->is_top()) failed: node must be dead
2023-01-12 Christoph Langer JDK-8297951 C2: Create skeleton predicates for all If nodes in loop predication
2023-01-12 Christoph Langer JDK-8296619 Upgrade jQuery to 3.6.1
2023-01-12 Christoph Langer JDK-8286707 JFR: Don't commit JFR internal jdk.JavaMonitorWait events
2023-01-12 Christoph Langer JDK-8267038 Update IANA Language Subtag Registry to Version 2022-03-02
2023-01-11 Goetz Lindenmaier JDK-8297523 Various GetPrimitiveArrayCritical miss result - NULL check
2023-01-11 Goetz Lindenmaier JDK-8290067 Show stack dimensions in UL logging when attaching threads
2023-01-11 Goetz Lindenmaier JDK-8284726 Print active locale settings in hs_err reports and in VM.info
2023-01-11 Goetz Lindenmaier JDK-8284165 Add pid to process reaper thread name
2023-01-10 Christoph Langer JDK-8297088 Update LCMS to 2.14
2023-01-10 Goetz Lindenmaier JDK-8277822 Remove debug-only heap overrun checks in os::malloc and friends
2023-01-09 Christoph Langer JDK-8297431 [JVMCI] HotSpotJVMCIRuntime.encodeThrowable should not throw an exception
2023-01-09 Christoph Langer JDK-8297569 URLPermission constructor throws IllegalArgumentException: Invalid characters in hostname after JDK-8294378
2023-01-09 Christoph Langer JDK-8295788 C2 compilation hits "assert((mode == ControlAroundStripMined && use == sfpt) || !use->is_reachable_from_root()) failed: missed a node"
2023-01-09 Christoph Langer JDK-8296912 C2: CreateExNode::Identity fails with assert(i < _max) failed: oob: i=1, _max=1
2023-01-09 Christoph Langer JDK-8276064 CheckCastPP with raw oop input floats below a safepoint
2023-01-09 Christoph Langer JDK-8299483 ProblemList java/text/Format/NumberFormat/CurrencyFormat.java
2023-01-09 Christoph Langer JDK-8299439 java/text/Format/NumberFormat/CurrencyFormat.java fails for hr_HR
2023-01-06 Andrew Haley JDK-8296924 C2: assert(is_valid_AArch64_address(dest.target())) failed: bad address
2023-01-04 Christoph Langer JDK-8292177 InitialSecurityProperty JFR event
2023-01-04 Christoph Langer JDK-8285835 SIGSEGV in PhaseIdealLoop::build_loop_late_post_work
2023-01-04 Christoph Langer JDK-8286800 Assert in PhaseIdealLoop::dump_real_LCA is too strong
2023-01-04 Christoph Langer JDK-8294947 Use 64bit atomics in patch_verified_entry on x86_64
2023-01-04 Christoph Langer JDK-8294217 Assertion failure: parsing found no loops but there are some
2023-01-04 Christoph Langer JDK-8292159 TYPE_USE annotations on generic type arguments of record components discarded
2023-01-04 Christoph Langer JDK-8294538 missing is_unloading() check in SharedRuntime::fixup_callers_callsite()
2023-01-04 Christoph Langer JDK-8295414 [Aarch64] C2: assert(false) failed: bad AD file
2023-01-04 Christoph Langer JDK-8280553 resourcehogs/serviceability/sa/TestHeapDumpForLargeArray.java can fail if GC occurs
2023-01-04 Christoph Langer JDK-8270476 Make floating-point test infrastructure more lambda and method reference friendly
2023-01-04 Christoph Langer JDK-8212961 [TESTBUG] vmTestbase/nsk/stress/jni/ native code cleanup
2023-01-02 Christoph Langer JDK-8298035 Provide better descriptions for JIT compiler JFR events
2023-01-02 Christoph Langer JDK-8242115 C2 SATB barriers are not safepoint-safe
2023-01-02 Christoph Langer JDK-8294378 URLPermission constructor exception when using tr locale
2023-01-02 Christoph Langer JDK-8296239 ISO 4217 Amendment 174 Update
2023-01-02 Christoph Langer JDK-8296136 Use correct register in aarch64_enc_fast_unlock()
2023-01-02 Christoph Langer JDK-8295066 Folding of loads is broken in C2 after JDK-8242115
2023-01-02 Christoph Langer JDK-8293531 C2: some vectorapi tests fail assert "Not monotonic" with flag -XX:TypeProfileLevel=222
2023-01-02 Christoph Langer JDK-8290964 C2 compilation fails with assert "non-reduction loop contains reduction nodes"
2023-01-02 Christoph Langer JDK-8292780 misc tests failed "assert(false) failed: graph should be schedulable"
2023-01-02 Christoph Langer JDK-8293996 C2: fix and simplify IdealLoopTree::do_remove_empty_loop
2023-01-02 Christoph Langer JDK-8292602 ZGC: C2 late barrier analysis uses invalid dominator information
2023-01-02 Christoph Langer JDK-8292297 Fix up loading of override java.security properties file
2023-01-02 Christoph Langer JDK-8281122 [IR Framework] Cleanup IR matching code in preparation for JDK-8280378
2023-01-02 Christoph Langer JDK-8280132 Incorrect comparator com.sun.beans.introspect.MethodInfo.MethodOrder
2023-01-02 Christoph Langer JDK-8280868 LineBodyHandlerTest.java creates and discards too many clients
2023-01-02 Christoph Langer JDK-8280889 java/lang/instrument/GetObjectSizeIntrinsicsTest.java fails with -XX:-UseCompressedOops
2023-01-02 Christoph Langer JDK-8280166 Extend java/lang/instrument/GetObjectSizeIntrinsicsTest.java test cases
2023-01-02 Christoph Langer JDK-8275843 Random crashes while the UI code is executed
2023-01-02 Christoph Langer JDK-8258512 serviceability/sa/TestJmapCore.java timed out on macOS 10.13.6
2023-01-02 Christoph Langer JDK-8270156 Add "randomness" and "stress" keys to JTreg tests which use StressGCM, StressLCM and/or StressIGVN
2022-12-30 Goetz Lindenmaier JDK-8235297 sun/security/ssl/SSLSessionImpl/ResumptionUpdateBoundValues.java fails intermittent
2022-12-30 Goetz Lindenmaier JDK-8295724 VirtualMachineError: Out of space in CodeCache for method handle intrinsic
2022-12-30 Goetz Lindenmaier JDK-8298093 improve cleanup and error handling of awt_parseColorModel in awt_parseImage.c
2022-12-29 Goetz Lindenmaier JDK-8288854 getLocalGraphicsEnvironment() on for multi-screen setups throws exception NPE
2022-12-28 Christoph Langer JDK-8295530 Update Zlib Data Compression Library to Version 1.2.13
2022-12-28 Christoph Langer JDK-8287217 C2: PhaseCCP: remove not visited nodes, prevent type inconsistency
2022-12-28 Christoph Langer JDK-8065097 [macosx] javax/swing/Popup/TaskbarPositionTest.java fails because Popup is one pixel off
2022-12-28 Christoph Langer JDK-8275173 testlibrary_tests/ir_framework/tests/TestCheckedTests.java fails after JDK-8274911
2022-12-28 Christoph Langer JDK-8273410 IR verification framework fails with "Should find method name in validIrRulesMap"
2022-12-27 Goetz Lindenmaier JDK-8298108 Add a regression test for JDK-8297684
2022-12-26 Christoph Langer JDK-8299015 Ensure that HttpResponse.BodySubscribers.ofFile writes all bytes
2022-12-26 Christoph Langer JDK-8298027 Remove SCCS id's from awt jtreg tests
2022-12-26 Christoph Langer JDK-8293562 KeepAliveCache Blocks Threads while Closing Connections
2022-12-26 Christoph Langer JDK-8289508 Improve test coverage for XPath Axes: ancestor, ancestor-or-self, preceding, and preceding-sibling
2022-12-26 Christoph Langer JDK-8293767 AWT test TestSinhalaChar.java has old SCCS markings
2022-12-26 Christoph Langer JDK-8292660 C2: blocks made unreachable by NeverBranch-to-Goto conversion are removed incorrectly
2022-12-26 Christoph Langer JDK-8292877 java/util/concurrent/atomic/Serial.java uses {Double,Long}Accumulator incorrectly
2022-12-26 Christoph Langer JDK-8292285 C2: remove unreachable block after NeverBranch-to-Goto conversion
2022-12-26 Christoph Langer JDK-8155246 Throw error if default java.security file is missing
2022-12-26 Christoph Langer JDK-8288130 compiler error with AP and explicit record accessor
2022-12-26 Christoph Langer JDK-8285399 JNI exception pending in awt_GraphicsEnv.c:1432
2022-12-26 Christoph Langer JDK-8282577 ICC_Profile.setData(int, byte[]) invalidates the profile
2022-12-26 Christoph Langer JDK-8279119 src/jdk.hotspot.agent/doc/index.html file contains references to scripts that no longer exist
2022-12-26 Christoph Langer JDK-8244669 convert clhsdb "mem" command from javascript to java
2022-12-26 Christoph Langer JDK-8279024 Remove javascript references from clhsdb.html
2022-12-26 Christoph Langer JDK-8274911 testlibrary_tests/ir_framework/tests/TestIRMatching.java fails with "java.lang.RuntimeException: Should have thrown exception"
2022-12-26 Christoph Langer JDK-8262386 resourcehogs/serviceability/sa/TestHeapDumpForLargeArray.java timed out
2022-12-26 Christoph Langer JDK-8271471 [IR Framework] Rare occurrence of "" in PrintIdeal/PrintOptoAssembly can let tests fail
2022-12-25 Christoph Langer JDK-8283606 Tests may fail with zh locale on MacOS
2022-12-24 Goetz Lindenmaier JDK-8298271 java/security/SignedJar/spi-calendar-provider/TestSPISigned.java failing on Windows
2022-12-23 Goetz Lindenmaier JDK-8297959 Provide better descriptions for some Operating System JFR events
2022-12-23 Goetz Lindenmaier JDK-8297480 GetPrimitiveArrayCritical in imageioJPEG misses result - NULL check
2022-12-22 Goetz Lindenmaier JDK-8298527 Cygwin's uname -m returns different string than before
2022-12-21 Christoph Langer JDK-8296611 Problemlist several sun/security tests until JDK-8295343 is resolved
2022-12-21 Severin Gehwolf JDK-8298588 WebSockets: HandshakeUrlEncodingTest unnecessarily depends on a response body
2022-12-20 Andrew Hughes JDK-8298726 (fs) Change PollingWatchService to record last modified time as FileTime rather than milliseconds
2022-12-20 Christoph Langer JDK-8288005 HotSpot build with disabled PCH fails for Windows AArch64
2022-12-20 Goetz Lindenmaier JDK-8283870 jdeprscan --help causes an exception when the locale is ja, zh_CN or de
2022-12-19 Christoph Langer JDK-8296548 Improve MD5 intrinsic for x86_64
2022-12-19 Paul Hohensee JDK-8290322 Optimize Vector.rearrange over byte vectors for AVX512BW targets.
2022-12-19 Goetz Lindenmaier JDK-8290899 java/lang/String/StringRepeat.java test requests too much heap on windows x86
2022-12-14 Goetz Lindenmaier JDK-8294580 frame::interpreter_frame_print_on() crashes if free BasicObjectLock exists in frame
2022-12-12 Goetz Lindenmaier JDK-8298459 Fix msys2 linking and handling out of tree build directory for source zip creation
2022-12-08 Goetz Lindenmaier JDK-8296878 Document Filter attached to JPasswordField and setText("") is not cleared instead inserted characters replaced with unicode null characters
2022-12-07 Goetz Lindenmaier JDK-8296904 Improve handling of macos xcode toolchain
2022-12-07 Christoph Langer JDK-8297211 Expensive fillInStackTrace operation in HttpURLConnection.getOutputStream0 when no content-length in response
2022-12-02 Christoph Langer JDK-8297656 AArch64: Enable AES/GCM Intrinsics
2022-12-02 Christoph Langer JDK-8275320 NMT should perform buffer overrun checks
2022-11-30 Christoph Langer JDK-8296715 CLDR v42 update for tzdata 2022f
2022-11-30 Christoph Langer JDK-8297481 Create a regression test for JDK-4424517
2022-11-30 Christoph Langer JDK-8297309 Memory leak in ShenandoahFullGC
2022-11-30 Christoph Langer JDK-8297530 java.lang.IllegalArgumentException: Negative length on strings concatenation
2022-11-30 Christoph Langer JDK-8296957 One more cast in SAFE_SIZE_NEW_ARRAY2
2022-11-30 Christoph Langer JDK-8293550 Optionally add get-task-allow entitlement to macos binaries
2022-11-30 Christoph Langer JDK-8285093 Introduce UTIL_ARG_WITH
2022-11-29 Christoph Langer JDK-8273497 building.md should link to both md and html
2022-11-28 Christoph Langer JDK-8297590 [TESTBUG] HotSpotResolvedJavaFieldTest does not run
2022-11-28 Christoph Langer JDK-8296496 Overzealous check in sizecalc.h prevents large memory allocation
2022-11-25 Christoph Langer JDK-8296956 [JVMCI] HotSpotResolvedJavaFieldImpl.getIndex returns wrong value
2022-11-25 Christoph Langer JDK-8296967 [JVMCI] rationalize relationship between getCodeSize and getCode in ResolvedJavaMethod
2022-11-25 Christoph Langer JDK-8296958 [JVMCI] add API for retrieving ConstantValue attributes
2022-11-25 Christoph Langer JDK-8293535 jdk/javadoc/doclet/testJavaFX/TestJavaFxMode.java fail with jfx
2022-11-24 Severin Gehwolf JDK-8296733 JFR: File Read event for RandomAccessFile::write(byte[]) is incorrect
2022-11-24 Christoph Langer JDK-8296960 [JVMCI] list HotSpotConstantPool.loadReferencedType to ConstantPool
2022-11-24 Christoph Langer JDK-8296961 [JVMCI] Access to j.l.r.Method/Constructor/Field for ResolvedJavaMethod/ResolvedJavaField
2022-11-24 Christoph Langer JDK-8295952 Problemlist existing compiler/rtm tests also on x86
2022-11-24 Christoph Langer JDK-8297147 UnexpectedSourceImageSize test times out on slow machines when fastdebug is used
2022-11-24 Christoph Langer JDK-8297153 sun/java2d/DirectX/OnScreenRenderingResizeTest/OnScreenRenderingResizeTest.java fails again
2022-11-24 Christoph Langer JDK-8008243 Zero: Implement fast bytecodes
2022-11-24 Christoph Langer JDK-8277485 Zero: Fix _fast_{i,f}access_0 bytecodes handling
2022-11-24 Christoph Langer JDK-8270086 ARM32-softfp: Do not load CONSTANT_double using the condy helper methods in the interpreter
2022-11-24 Christoph Langer JDK-8270155 ARM32: Improve register dump in hs_err
2022-11-23 Andrew Hughes JDK-8293815 P11PSSSignature.engineUpdate should not print debug messages during normal operation
2022-11-23 Andrew Hughes JDK-8289301 P11Cipher should not throw out of bounds exception during padding
2022-11-22 Christoph Langer JDK-8296945 PublicMethodsTest is slow due to dependency verification with debug builds
2022-11-22 Christoph Langer JDK-8295405 Add cause in a couple of IllegalArgumentException and InvalidParameterException shown by sun/security/pkcs11 tests
2022-11-22 Christoph Langer JDK-8283999 Update JMH devkit to 1.35
2022-11-22 Christoph Langer JDK-8280016 gc/g1/TestShrinkAuxiliaryData30 test fails on large machines
2022-11-22 Christoph Langer JDK-8273380 ARM32: Default to {ldrexd,strexd} in StubRoutines::atomic_{load|store}_long
2022-11-22 Christoph Langer JDK-8271834 TestStringDeduplicationAgeThreshold intermittent failures on Shenandoah
2022-11-22 Christoph Langer JDK-8266519 Cleanup resolve() leftovers from BarrierSet et al
2022-11-22 Christoph Langer JDK-8269821 Remove is-queue-active check in inner loop of write_ref_array_pre_work
2022-11-20 Goetz Lindenmaier JDK-8285604 closed sun/java2d/GdiRendering/ClipShapeRendering.java failed with "Incorrect color ffeeeeee instead of ff0000ff in pixel (100, 100)"
2022-11-20 Goetz Lindenmaier JDK-8178698 javax/sound/midi/Sequencer/MetaCallback.java failed with timeout
2022-11-20 Goetz Lindenmaier JDK-8296632 Write a test to verify the content change of TextArea sends TextEvent
2022-11-20 Goetz Lindenmaier JDK-8022403 sun/java2d/DirectX/OnScreenRenderingResizeTest/OnScreenRenderingResizeTest.java fails
2022-11-20 Goetz Lindenmaier JDK-8286624 Regression Test CoordinateTruncationBug.java fails on OL8.3
2022-11-18 Goetz Lindenmaier JDK-8296083 javax/swing/JTree/6263446/bug6263446.java fails intermittently on a VM
2022-11-17 Christoph Langer JDK-8290374 Shenandoah: Remove inaccurate comment on SBS::load_reference_barrier()
2022-11-17 Christoph Langer JDK-8280784 VM_Cleanup unnecessarily processes all thread oops
2022-11-17 Christoph Langer JDK-8280391 NMT: Correct NMT tag on CollectedHeap
2022-11-17 Christoph Langer JDK-8279536 jdk/nio/zipfs/ZipFSOutputStreamTest.java timed out
2022-11-17 Goetz Lindenmaier JDK-8290839 jdk/jfr/event/compiler/TestJitRestart.java failed with "RuntimeException: No JIT restart event found: expected true, was false"
2022-11-17 Goetz Lindenmaier JDK-8277866 gc/epsilon/TestMemoryMXBeans.java failed with wrong initial heap size
2022-11-17 Goetz Lindenmaier JDK-8278826 Print error if Shenandoah flags are empty (instead of crashing)
2022-11-16 Goetz Lindenmaier JDK-8295419 JFR: Change name of jdk.JitRestart
2022-11-16 Goetz Lindenmaier JDK-8284533 Improve InterpreterCodelet data footprint
2022-11-16 Goetz Lindenmaier JDK-8065422 Trailing dot in hostname causes TLS handshake to fail with SNI disabled
2022-11-16 Goetz Lindenmaier JDK-8282511 Use fixed certificate validation date in SSLExampleCert template
2022-11-16 Goetz Lindenmaier JDK-8282398 EndingDotHostname.java test fails because SSL cert expired
2022-11-16 Christoph Langer JDK-8274903 Zero: Support AsyncGetCallTrace
2022-11-16 Christoph Langer JDK-8273880 Zero: Print warnings when unsupported intrinsics are enabled
2022-11-15 Christoph Langer JDK-8029633 Raw inner class constructor ref should not perform diamond inference
2022-11-14 Christoph Langer JDK-8294307 ISO 4217 Amendment 173 Update
2022-11-14 Goetz Lindenmaier JDK-8285794 AsyncGetCallTrace might acquire a lock via JavaThread::thread_from_jni_environment
2022-11-11 Christoph Langer JDK-8296480 java/security/cert/pkix/policyChanges/TestPolicy.java is failing
2022-11-11 Christoph Langer JDK-8296108 (tz) Update Timezone Data to 2022f
2022-11-11 Christoph Langer JDK-8286872 Refactor add/modify notification icon (TrayIcon)
2022-11-11 Christoph Langer JDK-8255439 System Tray icons get corrupted when Windows scaling changes
2022-11-11 Christoph Langer JDK-8202836 [macosx] test java/awt/Graphics/TextAAHintsTest.java fails
2022-11-11 Christoph Langer JDK-8274029 Remove jtreg tag manual=yesno for java/awt/print/Dialog/DialogOrient.java
2022-11-11 Christoph Langer JDK-8274456 Remove jtreg tag manual=yesno java/awt/print/PrinterJob/PageDialogTest.java
2022-11-11 Goetz Lindenmaier JDK-8295872 [PPC64] JfrGetCallTrace: Need pc == nullptr check before frame constructor
2022-11-09 Goetz Lindenmaier JDK-8296485 BuildEEBasicConstraints.java test fails with SunCertPathBuilderException
2022-11-09 Goetz Lindenmaier JDK-8289524 Add JFR JIT restart event
2022-11-09 Goetz Lindenmaier JDK-8268276 Base64 Decoding optimization for x86 using AVX-512
2022-11-09 Goetz Lindenmaier JDK-8269404 Base64 Encoding optimization enhancements for x86 using AVX-512
2022-11-09 Goetz Lindenmaier JDK-8273459 Update code segment alignment to 64 bytes
2022-11-09 Goetz Lindenmaier JDK-8274527 Minimal VM build fails after JDK-8273459
2022-11-08 Goetz Lindenmaier JDK-8293834 Update CLDR data following tzdata 2022c update
2022-11-08 Goetz Lindenmaier JDK-8283199 Linux os::cpu_microcode_revision() stalls cold startup
2022-11-08 Goetz Lindenmaier JDK-8273108 RunThese24H crashes with SEGV in markWord::displaced_mark_helper() after JDK-8268276
2022-11-07 Christoph Langer JDK-8290920 sspi_bridge.dll not built if BUILD_CRYPTO is false
2022-11-07 Christoph Langer JDK-8286172 Create an automated test for JDK-4516019
2022-11-07 Christoph Langer JDK-8273685 Remove jtreg tag manual=yesno for java/awt/Graphics/LCDTextAndGraphicsState.java & show test instruction
2022-11-04 Goetz Lindenmaier JDK-8277970 Test jdk/sun/security/ssl/SSLSessionImpl/NoInvalidateSocketException.java fails with "tag mismatch"
2022-11-04 Goetz Lindenmaier JDK-8288132 Update test artifacts in QuoVadis CA interop tests
2022-11-03 Christoph Langer JDK-8292695 SIGQUIT and jcmd attaching mechanism does not work with signal chaining library
2022-11-03 Christoph Langer JDK-8265489 Stress test times out because of long ObjectSynchronizer::monitors_iterate(...) operation
2022-11-02 Goetz Lindenmaier JDK-8295714 GHA ::set-output is deprecated and will be removed
2022-11-02 Goetz Lindenmaier JDK-8287740 NSAccessibilityShowMenuAction not working for text editors
2022-11-02 Goetz Lindenmaier JDK-8275569 Add linux-aarch64 to test-make profiles
2022-10-31 Goetz Lindenmaier JDK-8244670 convert clhsdb "whatis" command from javascript to java
2022-10-31 Christoph Langer JDK-8287011 Improve container information
2022-10-28 Goetz Lindenmaier JDK-8288302 Shenandoah: SIGSEGV in vm maybe related to jit compiling xerces
2022-10-27 Andrew Hughes JDK-8292899 CustomTzIDCheckDST.java testcase failed on AIX platform
2022-10-27 Andrew Hughes JDK-8256811 Delayed/missed jdwp class unloading events
2022-10-27 Goetz Lindenmaier JDK-8295554 Move the "sizecalc.h" to the correct location
2022-10-27 Goetz Lindenmaier JDK-8279941 sun/security/pkcs11/Signature/TestDSAKeyLength.java fails when NSS version detection fails
2022-10-27 Goetz Lindenmaier JDK-8291456 com/sun/jdi/ClassUnloadEventTest.java failed with: Wrong number of class unload events: expected 10 got 4
2022-10-27 Goetz Lindenmaier JDK-8292879 com/sun/jdi/ClassUnloadEventTest.java failed due to classes not unloading
2022-10-27 Goetz Lindenmaier JDK-8292880 Improve debuggee logging for com/sun/jdi/ClassUnloadEventTest.java
2022-10-27 Goetz Lindenmaier JDK-8291650 Add delay to ClassUnloadEventTest before exiting to give time for JVM to send all events before VMDeath
2022-10-27 Goetz Lindenmaier JDK-8290908 misc tests fail: assert(!thread->owns_locks()) failed: must release all locks when leaving VM
2022-10-27 Goetz Lindenmaier JDK-8281744 x86: Use short jumps in TIG::set_vtos_entry_points
2022-10-27 Goetz Lindenmaier JDK-8272608 java_lang_System::allow_security_manager() doesn't set its initialization flag
2022-10-27 Goetz Lindenmaier JDK-8295288 Some vm_flags tests associate with a wrong BugID
2022-10-27 Goetz Lindenmaier JDK-8280948 Write a regression test for JDK-4659800
2022-10-27 Goetz Lindenmaier JDK-8233648 [TESTBUG] DefaultMenuBarTest.java failing on macos
2022-10-27 Goetz Lindenmaier JDK-8273578 javax/swing/JMenu/4515762/bug4515762.java fails on macOS 12
2022-10-27 Goetz Lindenmaier JDK-8272123 Problem list 4 jtreg tests which regularly fail on macos-aarch64
2022-10-27 Goetz Lindenmaier JDK-8267138 Stray suffix when starting gtests via GTestWrapper.java
2022-10-25 Christoph Langer JDK-8294840 langtools OptionalDependencyTest.java use File.pathSeparator
2022-10-25 Goetz Lindenmaier JDK-8293701 jdeps InverseDepsAnalyzer runs into NoSuchElementException: No value present
2022-10-25 Goetz Lindenmaier JDK-8277881 Missing SessionID in TLS1.3 resumption in compatibility mode
2022-10-25 Goetz Lindenmaier JDK-8269571 NMT should print total malloc bytes and invocation count
2022-10-24 Christoph Langer JDK-8293657 sun/management/jmxremote/bootstrap/RmiBootstrapTest.java#id1 failed with "SSLHandshakeException: Remote host terminated the handshake"
2022-10-21 Christoph Langer JDK-8295429 Update harfbuzz md file
2022-10-21 Christoph Langer JDK-8293891 gc/g1/mixedgc/TestOldGenCollectionUsage.java (still) assumes that GCs take 1ms minimum
2022-10-21 Christoph Langer JDK-8293489 Accept CAs with BasicConstraints without pathLenConstraint
2022-10-21 Christoph Langer JDK-8284771 java/util/zip/CloseInflaterDeflaterTest.java failed with "AssertionError: Expected IOException to be thrown, but nothing was thrown"
2022-10-21 Goetz Lindenmaier JDK-8295469 S390X: Optimized builds are broken
2022-10-21 Goetz Lindenmaier JDK-8295412 support latest VS2022 MSC_VER in abstract_vm_version.cpp
2022-10-21 Goetz Lindenmaier JDK-8293659 Improve UnsatisfiedLinkError error message to include dlopen error details
2022-10-21 Goetz Lindenmaier JDK-8286313 [macos] Voice over reads the boolean value as null in the JTable
2022-10-20 Goetz Lindenmaier JDK-8292778 EncodingSupport_md.c convertUtf8ToPlatformString wrong placing of free
2022-10-19 Goetz Lindenmaier JDK-8283298 Make CodeCacheSegmentSize a product flag
2022-10-19 Christoph Langer JDK-8295641 Fix DEFAULT_PROMOTED_VERSION_PRE=ea for -dev
2022-10-18 Christoph Langer JDK-8292682 Code change of JDK-8282730 not updated to reflect CSR update
2022-10-18 Christoph Langer JDK-8289562 Change bugs.java.com and bugreport.java.com URL's to https
2022-10-18 Christoph Langer JDK-8282730 LdapLoginModule throw NPE from logout method after login failure
2022-10-18 Christoph Langer JDK-8272791 java -XX:BlockZeroingLowLimit=1 crashes after 8270947
2022-10-18 Christoph Langer JDK-8030121 java/awt/dnd/MissingDragExitEventTest/MissingDragExitEventTest.java fails
2022-10-18 Christoph Langer JDK-8273236 keytool does not accurately warn about algorithms that are disabled but have additional constraints
2022-10-18 Christoph Langer JDK-8269743 test/hotspot/jtreg/vmTestbase/vm/mlvm/meth/stress/jni/nativeAndMH/Test.java crash with small heap (-Xmx50m)
2022-10-18 Andrew Haley JDK-8270947 AArch64: C1: use zero_words to initialize all objects
2022-10-18 Andrew Haley JDK-8272094 compiler/codecache/TestStressCodeBuffers.java crashes with "failed to allocate space for trampoline"
2022-10-17 Goetz Lindenmaier JDK-8295173 (tz) Update Timezone Data to 2022e
2022-10-17 Goetz Lindenmaier JDK-8294740 Add cgroups keyword to TestDockerBasic.java
2022-10-17 Goetz Lindenmaier JDK-8277346 ProblemList 7 serviceability/sa tests on macosx-x64
2022-10-14 Christoph Langer JDK-8293672 Update freetype md file
2022-10-14 Christoph Langer JDK-8293540 [Metrics] Incorrectly detected resource limits with additional cgroup fs mounts
2022-10-14 Christoph Langer JDK-8283353 compiler/c2/cr6865031/Test.java and compiler/runtime/Test6826736.java fails on x86_32
2022-10-14 Christoph Langer JDK-8280234 AArch64 "core" variant does not build after JDK-8270947
2022-10-14 Christoph Langer JDK-8271956 AArch64: C1 build failed after JDK-8270947
2022-10-14 Goetz Lindenmaier JDK-8293472 Incorrect container resource limit detection if manual cgroup fs mounts present
2022-10-13 Goetz Lindenmaier JDK-8292158 AES-CTR cipher state corruption with AVX-512
2022-10-13 Goetz Lindenmaier JDK-8282402 Create a regression test for JDK-4666101
2022-10-13 Goetz Lindenmaier JDK-8251466 test/java/io/File/GetXSpace.java fails on Windows with mapped network drives.
2022-10-12 Goetz Lindenmaier JDK-8284681 compiler/c2/aarch64/TestFarJump.java fails with "RuntimeException: for CodeHeap < 250MB the far jump is expected to be encoded with a single branch instruction"
2022-10-11 Goetz Lindenmaier JDK-8284690 [macos] VoiceOver : Getting java.lang.IllegalArgumentException: Invalid location on Editable JComboBox
2022-10-11 Goetz Lindenmaier JDK-8281296 Create a regression test for JDK-4515999
2022-10-11 Goetz Lindenmaier JDK-8280872 Reorder code cache segments to improve code density
2022-10-10 Christoph Langer JDK-8290711 assert(false) failed: infinite loop in PhaseIterGVN::optimize
2022-10-10 Christoph Langer JDK-6829250 Reg test: java/awt/Toolkit/ScreenInsetsTest/ScreenInsetsTest.java fails in Windows
2022-10-10 Christoph Langer JDK-8257722 Improve "keytool -printcert -jarfile" output
2022-10-10 Goetz Lindenmaier JDK-8294837 unify Windows 2019 version check in os_windows and java_props_md
2022-10-10 Goetz Lindenmaier JDK-8222323 ChildAlwaysOnTopTest.java fails with "RuntimeException: Failed to unset alwaysOnTop"
2022-10-06 Paul Hohensee JDK-8276904 Optional.toString() is unnecessarily expensive
2022-10-05 Christoph Langer JDK-8294357 (tz) Update Timezone Data to 2022d
2022-10-05 Christoph Langer JDK-8293816 CI: ciBytecodeStream::get_klass() is not consistent
2022-10-05 Christoph Langer JDK-8291599 Assertion in PhaseIdealLoop::skeleton_predicate_has_opaque after JDK-8289127
2022-10-05 Christoph Langer JDK-8293044 C1: Missing access check on non-accessible class
2022-10-05 Christoph Langer JDK-8290529 C2: assert(BoolTest(btest).is_canonical()) failure
2022-10-05 Goetz Lindenmaier JDK-8294578 [PPC64] C2: Missing is_oop information when using disjoint compressed oops mode
2022-10-05 Goetz Lindenmaier JDK-8292866 Java_sun_awt_shell_Win32ShellFolder2_getLinkLocation check MultiByteToWideChar return value for failures
2022-10-04 Christoph Langer JDK-8292385 assert(ctrl == kit.control()) failed: Control flow was added although the intrinsic bailed out
2022-10-04 Christoph Langer JDK-8290451 Incorrect result when switching to C2 OSR compilation from C1
2022-10-04 Christoph Langer JDK-8291775 C2: assert(r != __null && r->is_Region()) failed: this phi must have a region
2022-10-04 Christoph Langer JDK-8282642 vmTestbase/gc/gctests/LoadUnloadGC2/LoadUnloadGC2.java fails intermittently with exit code 1
2022-10-04 Christoph Langer JDK-8291459 JVM crash with GenerateOopMap::error_work(char const*, __va_list_tag*)
2022-10-04 Christoph Langer JDK-8169187 [macosx] Aqua: java/awt/image/multiresolution/MultiresolutionIconTest.java
2022-10-04 Christoph Langer JDK-8290705 StringConcat::validate_mem_flow asserts with "unexpected user: StoreI"
2022-10-04 Christoph Langer JDK-8290687 serviceability/sa/TestClassDump.java could leave files owned by root on macOS
2022-10-04 Christoph Langer JDK-8289257 Some custom loader tests failed due to symbol refcount not decremented
2022-10-04 Christoph Langer JDK-8288651 CDS test HelloUnload.java should not use literal string as ClassLoader name
2022-10-04 Goetz Lindenmaier JDK-8293998 [PPC64] JfrGetCallTrace: assert(_pc != nullptr) failed: must have PC
2022-10-04 Goetz Lindenmaier JDK-8290781 Segfault at PhaseIdealLoop::clone_loop_handle_data_uses
2022-09-30 Goetz Lindenmaier JDK-8282528 AArch64: Incorrect replicate2L_zero rule
2022-09-30 Goetz Lindenmaier JDK-8293578 Duplicate ldc generated by javac
2022-09-30 Goetz Lindenmaier JDK-8280511 AArch64: Combine shift and negate to a single instruction
2022-09-29 Goetz Lindenmaier JDK-8292586 simplify cleanups in NTLMAuthSequence getCredentialsHandle
2022-09-29 Goetz Lindenmaier JDK-8287609 macOS: SIGSEGV at [CoreFoundation] CFArrayGetCount / sun.font.CFont.getTableBytesNative
2022-09-28 Goetz Lindenmaier JDK-8287076 Document.normalizeDocument() produces different results
2022-09-28 Goetz Lindenmaier JDK-8287425 Remove unnecessary register push for MacroAssembler::check_klass_subtype_slow_path
2022-09-28 Goetz Lindenmaier JDK-8284752 Zero does not build on Mac OS X due to missing os::current_thread_enable_wx implementation
2022-09-28 Goetz Lindenmaier JDK-8284732 FFI_GO_CLOSURES macro not defined but required for zero build on Mac OS X
2022-09-28 Christoph Langer JDK-8285836 sun/net/www/http/KeepAliveCache/KeepAliveProperty.java failed with "RuntimeException: Failed in server"
2022-09-28 Christoph Langer JDK-8289559 java/awt/a11y/AccessibleJPopupMenuTest.java test fails with java.lang.NullPointerException
2022-09-28 Christoph Langer JDK-8282777 Create a Regression test for JDK-4515031
2022-09-28 Christoph Langer JDK-8286663 Resolve IDE warnings in WTrayIconPeer and SystemTray
2022-09-28 Christoph Langer JDK-8286772 java/awt/dnd/DropTargetInInternalFrameTest/DropTargetInInternalFrameTest.html times out and fails in Windows
2022-09-28 Christoph Langer JDK-8287826 javax/accessibility/4702233/AccessiblePropertiesTest.java fails to compile
2022-09-28 Christoph Langer JDK-8285305 Create an automated test for JDK-4495286
2022-09-28 Christoph Langer JDK-8285373 Create an automated test for JDK-4702233
2022-09-28 Christoph Langer JDK-8282857 Create a regression test for JDK-4702690
2022-09-28 Christoph Langer JDK-8275170 Some jtreg sound tests should be marked with sound keyword
2022-09-28 Christoph Langer JDK-8285687 Remove jtreg tag manual=yesno for java/awt/print/PrinterJob/PageRangesDlgTest.java
2022-09-28 Christoph Langer JDK-8286452 The array length of testSmallConstArray should be small and const
2022-09-28 Christoph Langer JDK-8233557 [TESTBUG] DoubleClickTitleBarTest.java fails on macOs
2022-09-27 Goetz Lindenmaier JDK-8283059 Uninitialized warning in check_code.c with GCC 11.2
2022-09-26 Christoph Langer JDK-8285612 Remove jtreg tag manual=yesno for java/awt/print/PrinterJob/ImagePrinting/ClippedImages.java
2022-09-26 Christoph Langer JDK-8286551 JDK-8286460 causes tests to fail to compile in Tier2
2022-09-26 Christoph Langer JDK-8286460 Remove dependence on JAR filename in CDS tests
2022-09-26 Christoph Langer JDK-8275234 java/awt/GraphicsDevice/DisplayModes/CycleDMImage.java is entered twice in ProblemList
2022-09-23 Goetz Lindenmaier JDK-8293808 mscapi destroyKeyContainer enhance KeyStoreException: Access is denied exception
2022-09-23 Goetz Lindenmaier JDK-8293232 Fix race condition in pkcs11 SessionManager
2022-09-23 Goetz Lindenmaier JDK-8288377 [REDO] DST not applying properly with zone id offset set with TZ env variable
2022-09-22 Goetz Lindenmaier JDK-8292903 enhance round_up_power_of_2 assertion output
2022-09-21 Christoph Langer JDK-8284980 Test vmTestbase/nsk/stress/except/except010.java times out with -Xcomp -XX:+DeoptimizeALot
2022-09-21 Christoph Langer JDK-8286263 compiler/c1/TestPinnedIntrinsics.java failed with "RuntimeException: testCurrentTimeMillis failed with -3"
2022-09-21 Christoph Langer JDK-8282600 SSLSocketImpl should not use user_canceled workaround when not necessary
2022-09-21 Christoph Langer JDK-8129827 [TEST_BUG] Test java/awt/Robot/RobotWheelTest/RobotWheelTest.java fails
2022-09-21 Christoph Langer JDK-8159599 [TEST_BUG] java/awt/Modal/ModalInternalFrameTest/ModalInternalFrameTest.java
2022-09-21 Christoph Langer JDK-8284892 java/net/httpclient/http2/TLSConnection.java fails intermittently
2022-09-21 Christoph Langer JDK-8273553 sun.security.ssl.SSLEngineImpl.closeInbound also has similar error of JDK-8253368
2022-09-21 Christoph Langer JDK-8282276 Problem list failing two Robot Screen Capture tests
2022-09-21 Christoph Langer JDK-8262721 Add Tests to verify single iteration loops are properly optimized
2022-09-21 Christoph Langer JDK-8279662 serviceability/sa/ClhsdbScanOops.java can fail due to unexpected GC
2022-09-21 Christoph Langer JDK-8280554 resourcehogs/serviceability/sa/ClhsdbRegionDetailsScanOopsForG1.java can fail if GC is triggered
2022-09-21 Christoph Langer JDK-8280555 serviceability/sa/TestObjectMonitorIterate.java is failing due to ObjectMonitor referencing a null Object
2022-09-21 Christoph Langer JDK-8293828 JFR: jfr/event/oldobject/TestClassLoaderLeak.java still fails when GC cycles are not happening
2022-09-21 Christoph Langer JDK-8285698 Create a test to check the focus stealing of JPopupMenu from JComboBox
2022-09-21 Christoph Langer JDK-8268033 compiler/intrinsics/bmi/verifycode/BzhiTestI2L.java fails with "fatal error: Not compilable at tier 3: CodeBuffer overflow"
2022-09-21 Christoph Langer JDK-7001973 java/awt/Graphics2D/CopyAreaOOB.java fails
2022-09-21 Christoph Langer JDK-8210558 serviceability/sa/TestJhsdbJstackLock.java fails to find '^\s+- waiting to lock <0x[0-9a-f]+> \(a java\.lang\.Class ...'
2022-09-21 Christoph Langer JDK-8274296 Update or Problem List tests which may fail with uiScale=2 on macOS
2022-09-21 Goetz Lindenmaier JDK-8290532 Adjust PKCS11Exception and handle more PKCS11 error codes
2022-09-21 Goetz Lindenmaier JDK-8277358 Accelerate CRC32-C
2022-09-19 Christoph Langer JDK-8279398 jdk/jfr/api/recording/time/TestTimeMultiple.java failed with "RuntimeException: getStopTime() > afterStop"
2022-09-19 Christoph Langer JDK-8268297 jdk/jfr/api/consumer/streaming/TestLatestEvent.java times out
2022-09-19 Christoph Langer JDK-8279066 entries.remove(entry) is useless in PKCS12KeyStore
2022-09-19 Christoph Langer JDK-8277092 TestMetaspaceAllocationMT2.java#ndebug-default fails with "RuntimeException: Committed seems high: NNNN expected at most MMMM"
2022-09-19 Christoph Langer JDK-8268779 ZGC: runtime/InternalApi/ThreadCpuTimesDeadlock.java#id1 failed with "OutOfMemoryError: Java heap space"
2022-09-19 Christoph Langer JDK-8233558 [TESTBUG] WindowOwnedByEmbeddedFrameTest.java fails on macos
2022-09-19 Christoph Langer JDK-8273881 Metaspace: test repeated deallocations
2022-09-19 Goetz Lindenmaier JDK-8282347 AARCH64: Untaken branch in has_negatives stub
2022-09-19 Goetz Lindenmaier JDK-8280124 Reduce branches decoding latin-1 chars from UTF-8 encoded bytes
2022-09-19 Goetz Lindenmaier JDK-8270848 Redundant unsafe opmask register allocation in some instruction patterns.
2022-09-19 Goetz Lindenmaier JDK-8266082 AssertionError in Annotate.fromAnnotations with -Xdoclint
2022-09-15 Christoph Langer JDK-8274160 java/awt/Window/ShapedAndTranslucentWindows/Common.java delay is too high
2022-09-15 Christoph Langer JDK-8274032 Remove jtreg tag manual=yesno for java/awt/print/PrinterJob/ImagePrinting/ImageTypes.java & show test UI
2022-09-15 Christoph Langer JDK-8270609 [TESTBUG] java/awt/print/Dialog/DialogCopies.java does not show instruction
2022-09-15 Christoph Langer JDK-8273043 [TEST_BUG] Automate NimbusJTreeSelTextColor.java
2022-09-15 Christoph Langer JDK-7188098 TEST_BUG: closed/javax/sound/midi/Synthesizer/Receiver/bug6186488.java fails
2022-09-15 Christoph Langer JDK-8271015 Split cds/SharedBaseAddress.java test into smaller parts
2022-09-15 Goetz Lindenmaier JDK-8276108 Wrong instruction generation in aarch64 backend
2022-09-15 Christoph Langer JDK-8269029 compiler/codegen/TestCharVect2.java fails for client VMs
2022-09-15 Christoph Langer JDK-8277576 ProblemList runtime/ErrorHandling/CreateCoredumpOnCrash.java on macosx-X64
2022-09-15 Christoph Langer JDK-8290209 jcup.md missing additional text
2022-09-15 Christoph Langer JDK-8290207 Missing notice in dom.md
2022-09-15 Goetz Lindenmaier JDK-8277928 Fix compilation on macosx-aarch64 after 8276108
2022-09-15 Goetz Lindenmaier JDK-8272776 NullPointerException not reported
2022-09-14 Goetz Lindenmaier JDK-8282049 AArch64: Use ZR for integer zero immediate volatile stores
2022-09-14 Goetz Lindenmaier JDK-8274563 jfr/event/oldobject/TestClassLoaderLeak.java fails when GC cycles are not happening
2022-09-12 Christoph Langer JDK-8275535 Retrying a failed authentication on multiple LDAP servers can lead to users blocked
2022-09-12 Goetz Lindenmaier JDK-8277411 C2 fast_unlock intrinsic on AArch64 has unnecessary ownership check
2022-09-12 Goetz Lindenmaier JDK-8287349 AArch64: Merge LDR instructions to improve C1 OSR performance
2022-09-12 Goetz Lindenmaier JDK-8292816 GPL Classpath exception missing from assemblyprefix.h
2022-09-07 Christoph Langer JDK-8283383 [macos] a11y : Screen magnifier shows extra characters (0) at the end JButton accessibility name
2022-09-06 Christoph Langer JDK-8292541 [Metrics] Reported memory limit may exceed physical machine memory
2022-09-06 Christoph Langer JDK-8293319 [C2 cleanup] Remove unused other_path arg in Parse::adjust_map_after_if
2022-09-06 Christoph Langer JDK-8288445 AArch64: C2 compilation fails with guarantee(!true || (true && (shift != 0))) failed: impossible encoding
2022-09-02 Christoph Langer JDK-8289044 ARM32: missing LIR_Assembler::cmove metadata type support
2022-09-01 Christoph Langer JDK-8292083 Detected container memory limit may exceed physical machine memory
2022-08-30 Christoph Langer JDK-8290456 remove os::print_statistics()
2022-08-30 Christoph Langer JDK-8289146 containers/docker/TestMemoryWithCgroupV1.java fails on linux ppc64le machine with missing Memory and Swap Limit output
2022-08-30 Christoph Langer JDK-8288985 P11TlsKeyMaterialGenerator should work with ChaCha20-Poly1305
2022-08-30 Christoph Langer JDK-8287463 JFR: Disable TestDevNull.java on Windows
2022-08-25 Christoph Langer JDK-8289695 [TESTBUG] TestMemoryAwareness.java fails on cgroups v2 and crun
2022-08-22 Christoph Langer JDK-8212096 javax/net/ssl/ServerName/SSLEngineExplorerMatchedSNI.java failed intermittently due to SSLException: Tag mismatch
2022-08-22 Christoph Langer JDK-8227651 Tests fail with SSLProtocolException: Input record too big
2022-08-22 Christoph Langer JDK-8272417 ZGC: fastdebug build crashes when printing ClassLoaderData
2022-08-22 Christoph Langer JDK-8284950 CgroupV1 detection code should consider memory.swappiness
2022-08-18 Christoph Langer JDK-8282947 JFR: Dump on shutdown live-locks in some conditions
2022-08-18 Christoph Langer JDK-8288000 compiler/loopopts/TestOverUnrolling2.java fails with release VMs
2022-08-17 Christoph Langer JDK-8279032 compiler/loopopts/TestSkeletonPredicateNegation.java times out with -XX:TieredStopAtLevel < 4
2022-08-16 Christoph Langer JDK-8283903 GetContainerCpuLoad does not return the correct result in share mode
2022-08-16 Goetz Lindenmaier JDK-8285730 unify _WIN32_WINNT settings
2022-08-16 Christoph Langer JDK-8291633 Build failures with GCC 11, Alpine 3 due to incompatible casts from nullptr
2022-08-16 Christoph Langer JDK-8289910 unify os::message_box across posix platforms
2022-08-16 Christoph Langer JDK-6782021 It is not possible to read local computer certificates with the SunMSCAPI provider
2022-08-06 Christoph Langer JDK-8289549 ISO 4217 Amendment 172 Update
2022-08-06 Christoph Langer JDK-8283277 ISO 4217 Amendment 171 Update
2022-08-04 Goetz Lindenmaier JDK-8280944 Enable Unix domain sockets in Windows Selector notification mechanism
2022-08-03 Christoph Langer JDK-8285693 Create an automated test for JDK-4702199
2022-08-03 Christoph Langer JDK-8284077 Create an automated test for JDK-4170173
2022-08-03 Christoph Langer JDK-8285617 Fix java/awt/print/PrinterJob/ImagePrinting/PrintARGBImage.java manual test
2022-08-03 Christoph Langer JDK-8223543 [TESTBUG] Regression test java/awt/Graphics2D/DrawString/LCDTextSrcEa.java has issues
2022-08-03 Christoph Langer JDK-8284535 Fix PrintLatinCJKTest.java test that is failing with Parse Exception
2022-08-03 Goetz Lindenmaier JDK-8288399 MacOS debug symbol files not always deterministic in reproducible builds
2022-08-03 Goetz Lindenmaier JDK-8289471 Issue in Initialization of keys in ErrorMsg.java and XPATHErrorResources.java
2022-08-02 Christoph Langer JDK-8283624 Create an automated regression test for RFE-4390885
2022-08-02 Christoph Langer JDK-8291595 [17u] Delete files missed in backport of 8269039
2022-08-02 Christoph Langer JDK-8283245 Create a test for JDK-4670319
2022-08-01 Christoph Langer JDK-8282933 Create a test for JDK-4529616
2022-08-01 Christoph Langer JDK-8283507 Create a regression test for RFE 4287690
2022-08-01 Christoph Langer JDK-8283621 Write a regression test for CCC4400728
2022-08-01 Christoph Langer JDK-8283623 Create an automated regression test for JDK-4525475
2022-08-01 Christoph Langer JDK-8288992 AArch64: CMN should be handled the same way as CMP
2022-08-01 Christoph Langer JDK-8283015 Create a test for JDK-4715496
2022-08-01 Christoph Langer JDK-8283493 Create an automated regression test for RFE 4231298
2022-08-01 Christoph Langer JDK-8282789 Create a regression test for the JTree usecase of JDK-4618767
2022-08-01 Christoph Langer JDK-8280913 Create a regression test for JRootPane.setDefaultButton() method
2022-08-01 Christoph Langer JDK-8269556 sun/tools/jhsdb/JShellHeapDumpTest.java fails with RuntimeException 'JShellToolProvider' missing from stdout/stderr
2022-08-01 Christoph Langer JDK-8275689 [TESTBUG] Use color tolerance only for XRender in BlitRotateClippedArea test
2022-08-01 Christoph Langer JDK-8257534 misc tests failed with "NoClassDefFoundError: Could not initialize class java.util.concurrent.ThreadLocalRandom"
2022-08-01 Christoph Langer JDK-8270312 Error: Not a test or directory containing tests: java/awt/print/PrinterJob/XparColor.java
2022-07-28 Christoph Langer JDK-8290334 Update FreeType to 2.12.1
2022-07-28 Christoph Langer JDK-8290246 test fails "assert(init != __null) failed: initialization not found"
2022-07-28 Christoph Langer JDK-8286314 Trampoline not created for far runtime targets outside small CodeCache
2022-07-28 Christoph Langer JDK-8284358 Unreachable loop is not removed from C2 IR, leading to a broken graph
2022-07-28 Christoph Langer JDK-8282351 jpackage does not work if class file has `$$` in the name on windows
2022-07-28 Christoph Langer JDK-8283803 Remove jtreg tag manual=yesno for java/awt/print/PrinterJob/PrintGlyphVectorTest.java and fix test
2022-07-28 Christoph Langer JDK-8283723 Update Visual Studio 2022 to version 17.1.0 for Oracle builds on Windows
2022-07-28 Christoph Langer JDK-8264792 The NumberFormat for locale sq_XK formats price incorrectly.
2022-07-27 Goetz Lindenmaier JDK-7131823 bug in GIFImageReader
2022-07-27 Goetz Lindenmaier JDK-8283911 DEFAULT_PROMOTED_VERSION_PRE not reset to 'ea' for jdk-17.0.4
2022-07-25 Christoph Langer JDK-8288781 C1: LIR_OpVisitState::maxNumberOfOperands too small
2022-07-25 Christoph Langer JDK-8282860 Write a regression test for JDK-4164779
2022-07-25 Christoph Langer JDK-8289853 Update HarfBuzz to 4.4.1
2022-07-25 Christoph Langer JDK-8273506 java Robot API did the 'm' keypress and caused /awt/event/KeyEvent/KeyCharTest/KeyCharTest.html is timing out on macOS 12
2022-07-25 Christoph Langer JDK-8284067 jpackage'd launcher reports non-zero exit codes with error prompt
2022-07-25 Christoph Langer JDK-8282548 Create a regression test for JDK-4330998
2022-07-25 Christoph Langer JDK-8169468 NoResizeEventOnDMChangeTest.java fails because FS Window didn't receive all resizes!
2022-07-25 Christoph Langer JDK-8017175 [TESTBUG] javax/swing/JPopupMenu/4634626/bug4634626.java sometimes failed on mac
2022-07-25 Christoph Langer JDK-8255724 [XRender] the BlitRotateClippedArea test fails on Linux in the XR pipeline
2022-07-25 Christoph Langer JDK-8272736 [JVMCI] Add API for reading and writing JVMCI thread locals
2022-07-25 Goetz Lindenmaier JDK-8290417 CDS cannot archive lamda proxy with useImplMethodHandle
2022-07-25 Goetz Lindenmaier JDK-8289127 Apache Lucene triggers: DEBUG MESSAGE: duplicated predicate failed which is impossible
2022-07-23 Christoph Langer JDK-8277493 [REDO] Quarantined jpackage apps are labeled as "damaged"
2022-07-23 Christoph Langer JDK-8283087 Create a test or JDK-4715503
2022-07-23 Christoph Langer JDK-8282234 Create a regression test for JDK-4532513
2022-07-23 Christoph Langer JDK-8282343 Create a regression test for JDK-4518432
2022-07-22 Christoph Langer JDK-8282007 Assorted enhancements to jpackage testing framework
2022-07-22 Christoph Langer JDK-8278233 [macos] tools/jpackage tests timeout due to /usr/bin/osascript
2022-07-22 Christoph Langer JDK-6854300 [TEST_BUG] java/awt/event/MouseEvent/SpuriousExitEnter/SpuriousExitEnter_3.java fails in jdk6u14 & jdk7
2022-07-21 Christoph Langer JDK-8290020 Deadlock in leakprofiler::emit_events during shutdown
2022-07-21 Christoph Langer JDK-8289486 Improve XSLT XPath operators count efficiency
2022-07-21 Christoph Langer JDK-8287125 [macos] Multiple jpackage tests fail/timeout on same host
2022-07-21 Christoph Langer JDK-8286122 [macos]: App bundle cannot upload to Mac App Store due to info.plist embedded in java exe
2022-07-21 Christoph Langer JDK-8281738 Create a regression test for checking the 'Space' key activation of focused Button
2022-07-21 Christoph Langer JDK-8281988 Create a regression test for JDK-4618767
2022-07-21 Christoph Langer JDK-8281745 Create a regression test for JDK-4514331
2022-07-21 Christoph Langer JDK-8281535 Create a regression test for JDK-4670051
2022-07-21 Christoph Langer JDK-8279370 jdk.jpackage/share/native/applauncher/JvmLauncher.cpp fails to build with GCC 6.3.0
2022-07-21 Christoph Langer JDK-8278311 Debian packaging doesn't work
2022-07-21 Christoph Langer JDK-8276837 [macos]: Error when signing the additional launcher
2022-07-21 Christoph Langer JDK-8271344 Windows product version issue
2022-07-21 Goetz Lindenmaier JDK-8290000 Bump macOS GitHub actions to macOS 11
2022-07-20 Christoph Langer JDK-8285097 Duplicate XML keys in XPATHErrorResources.java and XSLTErrorResources.java
2022-07-19 Goetz Lindenmaier JDK-8280233 Temporarily disable Unix domain sockets in Windows PipeImpl
2022-07-19 Christoph Langer JDK-8282280 Update Xerces2 Java to Version 2.12.2
2022-07-19 Christoph Langer JDK-8277429 Conflicting jpackage static library name
2022-07-19 Christoph Langer JDK-8274856 Failing jpackage tests with fastdebug/release build
2022-07-18 Christoph Langer JDK-8284014 Menu items with submenus in JPopupMenu are not spoken on macOS
2022-07-18 Christoph Langer JDK-8282407 Missing ')' in MacResources.properties
2022-07-18 Christoph Langer JDK-8272815 jpackage --type rpm produces an error: Invalid or unsupported type: [null]
2022-07-18 Christoph Langer JDK-8273040 Turning off JpAllowDowngrades (or Upgrades)
2022-07-18 Goetz Lindenmaier JDK-8288499 Restore cancel-in-progress in GHA
2022-07-16 Goetz Lindenmaier JDK-8288003 log events for os::dll_unload
2022-07-15 Goetz Lindenmaier JDK-8287906 Rewrite of GitHub Actions (GHA) sanity tests
2022-07-15 Goetz Lindenmaier JDK-8274434 move os::get_default_process_handle and os::dll_lookup to os_posix for POSIX platforms
2022-07-14 Goetz Lindenmaier JDK-8290082 [PPC64] ZGC C2 load barrier stub needs to preserve vector registers
2022-07-14 Goetz Lindenmaier JDK-8290004 [PPC64] JfrGetCallTrace: assert(_pc != nullptr) failed: must have PC
2022-07-14 Goetz Lindenmaier JDK-8289856 [PPC64] SIGSEGV in C2Compiler::init_c2_runtime() after JDK-8289060
2022-07-12 Christoph Langer JDK-8287902 UnreadableRB case in MissingResourceCauseTest is not working reliably on Windows
2022-07-11 Christoph Langer JDK-8287895 Some langtools tests fail on msys2
2022-07-11 Christoph Langer JDK-8287896 PropertiesTest.sh fail on msys2
2022-07-11 Christoph Langer JDK-8287724 Fix various issues with msys2
2022-07-11 Christoph Langer JDK-8280863 Update build README to reflect that MSYS2 is supported
2022-07-11 Christoph Langer JDK-8272352 Java launcher can not parse Chinese character when system locale is set to UTF-8
2022-07-11 Christoph Langer JDK-8289697 buffer overflow in MTLVertexCache.m: MTLVertexCache_AddGlyphQuad
2022-07-11 Christoph Langer JDK-8286573 Remove the unnecessary method Attr#attribTopLevel and its usage
2022-07-11 Christoph Langer JDK-8254318 Remove .hgtags
2022-07-07 Christoph Langer JDK-8289799 Build warning in methodData.cpp memset zero-length parameter
2022-07-07 Christoph Langer JDK-8289477 Memory corruption with CPU_ALLOC, CPU_FREE on muslc
2022-07-07 Christoph Langer JDK-8289147 unify os::infinite_sleep on posix platforms
2022-07-07 Christoph Langer JDK-8284977 MetricsTesterCgroupV2.getLongValueEntryFromFile fails when named value doesn't exist
2022-07-07 Christoph Langer JDK-8287735 Provide separate event category for dll operations
2022-07-07 Christoph Langer JDK-8286277 CDS VerifyError when calling clone() on object array
2022-07-05 Christoph Langer JDK-8289569 [test] java/lang/ProcessBuilder/Basic.java fails on Alpine/musl
2022-07-05 Christoph Langer JDK-8288599 com/sun/management/OperatingSystemMXBean/TestTotalSwap.java: Expected total swap size ... but getTotalSwapSpaceSize returned ...
2022-07-05 Christoph Langer JDK-8286266 [macos] VoiceOver : Moving JTable column to be the first column JVM crashes
2022-07-05 Christoph Langer JDK-8278612 [macos] test/jdk/java/awt/dnd/RemoveDropTargetCrashTest crashes with VoiceOver on macOS
2022-07-05 Christoph Langer JDK-8276546 [IR Framework] Whitelist and ignore CompileThreshold
2022-07-05 Christoph Langer JDK-8269039 Disable SHA-1 Signed JARs
2022-07-05 Goetz Lindenmaier JDK-8278609 [macos] accessibility frame is misplaced on a secondary monitor on macOS
2022-07-01 Christoph Langer JDK-8288360 CI: ciInstanceKlass::implementor() is not consistent for well-known classes
2022-07-01 Christoph Langer JDK-8287432 C2: assert(tn->in(0) != __null) failed: must have live top node
2022-07-01 Christoph Langer JDK-8286625 C2 fails with assert(!n->is_Store() && !n->is_LoadStore()) failed: no node with a side effect
2022-07-01 Christoph Langer JDK-8278067 Make HttpURLConnection default keep alive timeout configurable
2022-07-01 Goetz Lindenmaier JDK-8281181 Do not use CPU Shares to compute active processor count
2022-07-01 Goetz Lindenmaier JDK-8256844 Make NMT late-initializable
2022-06-29 Christoph Langer JDK-8288467 remove memory_operand assert for spilled instructions
2022-06-29 Christoph Langer JDK-8287396 LIR_Opr::vreg_number() and data() can return negative number
2022-06-29 Christoph Langer JDK-8284944 assert(cnt++ < 40) failed: infinite cycle in loop optimization
2022-06-29 Christoph Langer JDK-8284294 Create an automated regression test for RFE 4138746
2022-06-29 Christoph Langer JDK-8282936 Write a regression test for JDK-4615365
2022-06-27 Christoph Langer JDK-8289197 [17u] Push of backport of 8286177 did not remove assertion
2022-06-27 Goetz Lindenmaier JDK-8287917 System.loadLibrary does not work on Big Sur if JDK is built with macOS SDK 10.15 and earlier
2022-06-27 Goetz Lindenmaier JDK-8287366 Improve test failure reporting in GHA
2022-06-24 Christoph Langer JDK-8287672 jtreg test com/sun/jndi/ldap/LdapPoolTimeoutTest.java fails intermittently in nightly run
2022-06-24 Christoph Langer JDK-8287223 C1: Inlining attempt through MH::invokeBasic() with null receiver
2022-06-24 Christoph Langer JDK-8287091 aarch64 : guarantee(val < (1ULL << nbits)) failed: Field too big for insn
2022-06-24 Christoph Langer JDK-8286177 C2: "failed: non-reduction loop contains reduction nodes" assert failure
2022-06-24 Christoph Langer JDK-8271078 jdk/incubator/vector/Float128VectorTests.java failed a subtest
2022-06-24 Christoph Langer JDK-8285923 [REDO] JDK-8285802 AArch64: Consistently handle offsets in MacroAssembler as 64-bit quantities
2022-06-24 Christoph Langer JDK-8279622 C2: miscompilation of map pattern as a vector reduction
2022-06-24 Christoph Langer JDK-8282937 Write a regression test for JDK-4820080
2022-06-23 Goetz Lindenmaier JDK-8288303 C1: Miscompilation due to broken Class.getModifiers intrinsic
2022-06-23 Goetz Lindenmaier JDK-8288754 GCC 12 fails to build zReferenceProcessor.cpp
2022-06-23 Goetz Lindenmaier JDK-8286582 Build fails on macos aarch64 when using --with-zlib=bundled
2022-06-22 Christoph Langer JDK-8285081 Improve XPath operators count accuracy
2022-06-22 Christoph Langer JDK-8286211 Update PCSC-Lite for SUSE Linux to 1.9.5
2022-06-22 Christoph Langer JDK-8280696 C2 compilation hits assert(is_dominator(c, n_ctrl)) failed
2022-06-22 Christoph Langer JDK-8286870 Memory leak with RepeatCompilation
2022-06-22 Christoph Langer JDK-8284367 Upgrade JQuery UI to 1.13.1 from 1.12.1
2022-06-22 Christoph Langer JDK-8286638 C2: CmpU needs to do more precise over/underflow analysis
2022-06-22 Christoph Langer JDK-8282555 Missing memory edge when spilling MoveF2I, MoveD2L etc
2022-06-22 Christoph Langer JDK-8265360 several compiler/whitebox tests fail with "private compiler.whitebox.SimpleTestCaseHelper(int) must be compiled"
2022-06-22 Christoph Langer JDK-8274597 Some of the dnd tests time out and fail intermittently
2022-06-22 Christoph Langer JDK-8284521 Write an automated regression test for RFE 4371575
2022-06-22 Christoph Langer JDK-8282046 Create a regression test for JDK-8000326
2022-06-22 Christoph Langer JDK-8079267 [TEST_BUG] Test java/awt/Frame/MiscUndecorated/RepaintTest.java fails
2022-06-22 Christoph Langer JDK-8211002 test/jdk/java/lang/Math/PowTests.java skips testing for non-corner-case values
2022-06-22 Goetz Lindenmaier JDK-8283457 [macos] libpng build failures with Xcode13.3
2022-06-21 Christoph Langer JDK-8282538 PKCS11 tests fail on CentOS Stream 9
2022-06-21 Christoph Langer JDK-8282778 Create a regression test for JDK-4699544
2022-06-21 Christoph Langer JDK-8285380 Fix typos in security
2022-06-21 Christoph Langer JDK-8282640 Create a test for JDK-4740761
2022-06-20 Christoph Langer JDK-8281569 Create tests for Frame.setMinimumSize() method
2022-06-20 Christoph Langer JDK-8286429 jpackageapplauncher build fails intermittently in Tier[45]
2022-06-20 Christoph Langer JDK-8284675 "jpackage.exe" creates application launcher without Windows Application Manfiest
2022-06-20 Christoph Langer JDK-8284883 JVM crash: guarantee(sect->end() <= sect->limit()) failed: sanity on AVX512
2022-06-20 Christoph Langer JDK-8285301 C2: assert(!requires_atomic_access) failed: can't ensure atomicity
2022-06-20 Christoph Langer JDK-8285696 AlgorithmConstraints:permits not throwing IllegalArgumentException when 'alg' is null
2022-06-20 Christoph Langer JDK-8285398 Cache the results of constraint checks
2022-06-20 Christoph Langer JDK-8273115 CountedLoopEndNode::stride_con crash in debug build with -XX:+TraceLoopOpts
2022-06-14 Goetz Lindenmaier JDK-8282306 os::is_first_C_frame(frame*) crashes on invalid link access
2022-06-14 Goetz Lindenmaier JDK-8283562 JDK-8282306 breaks gtests on zero
2022-06-14 Goetz Lindenmaier JDK-8284686 Interval of < 1 ms disables ExecutionSample events
2022-06-10 Goetz Lindenmaier JDK-8287663 Add a regression test for JDK-8287073
2022-06-10 Goetz Lindenmaier JDK-8287073 NPE from CgroupV2Subsystem.getInstance()
2022-06-10 Goetz Lindenmaier JDK-8286869 unify os::dir_is_empty across posix platforms
2022-06-10 Christoph Langer JDK-8281297 TestStressG1Humongous fails with guarantee(is_range_uncommitted)
2022-06-10 Christoph Langer JDK-8178969 [TESTBUG] Wrong reporting of gc/g1/humongousObjects/TestHeapCounters test.
2022-06-10 Christoph Langer JDK-8274517 java/util/DoubleStreamSums/CompensatedSums.java fails with expected [true] but found [false]
2022-06-10 Christoph Langer JDK-8283441 C2: segmentation fault in ciMethodBlocks::make_block_at(int)
2022-06-10 Christoph Langer JDK-8284694 Avoid evaluating SSLAlgorithmConstraints twice
2022-06-10 Christoph Langer JDK-8159694 HiDPI, Unity, java/awt/dnd/DropTargetEnterExitTest/MissedDragExitTest.java
2022-06-10 Goetz Lindenmaier JDK-8172065 javax/swing/JTree/4908142/bug4908142.java The selected index should be "aad"
2022-06-09 Goetz Lindenmaier JDK-8285820 C2: LCM prioritizes locally dependent CreateEx nodes over projections after 8270090
2022-06-09 Goetz Lindenmaier JDK-8270090 C2: LCM may prioritize CheckCastPP nodes over projections
2022-06-09 Goetz Lindenmaier JDK-8287107 CgroupSubsystemFactory.setCgroupV2Path asserts with freezer controller
2022-06-09 Goetz Lindenmaier JDK-8287741 Fix of JDK-8287107 (unused cgv1 freezer controller) was incomplete
2022-06-09 Goetz Lindenmaier JDK-8284956 Potential leak awtImageData/color_data when initializes X11GraphicsEnvironment
2022-06-09 Goetz Lindenmaier JDK-8284680 sun.font.FontConfigManager.getFontConfig() leaks charset
2022-06-08 Christoph Langer JDK-8287824 The MTPerLineTransformValidation tests has a typo in the @run tag
2022-06-08 Christoph Langer JDK-8264666 Change implementation of safeAdd/safeMult in the LCMSImageLayout class
2022-06-08 Christoph Langer JDK-8283597 [REDO] Invalid generic signature for redefined classes
2022-06-08 Christoph Langer JDK-8282214 Upgrade JQuery to version 3.6.0
2022-06-08 Christoph Langer JDK-8281628 KeyAgreement : generateSecret intermittently not resetting
2022-06-08 Christoph Langer JDK-8282467 add extra diagnostics for JDK-8268184
2022-06-08 Christoph Langer JDK-8281183 RandomGenerator:NextDouble() default behavior partially fixed by JDK-8280950
2022-06-08 Christoph Langer JDK-8280950 RandomGenerator:NextDouble() default behavior non conformant after JDK-8280550 fix
2022-06-08 Christoph Langer JDK-8280550 SplittableRandom#nextDouble(double,double) can return result >= bound
2022-06-07 Goetz Lindenmaier JDK-8282477 [x86, aarch64] vmassert(_last_Java_pc == NULL, "already walkable"); fails with async profiler
2022-06-07 Goetz Lindenmaier JDK-8225122 Test AncestorResized.java fails when Windows desktop is scaled.
2022-06-04 Christoph Langer JDK-8286114 [test] show real exception in bomb call in sun/rmi/runtime/Log/checkLogging/CheckLogging.java
2022-06-03 Goetz Lindenmaier JDK-8287113 JFR: Periodic task thread uses period for method sampling events
2022-06-02 Goetz Lindenmaier JDK-8240903 Add test to check that jmod hashes are reproducible
2022-06-02 Goetz Lindenmaier JDK-8287202 GHA: Add macOS aarch64 to the list of default platforms for workflow_dispatch event
2022-06-02 Goetz Lindenmaier JDK-8283849 AsyncGetCallTrace may crash JVM on guarantee
2022-05-30 Severin Gehwolf JDK-8284094 Memory leak in invoker_completeInvokeRequest()
2022-05-29 Christoph Langer JDK-8287362 FieldAccessWatch testcase failed on AIX platform
2022-05-29 Christoph Langer JDK-8284661 Reproducible assembly builds without relative linking
2022-05-29 Christoph Langer JDK-8284437 Building from different users/workspace is not always deterministic
2022-05-29 Christoph Langer JDK-8282422 JTable.print() failed with UnsupportedCharsetException on AIX ko_KR locale
2022-05-29 Andrew Hughes JDK-8287336 GHA: Workflows break on patch versions
2022-05-27 Christoph Langer JDK-8283315 jrt-fs.jar not always deterministically built
2022-05-24 Christoph Langer JDK-8285397 JNI exception pending in CUPSfuncs.c:250
2022-05-24 Christoph Langer JDK-8181571 printing to CUPS fails on mac sandbox app
2022-05-23 Christoph Langer JDK-8287119 Add Distrust.java to ProblemList
2022-05-20 Christoph Langer JDK-8209776 Refactor jdk/security/JavaDotSecurity/ifdefs.sh to plain java test
2022-05-19 Goetz Lindenmaier JDK-8139173 [macosx] JInternalFrame shadow is not properly drawn
2022-05-18 Severin Gehwolf JDK-8240756 [macos] SwingSet2:TableDemo:Printed Japanese characters were garbled
2022-05-18 Christoph Langer JDK-8286293 Tests ShortResponseBody and ShortResponseBodyWithRetry should use less resources
2022-05-18 Christoph Langer JDK-8236136 tests which use CompilationMode shouldn't be run w/ TieredStopAtLevel
2022-05-18 Goetz Lindenmaier JDK-8283469 Don't use memset to initialize members in FileMapInfo and fix memory leak
2022-05-17 Christoph Langer JDK-8285686 Update FreeType to 2.12.0
2022-05-17 Christoph Langer JDK-8285523 Improve test java/io/FileOutputStream/OpenNUL.java
2022-05-16 Goetz Lindenmaier JDK-8286601 Mac Aarch: Excessive warnings to be ignored for build jdk
2022-05-16 Goetz Lindenmaier JDK-8285728 Alpine Linux build fails with busybox tar
2022-05-13 Goetz Lindenmaier JDK-8284758 [linux] improve print_container_info
2022-05-13 Goetz Lindenmaier JDK-8284754 print more interesting env variables in hs_err and VM.info
2022-05-13 Goetz Lindenmaier JDK-8283323 libharfbuzz optimization level results in extreme build times
2022-05-12 Goetz Lindenmaier JDK-8286198 [linux] Fix process-memory information
2022-05-12 Goetz Lindenmaier JDK-8285956 (fs) Excessive default poll interval in PollingWatchService
2022-05-09 Christoph Langer JDK-8206187 javax/management/remote/mandatory/connection/DefaultAgentFilterTest.java fails with Port already in use
2022-05-09 Christoph Langer JDK-8280593 [PPC64, S390] redundant allocation of MacroAssembler in StubGenerator ctor
2022-05-09 Christoph Langer JDK-8274687 JDWP deadlocks if some Java thread reaches wait in blockOnDebuggerSuspend
2022-05-09 Goetz Lindenmaier JDK-8286013 Incorrect test configurations for compiler/stable/TestStableShort.java
2022-05-09 Goetz Lindenmaier JDK-8284992 Fix misleading Vector API doc for LSHR operator
2022-05-09 Goetz Lindenmaier JDK-8285828 runtime/execstack/TestCheckJDK.java fails with zipped debug symbols
2022-05-09 Goetz Lindenmaier JDK-8282008 Incorrect handling of quoted arguments in ProcessBuilder
2022-05-09 Goetz Lindenmaier JDK-8268773 Improvements related to: Failed to start thread - pthread_create failed (EAGAIN)
2022-05-06 Goetz Lindenmaier JDK-8286029 Add classpath exemption to globals_vectorApiSupport_***.S.inc
2022-05-06 Goetz Lindenmaier JDK-8285921 serviceability/dcmd/jvmti/AttachFailed/AttachReturnError.java fails on Alpine
2022-05-06 Goetz Lindenmaier JDK-8282929 Localized monetary symbols are not reflected in `toLocalizedPattern` return value
2022-05-05 Goetz Lindenmaier JDK-8284848 C2: Compiler blackhole arguments should be treated as globally escaping
2022-05-03 Goetz Lindenmaier JDK-8285394 Compiler blackholes can be eliminated due to stale ciMethod::intrinsic_id()
2022-05-03 Goetz Lindenmaier JDK-8282170 JVMTI SetBreakpoint metaspace allocation test
2022-05-03 Goetz Lindenmaier JDK-8284620 CodeBuffer may leak _overflow_arena
2022-05-02 Christoph Langer JDK-8285727 [11u, 17u] Unify fix for JDK-8284920 with version from head
2022-05-02 Goetz Lindenmaier JDK-8285726 [11u, 17u] Unify fix for JDK-8284548 with version from head
2022-04-29 Christoph Langer JDK-8274735 javax.imageio.IIOException: Unsupported Image Type while processing a valid JPEG image
2022-04-29 Christoph Langer JDK-8279532 ProblemList sun/security/ssl/SSLSessionImpl/NoInvalidateSocketException.java
2022-04-28 Goetz Lindenmaier JDK-8284549 JFR: FieldTable leaks FieldInfoTable member
2022-04-27 Goetz Lindenmaier JDK-8284532 Memory leak in BitSet::BitMapFragmentTable in JFR leak profiler
2022-04-27 Goetz Lindenmaier JDK-8282293 Domain value for system property jdk.https.negotiate.cbt should be case-insensitive
2022-04-27 Goetz Lindenmaier JDK-8279842 HTTPS Channel Binding support for Java GSS/Kerberos
2022-04-26 Christoph Langer JDK-8280684 JfrRecorderService failes with guarantee(num_written > 0) when no space left on device.
2022-04-26 Christoph Langer JDK-8285342 Zero build failure with clang due to values not handled in switch
2022-04-26 Christoph Langer JDK-8284866 Add test to JDK-8273056
2022-04-26 Christoph Langer JDK-8284458 CodeHeapState::aggregate() leaks blob_name
2022-04-26 Christoph Langer JDK-8282142 [TestCase] compiler/inlining/ResolvedClassTest.java will fail when --with-jvm-features=-compiler1
2022-04-26 Christoph Langer JDK-8278519 serviceability/jvmti/FieldAccessWatch/FieldAccessWatch.java failed "assert(handle != __null) failed: JNI handle should not be null"
2022-04-26 Christoph Langer JDK-8277396 [TESTBUG] In DefaultButtonModelCrashTest.java, frame is accessed from main thread
2022-04-26 Christoph Langer JDK-8273095 vmTestbase/vm/mlvm/anonloader/stress/oome/heap/Test.java fails with "wrong OOME"
2022-04-25 Goetz Lindenmaier JDK-8285445 cannot open file "NUL:"
2022-04-25 Goetz Lindenmaier JDK-8284884 Replace polling with waiting in javax/swing/text/html/parser/Parser/8078268/bug8078268.java
2022-04-25 Goetz Lindenmaier JDK-8284622 Update versions of some Github Actions used in JDK workflow
2022-04-25 Goetz Lindenmaier JDK-8284023 java.sun.awt.X11GraphicsDevice.getDoubleBufferVisuals() leaks XdbeScreenVisualInfo
2022-04-25 Goetz Lindenmaier JDK-8284033 Leak XVisualInfo in getAllConfigs in awt_GraphicsEnv.c
2022-04-25 Goetz Lindenmaier JDK-8283422 Create a new test for JDK-8254790
2022-04-25 Goetz Lindenmaier JDK-8279597 [TESTBUG] ReturnBlobToWrongHeapTest.java fails with -XX:TieredStopAtLevel=1 on machines with many cores
2022-04-13 Christoph Langer JDK-8283725 Launching java with "-Xlog:gc*=trace,safepoint*=trace,class*=trace" crashes the JVM
2022-04-12 Goetz Lindenmaier JDK-8279520 SPNEGO has not passed channel binding info into the underlying mechanism
2022-04-11 Goetz Lindenmaier JDK-8284603 [17u] Update Boot JDK used in GHA to 17.0.2
2022-04-11 Goetz Lindenmaier JDK-8284507 GHA: Only check test results if testing was not skipped
2022-04-11 Goetz Lindenmaier JDK-8284389 Improve stability of GHA Pre-submit testing by caching cygwin installer
2022-04-08 Christoph Langer JDK-8276863 Remove test/jdk/sun/security/ec/ECDSAJavaVerify.java
2022-04-08 Christoph Langer JDK-8279822 CI: Constant pool entries in error state are not supported
2022-04-07 Goetz Lindenmaier JDK-8283347 [macos] Bad JNI lookup accessibilityHitTest is shown when Screen magnifier is enabled
2022-04-07 Goetz Lindenmaier JDK-8284369 TestFailedAllocationBadGraph fails with -XX:TieredStopAtLevel < 4
2022-04-07 Goetz Lindenmaier JDK-8283279 [Testbug] Improve TestGetSwapSpaceSize
2022-04-07 Goetz Lindenmaier JDK-8276880 Remove java/lang/RuntimeTests/exec/ExecWithDir as unnecessary
2022-04-06 Goetz Lindenmaier JDK-8283217 Leak FcObjectSet in getFontConfigLocations() in fontpath.c
2022-04-05 Christoph Langer JDK-8283187 C2: loop candidate for superword not always unrolled fully if superword fails
2022-04-05 Christoph Langer JDK-8281822 Test failures on non-DTrace builds due to incomplete DTrace* flags handling
2022-04-04 Goetz Lindenmaier JDK-8282382 Report glibc malloc tunables in error reports
2022-04-04 Goetz Lindenmaier JDK-8280940 gtest os.release_multi_mappings_vm is racy
2022-04-04 Goetz Lindenmaier JDK-8281522 Rename ADLC classes which have the same name as hotspot variants
2022-04-01 Christoph Langer JDK-8283834 Unmappable character for US-ASCII encoding in TestPredicateInputBelowLoopPredicate
2022-04-01 Christoph Langer JDK-8283641 Large value for CompileThresholdScaling causes assert
2022-04-01 Christoph Langer JDK-8283249 CompressedClassPointers.java fails on ppc with 'Narrow klass shift: 0' missing
2022-04-01 Christoph Langer JDK-8282590 C2: assert(addp->is_AddP() && addp->outcnt() > 0) failed: Don't process dead nodes
2022-04-01 Christoph Langer JDK-8282592 C2: assert(false) failed: graph should be schedulable
2022-04-01 Christoph Langer JDK-8281811 assert(_base == Tuple) failed: Not a Tuple after JDK-8280799
2022-04-01 Christoph Langer JDK-8280799 ะก2: assert(false) failed: cyclic dependency prevents range check elimination
2022-04-01 Christoph Langer JDK-8274939 Incorrect size of the pixel storage is used by the robot on macOS
2022-04-01 Christoph Langer JDK-8281450 Remove unnecessary operator new and delete from ObjectMonitor
2022-04-01 Christoph Langer JDK-8280941 os::print_memory_mappings() prints segment preceeding the inclusion range
2022-04-01 Christoph Langer JDK-8280004 DCmdArgument::parse_value() should handle NULL input
2022-04-01 Christoph Langer JDK-8273142 Remove dependancy of TestHttpServer, HttpTransaction, HttpCallback from open/test/jdk/sun/net/www/protocol/http/ tests
2022-04-01 Goetz Lindenmaier JDK-8283497 [windows] print TMP and TEMP in hs_err and VM.info
2022-03-31 Goetz Lindenmaier JDK-8283451 C2: assert(_base == Long) failed: Not a Long
2022-03-31 Goetz Lindenmaier JDK-8282887 Potential memory leak in sun.util.locale.provider.HostLocaleProviderAdapterImpl.getNumberPattern() on Windows
2022-03-31 Goetz Lindenmaier JDK-8282312 Minor corrections to evbroadcasti32x4 intrinsic on x86
2022-03-31 Goetz Lindenmaier JDK-8256368 Avoid repeated upcalls into Java to re-resolve MH/VH linkers/invokers
2022-03-31 Goetz Lindenmaier JDK-8282874 Bad performance on gather/scatter API caused by different IntSpecies of indexMap
2022-03-31 Goetz Lindenmaier JDK-8282045 When loop strip mining fails, safepoints are removed from loop anyway
2022-03-31 Goetz Lindenmaier JDK-8280901 MethodHandle::linkToNative stub is missing w/ -Xint
2022-03-31 Goetz Lindenmaier JDK-8282231 x86-32: runtime call to SharedRuntime::ldiv corrupts registers
2022-03-31 Goetz Lindenmaier JDK-8271008 appcds/*/MethodHandlesAsCollectorTest.java tests time out because of excessive GC (CodeCache GC Threshold) in loom
2022-03-30 Christoph Langer JDK-8280867 Cpuid1Ecx feature parsing is incorrect for AMD CPUs
2022-03-30 Christoph Langer JDK-8272908 Missing coverage for certain classes in com.sun.org.apache.xml.internal.security
2022-03-30 Christoph Langer JDK-8272964 java/nio/file/Files/InterruptCopy.java fails with java.lang.RuntimeException: Copy was not interrupted
2022-03-30 Goetz Lindenmaier JDK-8283408 Fix a C2 crash when filling arrays with unsafe
2022-03-30 Goetz Lindenmaier JDK-8282172 CompileBroker::log_metaspace_failure is called from non-Java/compiler threads
2022-03-30 Goetz Lindenmaier JDK-8272493 Suboptimal code generation around Preconditions.checkIndex intrinsic with AVX2
2022-03-30 Goetz Lindenmaier JDK-8283350 (tz) Update Timezone Data to 2022a
2022-03-30 Goetz Lindenmaier JDK-8277055 Assert "missing inlining msg" with -XX:+PrintIntrinsics
2022-03-30 Goetz Lindenmaier JDK-8280964 [Linux aarch64] : drawImage dithers TYPE_BYTE_INDEXED images incorrectly
2022-03-30 Goetz Lindenmaier JDK-8281544 assert(VM_Version::supports_avx512bw()) failed for Tests jdk/incubator/vector/
2022-03-30 Goetz Lindenmaier JDK-8271055 Crash during deoptimization with "assert(bb->is_reachable()) failed: getting result from unreachable basicblock" with -XX:+VerifyStack
2022-03-30 Goetz Lindenmaier JDK-8280600 C2: assert(!had_error) failed: bad dominance
2022-03-30 Goetz Lindenmaier JDK-8279219 [REDO] C2 crash when allocating array of size too large
2022-03-30 Goetz Lindenmaier JDK-8275337 C1: assert(false) failed: live_in set of first block must be empty
2022-03-30 Goetz Lindenmaier JDK-8264605 vmTestbase/nsk/jvmti/SuspendThread/suspendthrd003/TestDescription.java failed with "agent_tools.cpp, 471: (foundThread = (jthread) jni_env->NewGlobalRef(foundThread)) != NULL"
2022-03-30 Goetz Lindenmaier JDK-8272358 Some tests may fail when executed with other locales than the US
2022-03-30 Goetz Lindenmaier JDK-8271302 Regex Test Refresh
2022-03-30 Goetz Lindenmaier JDK-8273169 java/util/regex/NegativeArraySize.java failed after JDK-8271302
2022-03-29 Goetz Lindenmaier JDK-8278794 Infinite loop in DeflaterOutputStream.finish()
2022-03-29 Goetz Lindenmaier JDK-8282628 Potential memory leak in sun.font.FontConfigManager.getFontConfig()
2022-03-29 Goetz Lindenmaier JDK-8282551 Properly initialize L32X64MixRandom state
2022-03-29 Goetz Lindenmaier JDK-8281771 Crash in java_lang_invoke_MethodType::print_signature
2022-03-29 Goetz Lindenmaier JDK-8270797 ShortECDSA.java test is not complete
2022-03-28 Christoph Langer JDK-8279586 [macos] custom JCheckBox and JRadioBox with custom icon set: focus is still displayed after unchecking
2022-03-28 Goetz Lindenmaier JDK-8278549 UNIX sun/font coding misses SUSE distro detection on recent distro SUSE 15
2022-03-24 Christoph Langer JDK-8282444 Module finder incorrectly assumes default file system path-separator character
2022-03-24 Christoph Langer JDK-8255266 Update Public Suffix List to 3c213aa
2022-03-23 Goetz Lindenmaier JDK-8281266 [JVMCI] MetaUtil.toInternalName() doesn't handle hidden classes correctly
2022-03-23 Goetz Lindenmaier JDK-8282345 handle latest VS2022 in abstract_vm_version
2022-03-23 Goetz Lindenmaier JDK-8281274 deal with ActiveProcessorCount in os::Linux::print_container_info
2022-03-23 Goetz Lindenmaier JDK-8281338 NSAccessibilityPressAction action for tree node and NSAccessibilityShowMenuAcgtion action not working
2022-03-23 Goetz Lindenmaier JDK-8280543 Update the "java" and "jcmd" tool specification for CDS
2022-03-22 Christoph Langer JDK-8277922 Unable to click JCheckBox in JTable through Java Access Bridge
2022-03-22 Christoph Langer JDK-8249592 Robot.mouseMove moves cursor to incorrect location when display scale varies and Java runs in DPI Unaware mode
2022-03-22 Christoph Langer JDK-8282295 SymbolPropertyEntry::set_method_type fails with assert
2022-03-22 Christoph Langer JDK-8282583 Update BCEL md to include the copyright notice
2022-03-22 Christoph Langer JDK-8281275 Upgrading from 8 to 11 no longer accepts '/' as filepath separator in gc paths
2022-03-22 Christoph Langer JDK-8281262 Windows builds in different directories are not fully reproducible
2022-03-22 Christoph Langer JDK-8278472 Invalid value set to CANDIDATEFORM structure
2022-03-21 Christoph Langer JDK-8280956 Re-examine copyright headers on files in src/java.desktop/macosx/native/libawt_lwawt/awt/a11y
2022-03-19 Christoph Langer JDK-8280401 [sspi] gss_accept_sec_context leaves output_token uninitialized
2022-03-19 Christoph Langer JDK-8279227 Access Bridge: Wrong frame position and hit test result on HiDPI display
2022-03-19 Christoph Langer JDK-8193682 Infinite loop in ZipOutputStream.close()
2022-03-19 Christoph Langer JDK-8277087 ZipException: zip END header not found at ZipFile#Source.findEND
2022-03-18 Christoph Langer JDK-8278851 Correct signer logic for jars signed with multiple digest algorithms
2022-03-17 Christoph Langer JDK-8276796 gc/TestSystemGC.java large pages subtest fails with ZGC
2022-03-17 Goetz Lindenmaier JDK-8278065 Refactor subclassAudits to use ClassValue
2022-03-17 Christoph Langer JDK-8280476 [macOS] : hotspot arm64 bug exposed by latest clang
2022-03-17 Christoph Langer JDK-8214733 runtime/8176717/TestInheritFD.java timed out
2022-03-17 Christoph Langer JDK-8279437 [JVMCI] exception in HotSpotJVMCIRuntime.translate can exit the VM
2022-03-17 Christoph Langer JDK-8278186 org.jcp.xml.dsig.internal.dom.Utils.parseIdFromSameDocumentURI throws StringIndexOutOfBoundsException when calling substring method
2022-03-17 Christoph Langer JDK-8277422 tools/jar/JarEntryTime.java fails with modified time mismatch
2022-03-17 Christoph Langer JDK-8277165 jdeps --multi-release --print-module-deps fails if module-info.class in different versioned directories
2022-03-17 Christoph Langer JDK-8275037 Test vmTestbase/nsk/sysdict/vm/stress/btree/btree011/btree011.java crashes with memory exhaustion on Windows
2022-03-16 Goetz Lindenmaier JDK-8274751 Drag And Drop hangs on Windows
2022-03-16 Goetz Lindenmaier JDK-8279834 Alpine Linux fails to build when --with-source-date enabled
2022-03-15 Goetz Lindenmaier JDK-8283017 GHA: Workflows break with update release versions
2022-03-15 Goetz Lindenmaier JDK-8273139 C2: assert(f <= 1 && f >= 0) failed: Incorrect frequency
2022-03-15 Goetz Lindenmaier JDK-8278766 Enable OpenJDK build support for reproducible jars and jmods using --date
2022-03-15 Goetz Lindenmaier JDK-8277072 ObjectStreamClass caches keep ClassLoaders alive
2022-03-15 Goetz Lindenmaier JDK-8280041 Retry loop issues in java.io.ClassCache
2022-03-14 Christoph Langer JDK-8270435 UT: MonitorUsedDeflationThresholdTest failed: did not find too_many string in output
2022-03-14 Christoph Langer JDK-8274172 Convert JavadocTester to use NIO
2022-03-14 Christoph Langer JDK-8267163 Rename anonymous loader tests to hidden loader tests
2022-03-14 Christoph Langer JDK-8272168 some hotspot runtime/logging tests don't check exit code
2022-03-14 Christoph Langer JDK-8269077 TestSystemGC uses "require vm.gc.G1" for large pages subtest
2022-03-14 Goetz Lindenmaier JDK-8281638 jfr/event/allocation tests fail with release VMs after JDK-8281318 due to lack of -XX:+UnlockDiagnosticVMOptions
2022-03-14 Goetz Lindenmaier JDK-8281318 Improve jfr/event/allocation tests reliability
2022-03-14 Goetz Lindenmaier JDK-8281168 Micro-optimize VarForm.getMemberName for interpreter
2022-03-14 Goetz Lindenmaier JDK-8277893 Arraycopy stress tests
2022-03-11 Christoph Langer JDK-8282509 [exploded image] ResolvedClassTest fails with similar output
2022-03-11 Christoph Langer JDK-8276657 XSLT compiler tries to define a class with empty name
2022-03-11 Christoph Langer JDK-8276825 hotspot/runtime/SelectionResolution test errors
2022-03-11 Christoph Langer JDK-8276260 (se) Remove java/nio/channels/Selector/Wakeup.java from ProblemList (win)
2022-03-11 Christoph Langer JDK-8251904 vmTestbase/nsk/sysdict/vm/stress/btree/btree010/btree010.java fails with ClassNotFoundException: nsk.sysdict.share.BTree0LLRLRLRRLR
2022-03-11 Christoph Langer JDK-8268595 java/io/Serializable/serialFilter/GlobalFilterTest.java#id1 failed in timeout
2022-03-11 Christoph Langer JDK-8274244 ReportOnImportedModuleAnnotation.java fails on rerun
2022-03-11 Christoph Langer JDK-8274561 sun/net/ftp/TestFtpTimeValue.java timed out on slow machines
2022-03-11 Christoph Langer JDK-8274233 Minor cleanup for ToolBox
2022-03-11 Christoph Langer JDK-8269373 some tests in jdk/tools/launcher/ fails on localized Windows platform
2022-03-11 Goetz Lindenmaier JDK-8279958 Provide configure hints for Alpine/apk package managers
2022-03-11 Goetz Lindenmaier JDK-8279668 x86: AVX2 versions of vpxor should be asserted
2022-03-10 Christoph Langer JDK-8279515 C1: No inlining through invokedynamic and invokestatic call sites when resolved class is not linked
2022-03-10 Christoph Langer JDK-8268558 [TESTBUG] Case 2 in TestP11KeyFactoryGetRSAKeySpec is skipped
2022-03-10 Christoph Langer JDK-8272146 Disable Fibonacci test on memory constrained systems
2022-03-10 Christoph Langer JDK-8272169 runtime/logging/LoaderConstraintsTest.java doesn't build test.Empty
2022-03-10 Christoph Langer JDK-8271224 runtime/EnclosingMethodAttr/EnclMethodAttr.java doesn't check exit code
2022-03-10 Christoph Langer JDK-8269753 Misplaced caret in PatternSyntaxException's detail message
2022-03-10 Christoph Langer JDK-8270336 [TESTBUG] Fix initialization in NonbranchyTree
2022-03-10 Christoph Langer JDK-8269933 test/jdk/javax/net/ssl/compatibility/JdkInfo incorrect verification of protocol and cipher support
2022-03-10 Christoph Langer JDK-8270837 fix typos in test TestSigParse.java
2022-03-10 Christoph Langer JDK-8270021 Incorrect log decorators in gc/g1/plab/TestPLABEvacuationFailure.java
2022-03-10 Christoph Langer JDK-8263538 SharedArchiveConsistency.java should test -Xshare:auto as well
2022-03-10 Goetz Lindenmaier JDK-8282225 GHA: Allow one concurrent run per PR only
2022-03-10 Christoph Langer JDK-8269135 TestDifferentProtectionDomains runs into timeout in client VM
2022-03-10 Christoph Langer JDK-8268906 gc/g1/mixedgc/TestOldGenCollectionUsage.java assumes that GCs take 1ms minimum
2022-03-10 Christoph Langer JDK-8263461 jdk/jfr/event/gc/detailed/TestEvacuationFailedEvent.java uses wrong mechanism to cause evacuation failure
2022-03-09 Christoph Langer JDK-8279182 MakeZipReproducible ZipEntry timestamps not localized to UTC
2022-03-09 Christoph Langer JDK-8275745 Reproducible copyright headers
2022-03-09 Christoph Langer JDK-8270468 TestRangeCheckEliminated fails because methods are not compiled
2022-03-09 Christoph Langer JDK-8269129 Multiple tier1 tests in hotspot/jtreg/compiler are failing for client VMs
2022-03-08 Goetz Lindenmaier JDK-8265317 [vector] assert(payload->is_object()) failed: expected 'object' value for scalar-replaced boxed vector but got: NULL
2022-03-08 Goetz Lindenmaier JDK-8278948 compiler/vectorapi/reshape/TestVectorCastAVX1.java crashes in assembler
2022-03-08 Goetz Lindenmaier JDK-8275638 GraphKit::combine_exception_states fails with "matching stack sizes" assert
2022-03-08 Goetz Lindenmaier JDK-8278966 two microbenchmarks tests fail "assert(!jvms->method()->has_exception_handlers()) failed: no exception handler expected" after JDK-8275638
2022-03-08 Goetz Lindenmaier JDK-8276990 Memory leak in invoker.c fillInvokeRequest() during JDI operations
2022-03-08 Goetz Lindenmaier JDK-8273056 java.util.random does not correctly sample exponential or Gaussian distributions
2022-03-07 Goetz Lindenmaier JDK-8280123 C2: Infinite loop in CMoveINode::Ideal during IGVN
2022-03-07 Goetz Lindenmaier JDK-8275830 C2: Receiver downcast is missing when inlining through method handle linkers
2022-03-07 Goetz Lindenmaier JDK-8278796 Incorrect behavior of FloatVector.withLane on x86
2022-03-07 Goetz Lindenmaier JDK-8278014 [vectorapi] Remove test run script
2022-03-07 Goetz Lindenmaier JDK-8274855 vectorapi tests failing with assert(!vbox->is_Phi()) failed
2022-03-07 Goetz Lindenmaier JDK-8273804 Platform.isTieredSupported should handle the no-compiler case
2022-03-04 Goetz Lindenmaier JDK-8279837 C2: assert(is_Loop()) failed: invalid node class: Region
2022-03-04 Goetz Lindenmaier JDK-8258814 Compilation logging crashes for thread suspension / debugging tests
2022-03-04 Goetz Lindenmaier JDK-8279560 AArch64: generate_compare_long_string_same_encoding and LARGE_LOOP_PREFETCH alignment
2022-03-04 Goetz Lindenmaier JDK-8279356 Method linking fails with guarantee(mh->adapter() != NULL) failed: Adapter blob must already exist!
2022-03-03 Goetz Lindenmaier JDK-8281043 Intrinsify recursive ObjectMonitor locking for PPC64
2022-03-03 Goetz Lindenmaier JDK-8277906 Incorrect type for IV phi of long counted loops after CCP
2022-03-03 Goetz Lindenmaier JDK-8274983 C1 optimizes the invocation of private interface methods
2022-03-03 Goetz Lindenmaier JDK-8275854 C2: assert(stride_con != 0) failed: missed some peephole opt
2022-03-03 Goetz Lindenmaier JDK-8268231 Aarch64: Use Ldp in intrinsics for String.compareTo
2022-03-02 Goetz Lindenmaier JDK-8281615 Deadlock caused by jdwp agent
2022-03-01 Christoph Langer JDK-8276141 XPathFactory set/getProperty method
2022-03-01 Christoph Langer JDK-8277795 LDAP connection timeout not honoured under contention
2022-03-01 Goetz Lindenmaier JDK-8274471 Add support for RSASSA-PSS in OCSP Response
2022-03-01 Goetz Lindenmaier JDK-8282219 jdk/java/lang/ProcessBuilder/Basic.java fails on AIX
2022-02-28 Goetz Lindenmaier JDK-8276841 Add support for Visual Studio 2022
2022-02-25 Christoph Langer JDK-8278185 Custom JRE cannot find non-ASCII named module inside
2022-02-25 Christoph Langer JDK-8272996 JNDI DNS provider fails to resolve SRV entries when IPV6 stack is enabled
2022-02-25 Christoph Langer JDK-8279669 test/jdk/com/sun/jdi/TestScaffold.java uses wrong condition
2022-02-24 Goetz Lindenmaier JDK-8281460 Let ObjectMonitor have its own NMT category
2022-02-23 Goetz Lindenmaier JDK-8271721 Split gc/g1/TestMixedGCLiveThreshold into separate tests
2022-02-23 Goetz Lindenmaier JDK-8277383 VM.metaspace optionally show chunk freelist details
2022-02-23 Goetz Lindenmaier JDK-8278163 --with-cacerts-src variable resolved after GenerateCacerts recipe setup
2022-02-22 Christoph Langer JDK-8277488 Add expiry exception for Digicert (geotrustglobalca) expiring in May 2022
2022-02-17 Goetz Lindenmaier JDK-8278346 java/nio/file/Files/probeContentType/Basic.java fails on Linux SLES15 machine
2022-02-17 Goetz Lindenmaier JDK-8278080 Add --with-cacerts-src='user cacerts folder' to enable deterministic cacerts generation
2022-02-16 Goetz Lindenmaier JDK-8277762 Allow configuration of HOTSPOT_BUILD_USER
2022-02-16 Goetz Lindenmaier JDK-8274171 java/nio/file/Files/probeContentType/Basic.java failed on "Content type" mismatches
2022-02-16 Goetz Lindenmaier JDK-8274524 SSLSocket.close() hangs if it is called during the ssl handshake
2022-02-14 Goetz Lindenmaier JDK-8273655 content-types.properties files are missing some common types
2022-02-14 Christoph Langer JDK-8278951 containers/cgroup/PlainRead.java fails on Ubuntu 21.10
2022-02-14 Christoph Langer JDK-8272600 (test) Use native "sleep" in Basic.java
2022-02-14 Goetz Lindenmaier JDK-8280373 Update Xalan serializer / SystemIDResolver to align with JDK-8270492
2022-02-14 Goetz Lindenmaier JDK-8279385 [test] Adjust sun/security/pkcs12/KeytoolOpensslInteropTest.java after 8278344
2022-02-14 Goetz Lindenmaier JDK-8271199 Mutual TLS handshake fails signing client certificate with custom sensitive PKCS11 key
2022-02-10 Goetz Lindenmaier JDK-8279695 [TESTBUG] modify compiler/loopopts/TestSkeletonPredicateNegation.java to run on C1 also
2022-02-10 Goetz Lindenmaier JDK-8272541 Incorrect overflow test in Toom-Cook branch of BigInteger multiplication
2022-02-09 Goetz Lindenmaier JDK-8281061 [s390] JFR runs into assertions while validating interpreter frames
2022-02-09 Goetz Lindenmaier JDK-8265261 java/nio/file/Files/InterruptCopy.java fails with java.lang.RuntimeException: Copy was not interrupted
2022-02-08 Christoph Langer JDK-8275330 C2: assert(n->is_Root() || n->is_Region() || n->is_Phi() || n->is_MachMerge() || def_block->dominates(block)) failed: uses must be dominated by definitions
2022-02-08 Christoph Langer JDK-8274750 java/io/File/GetXSpace.java failed: '/dev': 191488 != 190976
2022-02-08 Christoph Langer JDK-8190748 java/text/Format/DateFormat/DateFormatTest.java and NonGregorianFormatTest fail intermittently
2022-02-08 Goetz Lindenmaier JDK-8270117 Broken jtreg link in "Building the JDK" page
2022-02-02 Christoph Langer JDK-8277449 compiler/vectorapi/TestLongVectorNeg.java fails with release VMs
2022-02-02 Christoph Langer JDK-8275874 [JVMCI] only support aligned reads in c2v_readFieldValue
2022-02-02 Christoph Langer JDK-8275847 Scheduling fails with "too many D-U pinch points" on small method
2022-02-02 Christoph Langer JDK-8275643 C2's unaryOp vector intrinsic does not properly handle LongVector.neg
2022-02-02 Christoph Langer JDK-8274944 AppCDS dump causes SEGV in VM thread while adjusting lambda proxy class info
2022-02-02 Christoph Langer JDK-8271506 Add ResourceHashtable support for deleting selected entries
2022-02-02 Christoph Langer JDK-8271056 C2: "assert(no_dead_loop) failed: dead loop detected" due to cmoving identity
2022-02-02 Goetz Lindenmaier JDK-8278381 [GCC 11] Address::make_raw() does not initialize rspec
2022-02-01 Goetz Lindenmaier JDK-8277180 Intrinsify recursive ObjectMonitor locking for C2 x64 and A64
2022-02-01 Goetz Lindenmaier JDK-8279124 VM does not handle SIGQUIT during initialization
2022-01-31 Christoph Langer JDK-8280414 Memory leak in DefaultProxySelector
2022-01-31 Christoph Langer JDK-8275645 [JVMCI] avoid unaligned volatile reads on AArch64
2022-01-31 Christoph Langer JDK-8273381 Assert in PtrQueueBufferAllocatorTest.stress_free_list_allocator_vm
2022-01-31 Christoph Langer JDK-8269616 serviceability/dcmd/framework/VMVersionTest.java fails with Address already in use error
2022-01-31 Goetz Lindenmaier JDK-8279702 [macosx] ignore xcodebuild warnings on M1
2022-01-31 Goetz Lindenmaier JDK-8278604 SwingSet2 table demo does not have accessible description set for images
2022-01-31 Goetz Lindenmaier JDK-8277299 STACK_OVERFLOW in Java_sun_awt_shell_Win32ShellFolder2_getIconBits
2022-01-27 Goetz Lindenmaier JDK-8280526 x86_32 Math.sqrt performance regression with -XX:UseSSE={0,1}
2022-01-27 Goetz Lindenmaier JDK-8279076 C2: Bad AD file when matching SqrtF with UseSSE=0
2022-01-27 Goetz Lindenmaier JDK-8280155 [PPC64, s390] frame size checks are not yet correct
2022-01-27 Goetz Lindenmaier JDK-8279924 [PPC64, s390] implement frame::is_interpreted_frame_valid checks
2022-01-27 Goetz Lindenmaier JDK-8279445 Update JMH devkit to 1.34
2022-01-27 Goetz Lindenmaier JDK-8277497 Last column cell in the JTable row is read as empty cell
2022-01-27 Goetz Lindenmaier JDK-8274753 ZGC: SEGV in MetaspaceShared::link_shared_classes
2022-01-26 Goetz Lindenmaier JDK-8278241 Implement JVM SpinPause on linux-aarch64
2022-01-26 Goetz Lindenmaier JDK-8251216 Implement MD5 intrinsics on AArch64
2022-01-26 Goetz Lindenmaier JDK-8275082 Update XML Security for Java to 2.3.0
2022-01-26 Christoph Langer JDK-8275608 runtime/Metaspace/elastic/TestMetaspaceAllocationMT2 too slow
2022-01-25 Goetz Lindenmaier JDK-8276057 Update JMH devkit to 1.33
2022-01-25 Christoph Langer JDK-8275687 runtime/CommandLine/PrintTouchedMethods test shouldn't catch RuntimeException
2022-01-25 Christoph Langer JDK-8272553 several hotspot runtime/CommandLine tests don't check exit code
2022-01-25 Christoph Langer JDK-8253197 vmTestbase/nsk/jvmti/StopThread/stopthrd007/TestDescription.java fails with "ERROR: DebuggeeSleepingThread: ThreadDeath lost"
2022-01-25 Christoph Langer JDK-8177814 jdk/editpad is not in jdk TEST.groups
2022-01-25 Christoph Langer JDK-8236505 Mark jdk/editpad/EditPadTest.java as @headful
2022-01-21 Goetz Lindenmaier JDK-8278344 sun/security/pkcs12/KeytoolOpensslInteropTest.java test fails because of different openssl output
2022-01-21 Goetz Lindenmaier JDK-8273438 Enable parallelism in vmTestbase/metaspace/stressHierarchy tests
2022-01-20 Goetz Lindenmaier JDK-8277503 compiler/onSpinWait/TestOnSpinWaitAArch64DefaultFlags.java failed with "OnSpinWaitInst with the expected value 'isb' not found."
2022-01-20 Goetz Lindenmaier JDK-8277137 Set OnSpinWaitInst/OnSpinWaitInstCount defaults to "isb"/1 for Arm Neoverse N1
2022-01-19 Christoph Langer JDK-8273341 Update SipHash to version 1.0
2022-01-19 Christoph Langer JDK-8269032 Stringdedup tests are failing if the ergonomically select GC does not support it
2022-01-19 Goetz Lindenmaier JDK-8278389 SuspendibleThreadSet::_suspend_all should be volatile/atomic
2022-01-19 Goetz Lindenmaier JDK-8273433 Enable parallelism in vmTestbase_nsk_sysdict tests
2022-01-18 Christoph Langer JDK-8279453 Disable tools/jar/ReproducibleJar.java on 32-bit platforms
2022-01-18 Goetz Lindenmaier JDK-8186670 Implement _onSpinWait() intrinsic for AArch64
2022-01-17 Christoph Langer JDK-8280002 jmap -histo may leak stream
2022-01-17 Christoph Langer JDK-8279998 PPC64 debug builds fail with "untested: RangeCheckStub: predicate_failed_trap_id"
2022-01-17 Christoph Langer JDK-8279833 Loop optimization issue in String.encodeUTF8_UTF16
2022-01-17 Christoph Langer JDK-8273277 C2: Move conditional negation into rc_predicate
2022-01-17 Goetz Lindenmaier JDK-8276766 Enable jar and jmod to produce deterministic timestamped content
2022-01-15 Goetz Lindenmaier JDK-8277069 [REDO] JDK-8276743 Make openjdk build Zip Archive generation "reproducible"
2022-01-14 Christoph Langer JDK-8279412 [JVMCI] failed speculations list must outlive any nmethod that refers to it
2022-01-14 Christoph Langer JDK-8274506 TestPids.java and TestPidsLimit.java fail with podman run as root
2022-01-14 Christoph Langer JDK-8273967 gtest os.dll_address_to_function_and_library_name_vm fails on macOS12
2022-01-14 Christoph Langer JDK-8273366 [testbug] javax/swing/UIDefaults/6302464/bug6302464.java fails on macOS12
2022-01-14 Christoph Langer JDK-8271202 C1: assert(false) failed: live_in set of first block must be empty
2022-01-14 Christoph Langer JDK-8269206 A small typo in comment in test/lib/sun/hotspot/WhiteBox.java
2022-01-14 Christoph Langer JDK-8263567 gtests don't terminate the VM safely
2022-01-14 Goetz Lindenmaier JDK-8278309 [windows] use of uninitialized OSThread::_state
2022-01-14 Goetz Lindenmaier JDK-8273526 Extend the OSContainer API pids controller with pids.current
2022-01-13 Christoph Langer JDK-8278871 [JVMCI] assert((uint)reason < 2* _trap_hist_limit) failed: oob
2022-01-13 Christoph Langer JDK-8277447 Hotspot C1 compiler crashes on Kotlin suspend fun with loop
2022-01-13 Christoph Langer JDK-8269849 vmTestbase/gc/gctests/PhantomReference/phantom002/TestDescription.java failed with "OutOfMemoryError: Java heap space: failed reallocation of scalar replaced objects"
2022-01-13 Christoph Langer JDK-8269087 CheckSegmentedCodeCache test fails in an emulated-client VM
2022-01-13 Goetz Lindenmaier JDK-8276764 Enable deterministic file content ordering for Jar and Jmod
2022-01-13 Goetz Lindenmaier JDK-8277846 Implement fast-path for ASCII-compatible CharsetEncoders on ppc64
2022-01-12 Goetz Lindenmaier JDK-8279505 Update documentation for RETRY_COUNT and REPEAT_COUNT
2022-01-11 Christoph Langer JDK-8269523 runtime/Safepoint/TestAbortOnVMOperationTimeout.java failed when expecting 'VM operation took too long'
2022-01-11 Christoph Langer JDK-8269037 jsig/Testjsig.java doesn't have to be restricted to linux only
2022-01-11 Christoph Langer JDK-8262134 compiler/uncommontrap/TestDeoptOOM.java failed with "guarantee(false) failed: wrong number of expression stack elements during deopt"
2022-01-11 Goetz Lindenmaier JDK-8276654 element-list order is non deterministic
2022-01-11 Goetz Lindenmaier JDK-8279300 [arm32] SIGILL when running GetObjectSizeIntrinsicsTest
2022-01-11 Goetz Lindenmaier JDK-8244602 Add JTREG_REPEAT_COUNT to repeat execution of a test
2022-01-11 Goetz Lindenmaier JDK-8273682 Upgrade Jline to 3.20.0
2022-01-11 Goetz Lindenmaier JDK-8272398 Update DockerTestUtils.buildJdkDockerImage()
2022-01-10 Goetz Lindenmaier JDK-8266490 Extend the OSContainer API to support the pids controller of cgroups
2022-01-07 Christoph Langer JDK-8278020 ~13% variation in Renaissance-Scrabble
2022-01-07 Matthias Baesken JDK-8273387 remove some unreferenced gtk-related functions
2022-01-06 Goetz Lindenmaier JDK-8279379 GHA: Print tests that are in error
2022-01-06 Goetz Lindenmaier JDK-8278824 Uneven work distribution when scanning heap roots in G1
2022-01-06 Goetz Lindenmaier JDK-8279225 [arm32] C1 longs comparison operation destroys argument registers
2022-01-06 Goetz Lindenmaier JDK-8278627 Shenandoah: TestHeapDump test failed
2022-01-05 Goetz Lindenmaier JDK-8278104 C1 should support the compiler directive 'BreakAtExecute'
2022-01-05 Christoph Langer JDK-8278239 vmTestbase/nsk/jvmti/RedefineClasses/StressRedefine failed with EXCEPTION_ACCESS_VIOLATION at 0x000000000000000d
2022-01-05 Christoph Langer JDK-8274465 Fix javax/swing/text/ParagraphView/6364882/bug6364882.java failures
2022-01-05 Goetz Lindenmaier JDK-8273972 Multi-core choke point in CMM engine (LCMSTransform.doTransform)
2022-01-05 Christoph Langer JDK-8278172 java/nio/channels/FileChannel/BlockDeviceSize.java should only run on Linux
2022-01-05 Christoph Langer JDK-8277342 vmTestbase/nsk/stress/strace/strace004.java fails with SIGSEGV in InstanceKlass::jni_id_for
2022-01-05 Christoph Langer JDK-8275800 Redefinition leaks MethodData::_extra_data_lock
2022-01-05 Christoph Langer JDK-8275326 C2: assert(no_dead_loop) failed: dead loop detected
2022-01-05 Christoph Langer JDK-8273933 [TESTBUG] Test must run without preallocated exceptions
2022-01-05 Christoph Langer JDK-8273634 [TEST_BUG] Improve javax/swing/text/ParagraphView/6364882/bug6364882.java
2022-01-05 Christoph Langer JDK-8239502 [TEST_BUG] Test javax/swing/text/FlowView/6318524/bug6318524.java never fails
2022-01-03 Goetz Lindenmaier JDK-8278987 RunThese24H.java failed with EXCEPTION_ACCESS_VIOLATION in __write_sample_info__
2022-01-03 Goetz Lindenmaier JDK-8277919 OldObjectSample event causing bloat in the class constant pool in JFR recording
2021-12-29 Goetz Lindenmaier JDK-8270874 JFrame paint artifacts when dragged from standard monitor to HiDPI monitor
2021-12-29 Goetz Lindenmaier JDK-8272167 AbsPathsInImage.java should skip *.dSYM directories
2021-12-27 Christoph Langer JDK-8278099 two sun/security/pkcs11/Signature tests failed with AssertionError
2021-12-27 Christoph Langer JDK-8277441 CompileQueue::add fails with assert(_last->next() == __null) failed: not last
2021-12-27 Christoph Langer JDK-8276623 JDK-8275650 accidentally pushed "out" file
2021-12-27 Christoph Langer JDK-8275610 C2: Object field load floats above its null check resulting in a segfault
2021-12-27 Christoph Langer JDK-8274714 Incorrect verifier protected access error message
2021-12-27 Christoph Langer JDK-8274658 ISO 4217 Amendment 170 Update
2021-12-27 Goetz Lindenmaier JDK-8277777 [Vector API] assert(r->is_XMMRegister()) failed: must be in x86_32.ad
2021-12-23 Goetz Lindenmaier JDK-8279011 JFR: JfrChunkWriter incorrectly handles int64_t chunk size as size_t
2021-12-23 Goetz Lindenmaier JDK-8278384 Bytecodes::result_type() for arraylength returns T_VOID instead of T_INT
2021-12-23 Goetz Lindenmaier JDK-8277328 jdk/jshell/CommandCompletionTest.java failures on Windows
2021-12-23 Goetz Lindenmaier JDK-8276662 Scalability bottleneck in SymbolTable::lookup_common()
2021-12-23 Goetz Lindenmaier JDK-8276314 [JVMCI] check alignment of call displacement during code installation
2021-12-23 Goetz Lindenmaier JDK-8274795 AArch64: avoid spilling and restoring r18 in macro assembler
2021-12-23 Goetz Lindenmaier JDK-8274130 C2: MulNode::Ideal chained transformations may act on wrong nodes
2021-12-22 Christoph Langer JDK-8273704 DrawStringWithInfiniteXform.java failed : drawString with InfiniteXform transform takes long time
2021-12-22 Christoph Langer JDK-8275650 Problemlist java/io/File/createTempFile/SpecialTempFile.java for Windows 11
2021-12-22 Goetz Lindenmaier JDK-8265150 AsyncGetCallTrace crashes on ResourceMark
2021-12-22 Goetz Lindenmaier JDK-8278116 runtime/modules/LoadUnloadModuleStress.java has duplicate -Xmx
2021-12-22 Goetz Lindenmaier JDK-8276177 nsk/jvmti/RedefineClasses/StressRedefineWithoutBytecodeCorruption failed with "assert(def_ik->is_being_redefined()) failed: should be being redefined to get here"
2021-12-22 Goetz Lindenmaier JDK-8247980 Exclusive execution of java/util/stream tests slows down tier1
2021-12-22 Goetz Lindenmaier JDK-8272327 Shenandoah: Avoid enqueuing duplicate string candidates
2021-12-21 Goetz Lindenmaier JDK-8277992 Add fast jdk_svc subtests to jdk:tier3
2021-12-21 Goetz Lindenmaier JDK-8278016 Add compiler tests to tier{2,3}
2021-12-21 Goetz Lindenmaier JDK-8278115 gc/stress/gclocker/TestGCLockerWithSerial.java has duplicate -Xmx
2021-12-21 Goetz Lindenmaier JDK-8225559 assertion error at TransTypes.visitApply
2021-12-20 Goetz Lindenmaier JDK-8269175 [macosx-aarch64] wrong CPU speed in hs_err file
2021-12-06 Robert Mckenna JDK-8277529 SIGSEGV in C2 CompilerThread Node::rematerialize() compiling Packet::readUnsignedTrint
2021-12-01 Robert Mckenna JDK-8277981 String Deduplication table is never cleaned up due to bad dead_factor_for_cleanup
2021-11-29 Robert Mckenna JDK-8275536 Add test to check that File::lastModified returns same time stamp as Files.getLastModifiedTime
2021-11-29 Robert Mckenna JDK-8274265 Suspicious string concatenation in logTestUtils.inline.hpp
2021-11-29 Robert Mckenna JDK-8277159 Fix java/nio/file/FileStore/Basic.java test by ignoring /run/user/* mount points
2021-11-25 Robert Mckenna JDK-8275720 CommonComponentAccessibility.createWithParent isWrapped causes mem leak
2021-11-24 Robert Mckenna JDK-8275863 Use encodeASCII for ASCII-compatible DoubleByte encodings
2021-11-24 Robert Mckenna JDK-8274242 Implement fast-path for ASCII-compatible CharsetEncoders on x86
2021-11-23 Robert Mckenna JDK-8272047 java/nio/channels/FileChannel/Transfer2GPlus.java failed with Unexpected transfer size: 2147418112
2021-11-23 Robert Mckenna JDK-8273678 TableAccessibility and TableRowAccessibility miss autorelease
2021-11-23 Robert Mckenna JDK-8272859 Javadoc external links should only have feature version number in URL
2021-11-23 Robert Mckenna JDK-8264297 Create implementation for NSAccessibilityProgressIndicator protocol peer
2021-11-23 Robert Mckenna JDK-8273895 compiler/ciReplay/TestVMNoCompLevel.java fails due to wrong data size with TieredStopAtLevel=2,3
2021-11-23 Robert Mckenna JDK-8275071 [macos] A11y cursor gets stuck when combobox is closed
2021-11-23 Robert Mckenna JDK-8275809 crash in [CommonComponentAccessibility getCAccessible:withEnv:]
2021-11-23 Robert Mckenna JDK-8275819 [TableRowAccessibility accessibilityChildren] method is ineffective
2021-11-23 Robert Mckenna JDK-8140241 (fc) Data transfer from FileChannel to itself causes hang in case of overlap
2021-11-23 Robert Mckenna JDK-8264293 Create implementation for NSAccessibilityMenu protocol peer
2021-11-23 Robert Mckenna JDK-8264294 Create implementation for NSAccessibilityMenuBar protocol peer
2021-11-23 Robert Mckenna JDK-8264295 Create implementation for NSAccessibilityMenuItem protocol peer
2021-11-23 Robert Mckenna JDK-8271323 [TESTBUG] serviceability/sa/ClhsdbCDSCore.java fails with -XX:TieredStopAtLevel=1
2021-11-23 Robert Mckenna JDK-8272095 ProblemList java/nio/channels/FileChannel/Transfer2GPlus.java on linux-aarch64
2021-11-23 Robert Mckenna JDK-8274716 JDWP Spec: the description for the Dispose command confuses suspend with resume.
2021-11-23 Robert Mckenna JDK-8274736 Concurrent read/close of SSLSockets causes SSLSessions to be invalidated unnecessarily
2021-11-23 Robert Mckenna JDK-8275426 PretouchTask num_chunks calculation can overflow
2021-11-23 Robert Mckenna JDK-8275811 Incorrect instance to dispose
2021-11-23 Robert Mckenna JDK-8276139 TestJpsHostName.java not reliable, better to expand HostIdentifierCreate.java test
2021-11-23 Robert Mckenna JDK-8276774 Cookie stored in CookieHandler not sent if user headers contain cookie
2021-11-23 Robert Mckenna JDK-8276927 [ppc64] Port shenandoahgc to linux on ppc64le
2021-11-23 Robert Mckenna JDK-8277093 Vector should throw ClassNotFoundException for a missing class of an element
2021-11-23 Robert Mckenna JDK-8277212 GC accidentally cleans valid megamorphic vtable inline caches
2021-11-23 Robert Mckenna JDK-8277385 Zero: Enable CompactStrings support
2021-11-19 Robert Mckenna JDK-8233020 (fs) UnixFileSystemProvider should use StaticProperty.userDir().
2021-11-19 Robert Mckenna JDK-8263364 sun/net/www/http/KeepAliveStream/KeepAliveStreamCloseWithWrongContentLength.java wedged in getInputStream
2021-11-19 Robert Mckenna JDK-8271071 accessibility of a table on macOS lacks cell navigation
2021-11-19 Robert Mckenna JDK-8271308 (fc) FileChannel.transferTo() transfers no more than Integer.MAX_VALUE bytes in one call
2021-11-19 Robert Mckenna JDK-8272170 Missing memory barrier when checking active state for regions
2021-11-19 Robert Mckenna JDK-8272854 split runtime/CommandLine/PrintTouchedMethods.java test
2021-11-19 Robert Mckenna JDK-8273235 tools/launcher/HelpFlagsTest.java Fails on Windows 32bit
2021-11-19 Robert Mckenna JDK-8274383 JNI call of getAccessibleSelection on a wrong thread
2021-11-19 Robert Mckenna JDK-8275586 Zero: Simplify interpreter initialization
2021-11-19 Robert Mckenna JDK-8275604 Zero: Reformat opclabels_data
2021-11-19 Robert Mckenna JDK-8275703 System.loadLibrary fails on Big Sur for libraries hidden from filesystem
2021-11-19 Robert Mckenna JDK-8276205 Shenandoah: CodeCache_lock should always be held for initializing code cache iteration
2021-11-19 Robert Mckenna JDK-8276306 jdk/jshell/CustomInputToolBuilder.java fails intermittently on storage acquisition
2021-11-19 Robert Mckenna JDK-8276801 gc/stress/CriticalNativeStress.java fails intermittently with Shenandoah
2021-11-19 Robert Mckenna JDK-8276805 java/awt/print/PrinterJob/CheckPrivilege.java fails due to disabled SecurityManager
2021-11-19 Robert Mckenna JDK-8276845 (fs) java/nio/file/spi/SetDefaultProvider.java fails on x86_32
2021-11-19 Robert Mckenna JDK-8276864 Update boot JDKs to 17.0.1 in GHA
2021-11-19 Robert Mckenna JDK-8276905 Use appropriate macosx_version_minimum value while compiling metal shaders
2021-11-19 Robert Mckenna JDK-8277029 JMM GetDiagnosticXXXInfo APIs should verify output array sizes
2021-11-19 Robert Mckenna JDK-8277224 sun.security.pkcs.PKCS9Attributes.toString() throws NPE
2021-11-18 Robert Mckenna JDK-8277195 missing CAccessibility definition in [CommonComponentAccessibility accessibilityHitTest]
2021-11-16 Robert Mckenna JDK-8262031 Create implementation for NSAccessibilityNavigableStaticText protocol
2021-11-16 Robert Mckenna JDK-8263059 security/infra/java/security/cert/CertPathValidator/certification/ComodoCA.java fails due to revoked cert
2021-11-16 Robert Mckenna JDK-8264286 Create implementation for NSAccessibilityColumn protocol peer
2021-11-16 Robert Mckenna JDK-8264287 Create implementation for NSAccessibilityComboBox protocol peer
2021-11-16 Robert Mckenna JDK-8264291 Create implementation for NSAccessibilityCell protocol peer
2021-11-16 Robert Mckenna JDK-8264292 Create implementation for NSAccessibilityList protocol peer
2021-11-16 Robert Mckenna JDK-8264298 Create implementation for NSAccessibilityRow protocol peer
2021-11-16 Robert Mckenna JDK-8264303 Create implementation for NSAccessibilityTabGroup protocol peer
2021-11-16 Robert Mckenna JDK-8267385 Create NSAccessibilityElement implementation for JavaComponentAccessibility
2021-11-16 Robert Mckenna JDK-8267387 Create implementation for NSAccessibilityOutline protocol
2021-11-16 Robert Mckenna JDK-8267388 Create implementation for NSAccessibilityTable protocol
2021-11-16 Robert Mckenna JDK-8268882 C2: assert(n->outcnt() != 0 || C->top() == n || n->is_Proj()) failed: No dead instructions after post-alloc
2021-11-16 Robert Mckenna JDK-8271315 Redo: Nimbus JTree renderer properties persist across L&F changes
2021-11-16 Robert Mckenna JDK-8272369 java/io/File/GetXSpace.java failed with "RuntimeException: java.nio.file.NoSuchFileException: /run/user/0"
2021-11-16 Robert Mckenna JDK-8273486 Zero: Handle DiagnoseSyncOnValueBasedClasses VM option
2021-11-16 Robert Mckenna JDK-8275849 TestZoneInfo310.java fails with tzdata2021e
2021-11-16 Robert Mckenna JDK-8276105 C2: Conv(D|F)2(I|L)Nodes::Ideal should handle rounding correctly
2021-11-16 Robert Mckenna JDK-8276536 Update TimeZoneNames files to follow the changes made by JDK-8275766
2021-11-16 Robert Mckenna JDK-8276846 JDK-8273416 is incomplete for UseSSE=1
2021-11-16 Robert Mckenna JDK-8276854 Windows GHA builds fail due to broken Cygwin
2021-11-15 Robert Mckenna JDK-8268294 Reusing HttpClient in a WebSocket.Listener hangs.
2021-11-15 Robert Mckenna JDK-8269481 SctpMultiChannel never releases own file descriptor
2021-11-15 Robert Mckenna JDK-8268860 Windows-Aarch64 build is failing in GitHub actions
2021-11-15 Robert Mckenna JDK-8274521 jdk/jfr/event/gc/detailed/TestGCLockerEvent.java fails when other GC is selected
2021-11-15 Robert Mckenna JDK-8276112 Inconsistent scalar replacement debug info at safepoints
2021-11-15 Robert Mckenna JDK-8276157 C2: Compiler stack overflow during escape analysis on Linux x86_32
2021-11-12 Robert Mckenna JDK-8261495 Shenandoah: reconsider update references memory ordering
2021-11-12 Robert Mckenna JDK-8268927 Windows: link error: unresolved external symbol "int __cdecl convert_to_unicode(char const *,wchar_t * *)"
2021-11-12 Robert Mckenna JDK-8273416 C2: assert(false) failed: bad AD file after JDK-8252372 with UseSSE={0,1}
2021-11-12 Robert Mckenna JDK-8274560 JFR: Add test for OldObjectSample event when using Shenandoah
2021-11-12 Robert Mckenna JDK-8274606 Fix jaxp/javax/xml/jaxp/unittest/transform/SurrogateTest.java test
2021-11-12 Robert Mckenna JDK-8274942 AssertionError at jdk.compiler/com.sun.tools.javac.util.Assert.error(Assert.java:155)
2021-11-12 Robert Mckenna JDK-8275226 Shenandoah: Relax memory constraint for worker claiming tasks/ranges
2021-11-10 Robert Mckenna JDK-8261579 AArch64: Support for weaker memory ordering in Atomic
2021-11-09 Robert Mckenna JDK-8238649 Call new Win32 API SetThreadDescription in os::set_native_thread_name
2021-11-09 Robert Mckenna JDK-8276550 Use SHA256 hash in build.tools.depend.Depend
2021-11-09 Robert Mckenna JDK-8270533 AArch64: size_fits_all_mem_uses should return false if its output is a CAS
2021-11-09 Robert Mckenna JDK-8271895 UnProblemList javax/swing/JComponent/7154030/bug7154030.java in JDK18
2021-11-09 Robert Mckenna JDK-8273026 Slow LoginContext.login() on multi threading application
2021-11-09 Robert Mckenna JDK-8273450 Fix the copyright header of SVML files
2021-11-09 Robert Mckenna JDK-8274522 java/lang/management/ManagementFactory/MXBeanException.java test fails with Shenandoah
2021-11-09 Robert Mckenna JDK-8274523 java/lang/management/MemoryMXBean/MemoryTest.java test should handle Shenandoah
2021-11-09 Robert Mckenna JDK-8275666 serviceability/jvmti/GetObjectSizeClass.java shouldn't have vm.flagless
2021-11-09 Robert Mckenna JDK-8275872 Sync J2DBench run and analyze Makefile targets with build.xml
2021-11-09 Robert Mckenna JDK-8276025 Hotspot's libsvml.so may conflict with user dependency
2021-11-09 Robert Mckenna JDK-8276201 Shenandoah: Race results degenerated GC to enter wrong entry point
2021-11-09 Robert Mckenna JDK-8276572 Fake libsyslookup.so library causes tooling issues
2021-11-05 David Buck JDK-8274338 com/sun/jdi/RedefineCrossEvent.java failed "assert(m != __null) failed: NULL mirror"
2021-11-05 David Buck JDK-8272345 macos doesn't check `os::set_boot_path()` result
2021-11-05 David Buck JDK-8273021 C2: Improve Add and Xor ideal optimizations
2021-11-05 David Buck JDK-8270901 Typo PHASE_CPP in CompilerPhaseType
2021-11-05 David Buck JDK-8269269 [macos11] SystemIconTest fails with ClassCastException
2021-11-05 David Buck JDK-8268457 XML Transformer outputs Unicode supplementary character incorrectly to HTML
2021-11-05 David Buck JDK-4819544 SwingSet2 JTable Demo throws NullPointerException
2021-11-05 David Buck JDK-8266510 Nimbus JTree default tree cell renderer does not use selected text color
2021-11-05 David Buck JDK-8268284 javax/swing/JComponent/7154030/bug7154030.java fails with "Exception: Failed to hide opaque button"
2021-11-05 David Buck JDK-8268361 Fix the infinite loop in next_line
2021-11-05 David Buck JDK-8268464 Remove dependancy of TestHttpsServer, HttpTransaction, HttpCallback from open/test/jdk/sun/net/www/protocol/https/ tests
2021-11-05 David Buck JDK-8268626 Remove native pre-jdk9 support for jtreg failure handler
2021-11-05 David Buck JDK-8269216 Useless initialization in com/sun/crypto/provider/PBES2Parameters.java
2021-11-05 David Buck JDK-8269637 javax/swing/JFileChooser/FileSystemView/SystemIconTest.java fails on windows
2021-11-05 David Buck JDK-8270290 NTLM authentication fails if HEAD request is used
2021-11-05 David Buck JDK-8271567 AArch64: AES Galois CounterMode (GCM) interleaved implementation using vector instructions
2021-11-05 David Buck JDK-8272114 Unused _last_state in osThread_windows
2021-11-05 David Buck JDK-8276066 Reset LoopPercentProfileLimit for x86 due to suboptimal performance
2021-11-02 Robert Mckenna JDK-8275766 (tz) Update Timezone Data to 2021e
2021-11-01 David Buck JDK-8274501 c2i entry barriers read int as long on AArch64
2021-10-30 David Buck JDK-8273595 tools/jpackage tests do not work on apt-based Linux distros like Debian
2021-10-30 David Buck JDK-8274848 LambdaMetaFactory::metafactory on REF_invokeSpecial impl method has incorrect behavior
2021-10-30 David Buck JDK-8275302 unexpected compiler error: cast, intersection types and sealed
2021-10-29 David Buck JDK-8276130 Fix Github Actions of JDK17u to account for update version scheme
2021-10-29 David Buck JDK-8276122 Change openjdk project in jcheck to jdk-updates
2021-10-26 David Buck JDK-8190753 (zipfs): Accessing a large entry (> 2^31 bytes) leads to a negative initial size for ByteArrayOutputStream
2021-10-26 David Buck JDK-8275104 IR framework does not handle client VM builds correctly
2021-10-26 Robert Mckenna JDK-8274779 HttpURLConnection: HttpClient and HttpsClient incorrectly check request method when set to POST
2021-10-22 David Buck JDK-8275145 file.encoding system property has an incorrect value on Windows
2021-10-21 David Buck JDK-8270946 X509CertImpl.getFingerprint should not return the empty String
2021-10-21 David Buck JDK-8274205 Handle KDC_ERR_SVC_UNAVAILABLE error code from KDC
2021-10-21 David Buck JDK-8251329 (zipfs) Files.walkFileTree walks infinitely if zip has dir named "." inside
2021-10-19 David Buck JDK-8274851 [ppc64] Port zgc to linux on ppc64le
2021-10-17 David Buck JDK-8275131 Exceptions after a touchpad gesture on macOS
2021-10-17 David Buck JDK-8271855 [TESTBUG] Wrong weakCompareAndSet assumption in UnsafeIntrinsicsTest
2021-10-17 David Buck JDK-8273614 Shenandoah: intermittent timeout with ConcurrentGCBreakpoint tests
2021-10-17 David Buck JDK-8274347 Passing a *nested* switch expression as a parameter causes an NPE during compile
2021-10-17 David Buck JDK-8274401 C2: GraphKit::load_array_element bypasses Access API
2021-10-17 David Buck JDK-8274550 c2i entry barriers read int as long on PPC
2021-10-17 David Buck JDK-8274770 [PPC64] resolve_jobject needs a generic implementation to support load barriers
2021-10-17 David Buck JDK-8274773 [TESTBUG] UnsafeIntrinsicsTest intermittently fails on weak memory model platform
2021-10-17 David Buck JDK-8275049 [ZGC] missing null check in ZNMethod::log_register
2021-10-17 David Buck JDK-8275051 Shenandoah: Correct ordering of requested gc cause and gc request flag
2021-10-15 David Buck JDK-8174819 java/nio/file/WatchService/LotsOfEvents.java fails intermittently
2021-10-14 David Buck JDK-8273505 runtime/cds/appcds/loaderConstraints/DynamicLoaderConstraintsTest.java#default-cl crashed with SIGSEGV in MetaspaceShared::link_shared_classes
2021-10-14 David Buck JDK-8274840 Update OS detection code to recognize Windows 11
2021-10-13 David Buck JDK-8274407 (tz) Update Timezone Data to 2021c
2021-10-12 David Buck JDK-8273808 Cleanup AddFontsToX11FontPath
2021-10-12 David Buck JDK-8273965 some testlibrary_tests/ir_framework tests fail when c1 disabled
2021-10-12 David Buck JDK-8137101 [TEST_BUG] javax/swing/plaf/basic/BasicHTML/4251579/bug4251579.java failure due to timing
2021-10-12 David Buck JDK-8269656 The test test/langtools/tools/javac/versions/Versions.java has duplicate test cycles
2021-10-12 David Buck JDK-8274293 Build failure on macOS with Xcode 13.0 as vfork is deprecated
2021-10-12 David Buck JDK-8267256 Extend minimal retry for loopback connections on Windows to PlainSocketImpl
2021-10-12 David Buck JDK-8275008 gtest build failure due to stringop-overflow warning with gcc11
2021-10-12 David Buck JDK-8270517 Add Zero support for LoongArch
2021-10-11 David Buck JDK-8272562 C2: assert(false) failed: Bad graph detected in build_loop_late
2021-10-11 David Buck JDK-8273234 extended 'for' with expression of type tvar causes the compiler to crash
2021-10-11 David Buck JDK-8273575 memory leak in appendBootClassPath(), paths must be deallocated
2021-10-11 David Buck JDK-8274145 C2: condition incorrectly made redundant with dominating main loop exit condition
2021-10-11 David Buck JDK-8274381 missing CAccessibility definitions in JNI code
2021-10-11 Tobias Hartmann JDK-8271459 C2: Missing NegativeArraySizeException when creating StringBuilder with negative capacity
2021-10-11 David Buck JDK-8274406 RunThese30M.java failed "assert(!LCA_orig->dominates(pred_block) || early->dominates(pred_block)) failed: early is high enough"
2021-10-11 David Buck JDK-8273176 handle latest VS2019 in abstract_vm_version
2021-10-11 David Buck JDK-8273790 Potential cyclic dependencies between Gregorian and CalendarSystem
2021-10-09 David Buck JDK-8271142 package help is not displayed for missing X11/extensions/Xrandr.h
2021-10-09 David Buck JDK-8274325 C4819 warning at vm_version_x86.cpp on Windows after JDK-8234160
2021-10-09 David Buck JDK-8274329 Fix non-portable HotSpot code in MethodMatcher::parse_method_pattern
2021-10-08 David Buck JDK-8274642 jdk/jshell/CommandCompletionTest.java fails with NoSuchElementException after JDK-8271287
2021-10-08 David Buck JDK-8273826 Correct Manifest file name and NPE checks
2021-10-07 David Buck JDK-8268885 duplicate checkcast when destination type is not first type of intersection type
2021-10-07 David Buck JDK-8269113 Javac throws when compiling switch (null)
2021-10-07 David Buck JDK-8273229 Update OS detection code to recognize Windows Server 2022
2021-10-06 David Buck JDK-8272856 DoubleFlagWithIntegerValue uses G1GC-only flag
2021-10-06 David Buck JDK-8273342 Null pointer dereference in classFileParser.cpp:2817
2021-10-06 David Buck JDK-8273489 Zero: Handle UseHeavyMonitors on all monitorenter paths
2021-10-06 David Buck JDK-8273695 Safepoint deadlock on VMOperation_lock
2021-10-05 David Buck JDK-8262095 NPE in Flow$FlowAnalyzer.visitApply: Cannot invoke getThrownTypes because tree.meth.type is null
2021-10-05 David Buck JDK-8274562 (fs) UserDefinedFileAttributeView doesn't correctly determine if supported when using OverlayFS
2021-10-05 David Buck JDK-8272703 StressSeed should be set via FLAG_SET_ERGO
2021-10-05 David Buck JDK-8274349 ForkJoinPool.commonPool() does not work with 1 CPU
2021-10-04 David Buck JDK-8272846 Move some runtime/Metaspace/elastic/ tests out of tier1
2021-10-04 David Buck JDK-8273314 Add tier4 test groups
2021-10-04 David Buck JDK-8273376 Zero: Disable vtable/itableStub gtests
2021-10-04 David Buck JDK-8273487 Zero: Handle "zero" variant in runtime tests
2021-10-04 David Buck JDK-8274083 Update testing docs to mention tiered testing
2021-10-03 David Buck JDK-8273361 InfoOptsTest is failing in tier1
2021-10-02 David Buck JDK-8272836 Limit run time for java/lang/invoke/LFCaching tests
2021-10-02 David Buck JDK-8272914 Create hotspot:tier2 and hotspot:tier3 test groups
2021-10-02 David Buck JDK-8273315 Parallelize and increase timeouts for java/foreign/TestMatrix.java test
2021-10-02 David Buck JDK-8273318 Some containers/docker/TestJFREvents.java configs are running out of memory
2021-10-02 David Buck JDK-8273333 Zero should warn about unimplemented -XX:+LogTouchedMethods
2021-10-02 David Buck JDK-8273335 compiler/blackhole tests should not run with interpreter-only VMs
2021-10-02 David Buck JDK-8273373 Zero: Cannot invoke JVM in primordial threads on Zero
2021-10-02 David Buck JDK-8273440 Zero: Disable runtime/Unsafe/InternalErrorTest.java
2021-10-02 David Buck JDK-8273483 Zero: Clear pending JNI exception check in native method handler
2021-10-02 David Buck JDK-8273606 Zero: SPARC64 build fails with si_band type mismatch
2021-10-02 David Buck JDK-8273806 compiler/cpuflags/TestSSE4Disabled.java should test for CPU feature explicitly
2021-10-02 David Buck JDK-8273807 Zero: Drop incorrect test block from compiler/startup/NumCompilerThreadsCheck.java
2021-10-02 David Buck JDK-8273894 ConcurrentModificationException raised every time ReferralsCache drops referral
2021-10-02 David Buck JDK-8274435 EXCEPTION_ACCESS_VIOLATION in BFSClosure::closure_impl
2021-10-01 David Buck JDK-8271287 jdk/jshell/CommandCompletionTest.java fails with "lists don't have the same size expected"
2021-10-01 David Buck JDK-8273378 Shenandoah: Remove the remaining uses of os::is_MP
2021-09-30 David Buck JDK-8266239 Some duplicated javac command-line options have repeated effect
2021-09-30 David Buck JDK-8273887 [macos] java/awt/color/ICC_ColorSpace/MTTransformReplacedProfile.java timed out
2021-09-30 David Buck JDK-8273935 (zipfs) Files.getFileAttributeView() throws UOE instead of returning null when view not supported
2021-09-30 David Buck JDK-8274326 [macos] Ensure initialisation of sun/lwawt/macosx/CAccessibility in JavaComponentAccessibility.m
2021-09-29 David Buck JDK-8273498 compiler/c2/Test7179138_1.java timed out
2021-09-29 David Buck JDK-8271170 Add unit test for what jpackage app launcher puts in the environment
2021-09-29 David Buck JDK-8271254 javac generates unreachable code when using empty semicolon statement
2021-09-29 David Buck JDK-8272328 java.library.path is not set properly by Windows jpackage app launcher
2021-09-29 David Buck JDK-8273135 java/awt/color/ICC_ColorSpace/MTTransformReplacedProfile.java crashes in liblcms.dylib with NULLSeek+0x7
2021-09-29 David Buck JDK-8273408 java.lang.AssertionError: typeSig ERROR on generated class property of record
2021-09-28 David Buck JDK-8273278 Support XSLT on GraalVM Native Image--deterministic bytecode generation in XSLT
2021-09-28 David Buck JDK-8223923 C2: Missing interference with mismatched unsafe accesses
2021-09-28 David Buck JDK-8244675 assert(IncrementalInline || (_late_inlines.length() == 0 && !has_mh_late_inlines()))
2021-09-28 David Buck JDK-8268894 forged ASTs can provoke an AIOOBE at com.sun.tools.javac.jvm.ClassWriter::writePosition
2021-09-28 David Buck JDK-8270886 Crash in PhaseIdealLoop::verify_strip_mined_scheduling
2021-09-28 David Buck JDK-8271340 Crash PhaseIdealLoop::clone_outer_loop
2021-09-28 David Buck JDK-8271341 Opcode() != Op_If && Opcode() != Op_RangeCheck) || outcnt() == 2 assert failure with Test7179138_1.java
2021-09-28 David Buck JDK-8271600 C2: CheckCastPP which should closely follow Allocate is sunk of a loop
2021-09-28 David Buck JDK-8271718 Crash when during color transformation the color profile is replaced
2021-09-28 David Buck JDK-8271954 C2: assert(false) failed: Bad graph detected in build_loop_late
2021-09-28 David Buck JDK-8272413 Incorrect num of element count calculation for vector cast
2021-09-28 David Buck JDK-8272570 C2: crash in PhaseCFG::global_code_motion
2021-09-28 David Buck JDK-8272574 C2: assert(false) failed: Bad graph detected in build_loop_late
2021-09-28 David Buck JDK-8273165 GraphKit::combine_exception_states fails with "matching stack sizes" assert
2021-09-28 David Buck JDK-8273359 CI: ciInstanceKlass::get_canonical_holder() doesn't respect instance size
2021-09-28 David Buck JDK-8273924 ArrayIndexOutOfBoundsException thrown in java.util.JapaneseImperialCalendar.add()
2021-09-28 David Buck JDK-8273961 jdk/nio/zipfs/ZipFSTester.java fails if file path contains '+' character
2021-09-28 David Buck JDK-8274074 SIGFPE with C2 compiled code with -XX:+StressGCM
2021-09-27 David Buck JDK-8268893 jcmd to trim the glibc heap
2021-09-27 David Buck JDK-8269850 Most JDK releases report macOS version 12 as 10.16 instead of 12.0
2021-09-27 David Buck JDK-8270116 Expand ButtonGroupLayoutTraversalTest.java to run in all LaFs, including Aqua on macOS
2021-09-27 David Buck JDK-8273351 bad tag in jdk.random module-info.java
2021-09-27 David Buck JDK-8273375 Remove redundant 'new String' calls after concatenation in java.desktop
2021-09-27 David Buck JDK-8273451 Remove unreachable return in mutexLocker::wait
2021-09-27 David Buck JDK-8273638 javax/swing/JTable/4235420/bug4235420.java fails in GTK L&F
2021-09-27 David Buck JDK-8273646 Add openssl from path variable also in to Default System Openssl Path in OpensslArtifactFetcher
2021-09-27 David Buck JDK-8273902 Memory leak in OopStorage due to bug in OopHandle::release()
2021-09-27 David Buck JDK-8273958 gtest/MetaspaceGtests executes unnecessary tests in debug builds
2021-09-27 David Buck JDK-8274056 JavaAccessibilityUtilities leaks JNI objects
2021-09-27 David Buck JDK-8274087 Windows DLL path not set correctly.
2021-09-20 Robert Mckenna JDK-8261236 C2: ClhsdbJstackXcompStress test fails when StressGCM is enabled
2021-09-20 Robert Mckenna JDK-8263375 Support stack watermarks in Zero VM
2021-09-20 Robert Mckenna JDK-8271605 Update JMH devkit to 1.32
2021-09-20 Robert Mckenna JDK-8271862 C2 intrinsic for Reference.refersTo() is often not used
2021-09-20 Robert Mckenna JDK-8272318 Improve performance of HeapDumpAllTest
2021-09-20 Robert Mckenna JDK-8272342 [TEST_BUG] java/awt/print/PrinterJob/PageDialogMarginTest.java catches all exceptions
2021-09-20 Robert Mckenna JDK-8272838 Move CriticalJNI tests out of tier1
2021-09-20 Robert Mckenna JDK-8272850 Drop zapping values in the Zap* option descriptions
2021-09-20 Robert Mckenna JDK-8272970 Parallelize runtime/InvocationTests/
2021-09-20 Robert Mckenna JDK-8273162 AbstractSplittableWithBrineGenerator does not create a random salt
2021-09-20 Robert Mckenna JDK-8273514 java/util/DoubleStreamSums/CompensatedSums.java failure
2021-09-14 Robert Mckenna JDK-8273358 macOS Monterey does not have the font Times needed by Serif
2021-09-11 Robert Mckenna JDK-8269687 pauth_aarch64.hpp include name is incorrect
2021-09-11 Robert Mckenna JDK-8271490 [ppc] [s390]: Crash in JavaThread::pd_get_top_frame_for_profiling
2021-09-10 Andy Herrick JDK-8273593 [REDO] Warn user when using mac-sign option with unsigned app-image.
2021-09-08 Robert Mckenna JDK-8272973 Incorrect compile command used by TestIllegalArrayCopyBeforeInfiniteLoop
2021-09-08 Robert Mckenna JDK-8214761 Bug in parallel Kahan summation implementation
2021-09-08 Robert Mckenna JDK-8269031 linux x86_64 check for binutils 2.25 or higher after 8265783
2021-09-08 Robert Mckenna JDK-8270110 Shenandoah: Add test for JDK-8269661
2021-09-08 Robert Mckenna JDK-8270171 Shenandoah: Cleanup TestStringDedup and TestStringDedupStress tests
2021-09-08 Robert Mckenna JDK-8270317 Large Allocation in CipherSuite
2021-09-08 Robert Mckenna JDK-8271121 ZGC: stack overflow (segv) when -Xlog:gc+start=debug
2021-09-08 Robert Mckenna JDK-8271560 sun/security/ssl/DHKeyExchange/LegacyDHEKeyExchange.java still fails due to "An established connection was aborted by the software in your host machine"
2021-09-08 Robert Mckenna JDK-8271868 Warn user when using mac-sign option with unsigned app-image.
2021-09-08 Robert Mckenna JDK-8272473 Parsing epoch seconds at a DST transition with a non-UTC parser is wrong
2021-09-08 Robert Mckenna JDK-8272639 jpackaged applications using microphone on mac
2021-09-08 Robert Mckenna JDK-8272783 Epsilon: Refactor tests to improve performance
2021-09-01 Robert Mckenna JDK-8273150 Revert "8225083: Remove Google certificate that is expiring in December 2021"
2021-08-28 Robert Mckenna JDK-8269951 [macos] Focus not painted in JButton when setBorderPainted(false) is invoked
2021-08-28 Robert Mckenna JDK-8269993 [Test]: java/net/httpclient/DigestEchoClientSSL.java contains redundant @run tags
2021-08-28 Robert Mckenna JDK-8271215 Fix data races in G1PeriodicGCTask
2021-08-28 Robert Mckenna JDK-8272305 several hotspot runtime/modules don't check exit codes
2021-08-28 Robert Mckenna JDK-8272335 runtime/cds/appcds/MoveJDKTest.java doesn't check exit codes
2021-08-28 Robert Mckenna JDK-8272391 Undeleted debug information
2021-08-28 Robert Mckenna JDK-8272720 Fix the implementation of loop unrolling heuristic with LoopPercentProfileLimit
2021-08-28 Robert Mckenna JDK-8272866 java.util.random package summary contains incorrect mixing function in table
2021-08-26 Robert Mckenna JDK-8266182 Automate manual steps listed in the test jdk/sun/security/pkcs12/ParamsTest.java
2021-08-26 Robert Mckenna JDK-8269934 RunThese24H.java failed with EXCEPTION_ACCESS_VIOLATION in java_lang_Thread::get_thread_status
2021-08-26 Robert Mckenna JDK-8272581 sun/security/pkcs11/Provider/MultipleLogins.sh fails after JDK-8266182
2021-08-26 Robert Mckenna JDK-8272806 [macOS] "Apple AWT Internal Exception" when input method is changed
2021-08-24 Robert Mckenna JDK-8269897 Shenandoah: Resolve UNKNOWN access strength, where possible
2021-08-24 Robert Mckenna JDK-8270344 Session resumption errors
2021-08-24 Robert Mckenna JDK-8272700 [macos] Build failure with Xcode 13.0 after JDK-8264848
2021-08-23 Robert Mckenna JDK-8268019 C2: assert(no_dead_loop) failed: dead loop detected
2021-08-23 Robert Mckenna JDK-8268963 [IR Framework] Some default regexes matching on PrintOptoAssembly in IRNode.java do not work on all platforms
2021-08-23 Robert Mckenna JDK-8269280 (bf) Replace StringBuffer in *Buffer.toString()
2021-08-23 Robert Mckenna JDK-8270098 ZGC: ZBarrierSetC2::clone_at_expansion fails with "Guard against surprises" assert
2021-08-23 Robert Mckenna JDK-8270137 Kerberos Credential Retrieval from Cache not Working in Cross-Realm Setup
2021-08-23 Robert Mckenna JDK-8271203 C2: assert(iff->Opcode() == Op_If || iff->Opcode() == Op_CountedLoopEnd || iff->Opcode() == Op_RangeCheck) failed: Check this code when new subtype is added
2021-08-23 Robert Mckenna JDK-8271276 C2: Wrong JVM state used for receiver null check
2021-08-23 Robert Mckenna JDK-8271925 ZGC: Arraycopy stub passes invalid oop to load barrier
2021-08-23 Robert Mckenna JDK-8272131 PhaseMacroExpand::generate_slow_arraycopy crash when clone null CallProjections.fallthrough_ioproj
2021-08-23 Robert Mckenna JDK-8272472 StackGuardPages test doesn't build with glibc 2.34
2021-08-23 Robert Mckenna JDK-8269924 Shenandoah: Introduce weak/strong marking asserts
2021-08-20 Robert Mckenna JDK-8269478 Shenandoah: gc/shenandoah/mxbeans tests should be more resilient
2021-08-20 Robert Mckenna JDK-8270094 Shenandoah: Provide human-readable labels for test configurations
2021-08-20 Robert Mckenna JDK-8270096 Shenandoah: Optimize gc/shenandoah/TestRefprocSanity.java for interpreter mode
2021-08-20 Robert Mckenna JDK-8272326 java/util/Random/RandomTestMoments.java had two Gaussian fails
2021-08-20 Robert Mckenna JDK-8272602 [macOS] not all KEY_PRESSED events sent when control modifier is used
2021-08-20 Robert Mckenna JDK-8272708 [Test]: Cleanup: test/jdk/security/infra/java/security/cert/CertPathValidator/certification/BuypassCA.java no longer needs ocspEnabled
2021-08-18 Robert Mckenna JDK-8225083 Remove Google certificate that is expiring in December 2021
2021-08-18 Robert Mckenna JDK-8243543 jtreg test security/infra/java/security/cert/CertPathValidator/certification/BuypassCA.java fails
2021-08-18 Robert Mckenna JDK-8248899 security/infra/java/security/cert/CertPathValidator/certification/QuoVadisCA.java fails, Certificate has been revoked
2021-08-18 Robert Mckenna JDK-8270280 security/infra/java/security/cert/CertPathValidator/certification/LetsEncryptCA.java OCSP response error
2021-08-13 Robert Mckenna JDK-8272332 --with-harfbuzz=system doesn't add -lharfbuzz after JDK-8255790
2021-08-11 Robert Mckenna JDK-8271589 Fatal error with variable shift count integer rotate operation.
2021-08-11 Robert Mckenna JDK-8271722 [TESTBUG] gc/g1/TestMixedGCLiveThreshold.java can fail if G1 Full GC uses >1 workers
2021-08-06 Robert Mckenna JDK-8261088 Repeatable annotations without @Target cannot have containers that target module declarations
2021-08-06 Robert Mckenna JDK-8268427 Improve AlgorithmConstraints:checkAlgorithm performance
2021-08-04 Robert Mckenna JDK-8225082 Remove IdenTrust certificate that is expiring in September 2021
2021-08-04 Robert Mckenna JDK-8267625 AARCH64: typo in LIR_Assembler::emit_profile_type
2021-08-04 Robert Mckenna JDK-8269851 OperatingSystemMXBean getProcessCpuLoad reports incorrect process cpu usage in containers
2021-08-02 Robert Mckenna JDK-8268261 C2: assert(n != __null) failed: Bad immediate dominator info.
2021-08-02 Robert Mckenna JDK-8269574 C2: Avoid redundant uncommon traps in GraphKit::builtin_throw() for JVMTI exception events
2021-07-23 Robert Mckenna JDK-8267666 Add option to jcmd GC.heap_dump to use existing file
2021-07-23 Robert Mckenna JDK-8269882 stack-use-after-scope in NewObjectA
2021-07-15 Robert Mckenna JDK-8263531 Remove unused buffer int
2021-07-15 Robert Mckenna JDK-8262731 [macOS] Exception from "Printable.print" is swallowed during "PrinterJob.print"