LABEL HISTORY REPORT: jdk8u-fix-request

Report generated: Thu Sep 16 01:24:34 CEST 2021

Date Added Added By Bug Synopsis
2021-09-10 Vladimir Kempik JDK-8226806 [macOS 10.14] Methods of Java Robot should be called from appropriate thread
2021-09-08 Paul Hohensee JDK-8237499 JFR: Include stack trace in the ThreadStart event
2021-09-08 Paul Hohensee JDK-8239886 Minimal VM build fails after JDK-8237499
2021-09-08 Alex Kasko JDK-8140472 java/net/ipv6tests/TcpTest.java failed intermittently with java.net.BindException: Address already in use: NET_Bind
2021-09-08 Alex Kasko JDK-8177536 Avoid Apple Peer-to-Peer interfaces in networking tests
2021-09-06 Alexey Bakhtin JDK-8176837 SunPKCS11 provider needs to check more details on PKCS11 Mechanism
2021-08-27 Severin Gehwolf JDK-8272124 Cgroup v1 initialization causes NullPointerException when cgroup path contains colon
2021-08-26 Sergey Bylokhov JDK-8231438 [macOS] Dark mode for the desktop is not supported
2021-08-25 Paul Hohensee JDK-8134869 AARCH64: GHASH intrinsic is not optimal
2021-08-25 Paul Hohensee JDK-8131062 aarch64: add support for GHASH acceleration
2021-08-23 Zhengyu Gu JDK-8190793 Httpserver does not detect truncated request body
2021-08-20 Zhengyu Gu JDK-6801613 Cross-platform pageDialog and printDialog top margin entry broken
2021-08-20 Aleksey Shipilev JDK-8272714 [8u] Build failure after backport of JDK-8248901 with MSVC 2013
2021-08-16 Jonathan Dowland JDK-8183369 RFC unconformity of HttpURLConnection with proxy
2021-08-16 Andrew Hughes JDK-8272214 [8u] Build failure after backport of JDK-8248901
2021-08-11 Martin Balao JDK-8270137 Kerberos Credential Retrieval from Cache not Working in Cross-Realm Setup
2021-08-09 Aleksey Shipilev JDK-8269859 BacktraceBuilder._cprefs needs to be accessed as unsigned short
2021-08-09 Fei Yang JDK-8150669 C1 intrinsic for Class.isPrimitive
2021-08-06 Paul Hohensee JDK-8220786 Create new switch to redirect error reporting output to stdout or stderr
2021-08-06 Sergey Bylokhov JDK-8237495 Java MIDI fails with a dereferenced memory error when asked to send a raw 0xF7
2021-08-05 Zhengyu Gu JDK-8202788 Explicitly reclaim cached thread-local direct buffers at thread exit
2021-07-30 Jie Fu JDK-8271466 [jdk8u] StackGap test fails on aarch64 due to "-m64"
2021-07-29 Jonathan Dowland JDK-8244154 Update SunPKCS11 provider with PKCS11 v3.0 header files
2021-07-29 Jonathan Dowland JDK-8177393 Result of RescaleOp for 4BYTE_ABGR images may be 25% black
2021-07-28 Paul Hohensee JDK-8182036 Load from initializing arraycopy uses wrong memory state
2021-07-27 Dongbo He JDK-8254967 com.sun.net.HttpsServer spins on TLS session close
2021-07-23 Alexey Bakhtin JDK-8268965 TCP Connection Reset when connecting simple socket to SSL server
2021-07-21 Jonathan Dowland JDK-8187450 JNI local refs exceeds capacity warning in NetworkInterface::getAll
2021-07-19 Jonathan Dowland JDK-8262731 [macOS] Exception from "Printable.print" is swallowed during "PrinterJob.print"
2021-07-13 Zhengyu Gu JDK-8269882 stack-use-after-scope in NewObjectA
2021-07-13 Zhengyu Gu JDK-8247766 AArch64: guarantee(val < (1U << nbits)) failed: Field too big for insn
2021-07-09 Zhengyu Gu JDK-6847157 java.lang.NullPointerException: HDC for component at sun.java2d.loops.Blit.Blit
2021-07-08 Jonathan Dowland JDK-8161016 Strange behavior of URLConnection with proxy
2021-07-08 Hui Shi JDK-8266206 Build failure after JDK-8264752 with older GCCs
2021-07-07 Aleksey Shipilev JDK-8269953 config.log is not in build directory after 8u backport of JDK-8079891
2021-07-06 Aleksey Shipilev JDK-8265978 make test should look for more locations when searching for exit code
2021-07-06 Aleksey Shipilev JDK-8079891 Store configure log in $BUILD/configure.log
2021-07-06 Aleksey Shipilev JDK-8080082 configure fails if you create an empty directory and then run configure from it
2021-07-06 Severin Gehwolf JDK-8259338 Add expiry exception for identrustdstx3 alias to VerifyCACerts.java test
2021-07-06 Aleksey Shipilev JDK-8065215 Print warning summary at end of configure
2021-07-05 Severin Gehwolf JDK-8269810 [8u] Update generated_configure.sh after JDK-8250876 backport
2021-07-05 Aleksey Shipilev JDK-8194246 JVM crashes when calling getStackTrace if stack contains a method that is a member of a very large class
2021-07-01 Zhengyu Gu JDK-8269594 assert(_handle_mark_nesting > 1) failed: memory leak: allocating handle outside HandleMark
2021-07-01 Alan Hayward JDK-8266749 AArch64: Backtracing broken on PAC enabled systems
2021-06-28 Zhengyu Gu JDK-8004148 NPE in sun.awt.SunToolkit.getWindowDeactivationTime
2021-06-25 Zhengyu Gu JDK-8166673 The new implementation of Robot.waitForIdle() may hang
2021-06-25 Aleksey Shipilev JDK-8086003 Test fails on OSX with java.lang.RuntimeException 'Narrow klass base: 0x0000000000000000, Narrow klass shift: 3' missing
2021-06-23 Zhengyu Gu JDK-8248901 Signed immediate support in .../share/assembler.hpp is broken.
2021-06-23 Roland Westrelin JDK-8035424 Performance problem in sun.reflect.generics.parser.SignatureParser
2021-06-23 Roland Westrelin JDK-8170467 (reflect) Optimize SignatureParser's use of StringBuilders
2021-06-22 Zhengyu Gu JDK-8263382 java/util/logging/ParentLoggersTest.java failed with "checkLoggers: getLoggerNames() returned unexpected loggers"
2021-06-22 Zhengyu Gu JDK-7146776 Deadlock between URLStreamHandler.getHostAddress and file.Handler.openconnection
2021-06-21 Zhengyu Gu JDK-8042557 compiler/uncommontrap/TestSpecTrapClassUnloading.java fails with: GC triggered before VM initialization completed
2021-06-09 Alexey Bakhtin JDK-8229243 SunPKCS11-Solaris provider tests failing on Solaris 11.4
2021-06-09 Alex Kasko JDK-8263311 Watch registry changes for remote printers update instead of polling
2021-06-09 Alexey Bakhtin JDK-8231222 fix pkcs11 P11_DEBUG guarded native traces
2021-06-09 Alex Kasko JDK-8054118 java/net/ipv6tests/UdpTest.java failed intermittently
2021-06-02 Alex Kasko JDK-8262829 Native crash in Win32PrintServiceLookup.getAllPrinterNames()
2021-06-02 Alex Kasko JDK-8240518 Incorrect JNU_ReleaseStringPlatformChars in Windows Print
2021-06-02 Zhengyu Gu JDK-8196181 sun/java2d/GdiRendering/InsetClipping.java fails
2021-06-01 Zhengyu Gu JDK-8027154 [TESTBUG] Test java/awt/Mouse/GetMousePositionTest/GetMousePositionWithPopup.java fails
2021-06-01 Alexey Bakhtin JDK-8241248 NullPointerException in sun.security.ssl.HKDF.extract(HKDF.java:93)
2021-06-01 Aleksey Shipilev JDK-8262000 jdk/jfr/event/gc/detailed/TestPromotionFailedEventWithParallelScavenge.java failed with "OutOfMemoryError: Java heap space"
2021-05-28 Paul Hohensee JDK-8265238 [8u] [macos] build failure in OpenJDK8u after JDK-8211301 in older xcode
2021-05-27 Martin Balao JDK-8254631 Better support ALPN byte wire values in SunJSSE
2021-05-27 Paul Hohensee JDK-8267689 [8u] [aarch64] Crash due to bad shift in indirect addressing mode
2021-05-26 Zhengyu Gu JDK-8035001 TEST_BUG: the retry logic in RMID.start() should check that the subprocess hasn't terminated
2021-05-26 Martin Balao JDK-8265462 Handle multiple slots in the NSS Internal Module from SunPKCS11's Secmod
2021-05-26 Paul Hohensee JDK-8239400 [8u] clean up delete-non-virtual-dtor warnings in HotSpot
2021-05-25 Paul Hohensee JDK-8250876 Fix issues with cross-compile on macos
2021-05-25 Zhengyu Gu JDK-8196092 javax/swing/JComboBox/8032878/bug8032878.java fails
2021-05-25 Severin Gehwolf JDK-8266929 Unable to use algorithms from 3p providers
2021-05-24 Vladimir Kempik JDK-8267235 [macos_aarch64] InterpreterRuntime::throw_pending_exception messing up LR results in crash
2021-05-24 Zhengyu Gu JDK-8081764 [TEST_BUG] Test javax/swing/plaf/aqua/CustomComboBoxFocusTest.java fails on Windows, Solaris Sparcv9 and Linux but passes on MacOSX
2021-05-20 Zhengyu Gu JDK-8078855 [TEST_BUG] javax/swing/JComboBox/8032878/bug8032878.java fails in WindowsClassicLookAndFeel
2021-05-20 Zhengyu Gu JDK-8028618 [TEST BUG] javax/swing/JScrollBar/bug4202954/bug4202954.java fails
2021-05-20 Paul Hohensee JDK-8172188 JDI tests fail due to "permission denied" when creating temp file
2021-05-20 Paul Hohensee JDK-8239053 [8u] clean up undefined-var-template warnings
2021-05-20 Roland Westrelin JDK-6990210 [TEST_BUG] EventDispatchThread/HandleExceptionOnEDT/HandleExceptionOnEDT.java fails on gnome
2021-05-20 Sergey Nazarkin JDK-8206243 java -XshowSettings fails if memory.limit_in_bytes overflows LONG.max
2021-05-20 Sergey Nazarkin JDK-8267426 MonitorVmStartTerminate test timed out on Embedded VM
2021-05-19 Paul Hohensee JDK-8037825 Fix warnings and enable "warnings as errors" in serviceability native libraries
2021-05-18 Jaroslav Bachorík JDK-8266723 JFR periodic events are causing extra allocations
2021-05-17 Paul Hohensee JDK-8035287 gcc warnings compiling various libraries files
2021-05-17 Paul Hohensee JDK-8074836 Resolve disabled warnings for libosxkrb5
2021-05-17 Zhengyu Gu JDK-8035000 TEST_BUG: remove ActivationLibrary.DestroyThread and have callers call rmid.destroy() instead
2021-05-14 Zhengyu Gu JDK-8047939 [TESTBUG] Rewrite test/runtime/8001071/Test8001071.sh
2021-05-13 Zhengyu Gu JDK-8249142 java/awt/FontClass/CreateFont/DeleteFont.sh is unstable
2021-05-13 Zhengyu Gu JDK-7106851 Test should not use System.exit
2021-05-13 Paul Hohensee JDK-8043646 libosxapp.dylib fails to build on Mac OS 10.9 with clang
2021-05-11 Alexey Bakhtin JDK-8214513 A PKCS12 keystore from Java 8 using custom PBE parameters cannot be read in Java 11
2021-05-11 Alexey Bakhtin JDK-8202837 PBES2 AlgorithmId encoding error in PKCS12 KeyStore
2021-05-11 Alexey Bakhtin JDK-8206189 sun/security/pkcs12/EmptyPassword.java fails with Sequence tag error
2021-05-11 Alexey Bakhtin JDK-8202299 Java Keystore fails to load PKCS12/PFX certificates created in WindowsServer2016
2021-05-10 Zhengyu Gu JDK-8130430 [TEST_BUG] remove unnecessary internal calls from javax/swing/JRadioButton/8075609/bug8075609.java
2021-05-07 Alex Kasko JDK-8241829 Cleanup the code for PrinterJob on windows
2021-05-07 Alex Kasko JDK-8252883 AccessDeniedException caused by delayed file deletion on Windows
2021-05-06 Paul Hohensee JDK-8138820 JDK Hotspot build fails with Xcode 7.0.1
2021-05-06 Paul Hohensee JDK-8019470 Changes needed to compile JDK 8 on MacOS with clang compiler
2021-05-06 Alexey Bakhtin JDK-8242565 Policy initialization issues when the denyAfter constraint is enabled
2021-05-05 Alex Kasko JDK-8262446 DragAndDrop hangs on Windows
2021-05-03 Aleksey Shipilev JDK-8238567 SoftMainMixer.processAudioBuffers(): Wrong handling of stoppedMixers
2021-04-30 Alexandr Scherbatiy JDK-8156584 Initialization race in sun.security.x509.AlgorithmId.get
2021-04-30 Dongbo He JDK-8043264 hsdis library not picked up correctly on expected paths
2021-04-29 Paul Hohensee JDK-8129511 PlatformMidi.c:83 uses malloc without malloc header
2021-04-29 Paul Hohensee JDK-8035054 JarFacade.c should not include ctype.h
2021-04-29 Paul Hohensee JDK-8034856 gcc warnings compiling src/solaris/native/sun/security/pkcs11
2021-04-28 Paul Hohensee JDK-8253375 OSX build fails with Xcode 12.0 (12A7209)
2021-04-28 Paul Hohensee JDK-8257039 [8u] GenericTaskQueue destructor is incorrect
2021-04-28 Zhengyu Gu JDK-8032050 TEST_BUG: Clean up for java/rmi/activation/Activatable/shutdownGracefully/ShutdownGracefully.java
2021-04-28 Dongbo He JDK-8266191 Missing aarch64 parts of JDK-8181872(C1: possible overflow when strength reducing integer multiply by constant)
2021-04-28 Hui Shi JDK-8264752 SIGFPE crash with option FlightRecorderOptions:threadbuffersize=30M
2021-04-27 Alex Kasko JDK-8257997 sun/security/ssl/SSLSocketImpl/SSLSocketLeak.java again reports leaks after JDK-8257884
2021-04-27 Alex Kasko JDK-8257884 Re-enable sun/security/ssl/SSLSocketImpl/SSLSocketLeak.java as automatic test
2021-04-27 Alex Kasko JDK-8257670 sun/security/ssl/SSLSocketImpl/SSLSocketLeak.java reports leaks
2021-04-27 Alex Kasko JDK-8256818 SSLSocket that is never bound or connected leaks socket resources
2021-04-27 Zhengyu Gu JDK-8072767 DefaultCellEditor for comboBox creates ActionEvent with wrong source object
2021-04-27 Anton Kozlov JDK-8264640 CMS ParScanClosure misses a barrier
2021-04-27 Aleksey Shipilev JDK-8205014 com/sun/jndi/ldap/DeadSSLLdapTimeoutTest.java failed with "Read timed out"
2021-04-27 Aleksey Shipilev JDK-8265988 Fix sun/text/IntHashtable/Bug4170614 for JDK 8u
2021-04-27 Aleksey Shipilev JDK-8071374 Native disassembler implementation may be not thread-safe
2021-04-26 Zhengyu Gu JDK-8134672 [TEST_BUG] Some tests should check isDisplayChangeSupported
2021-04-26 Aleksey Shipilev JDK-7059970 Test case: javax/imageio/plugins/png/ITXtTest.java is not closing a file
2021-04-26 Aleksey Shipilev JDK-8225081 Remove Telia Company CA certificate expiring in April 2021
2021-04-26 Aleksey Shipilev JDK-8225116 Test OwnedWindowsLeak.java intermittently fails
2021-04-26 Aleksey Shipilev JDK-8159898 Negative array size in java/beans/Introspector/Test8027905.java
2021-04-26 Fei Yang JDK-8217348 assert(thread->is_Java_thread()) failed: just checking
2021-04-24 Denghui Dong JDK-8264816 Weak handles leak causes GC to take longer
2021-04-23 Martin Balao JDK-8228757 Fail fast if the handshake type is unknown
2021-04-23 Aleksey Shipilev JDK-8265832 runtime/StackGap/testme.sh fails to compile in 8u
2021-04-23 Aleksey Shipilev JDK-8151786 [TESTBUG] java/beans/XMLEncoder/Test4625418.java timed out intermittently
2021-04-23 Aleksey Shipilev JDK-8260255 C1: LoopInvariantCodeMotion constructor can leave some fields uninitialized
2021-04-23 Aleksey Shipilev JDK-8166724 gc/g1/TestHumongousShrinkHeap.java fails with OOME
2021-04-23 Aleksey Shipilev JDK-8132709 [TESTBUG] gc/g1/TestHumongousShrinkHeap.java might fail on embedded
2021-04-22 Martin Balao JDK-8258753 StartTlsResponse.close() hangs due to synchronization issues
2021-04-21 Zhengyu Gu JDK-8178403 DirectAudio in JavaSound may hang and leak
2021-04-21 Aleksey Shipilev JDK-8166046 [TESTBUG] compiler/stringopts/TestStringObjectInitialization.java fails with OOME
2021-04-21 Zhengyu Gu JDK-8177809 File.lastModified() is losing milliseconds (always ends in 000)
2021-04-21 Aleksey Shipilev JDK-8255734 VM should ignore SIGXFSZ on ppc64, s390 too
2021-04-20 Aleksey Shipilev JDK-8260484 CheckExamples.java / NoJavaLangTest.java fail with jtreg 4.2
2021-04-20 Aleksey Shipilev JDK-8066807 langtools/test/Makefile should use -agentvm not -samevm
2021-04-20 Aleksey Shipilev JDK-8064909 FragmentMetaspace.java got OutOfMemoryError
2021-04-20 Aleksey Shipilev JDK-8066508 JTReg tests timeout on slow devices when run using JPRT
2021-04-19 Aleksey Shipilev JDK-8183910 gc/arguments/TestAggressiveHeap.java fails intermittently
2021-04-19 Aleksey Shipilev JDK-8030123 java/beans/Introspector/Test8027648.java fails
2021-04-19 Aleksey Shipilev JDK-8249278 Revert JDK-8226253 which breaks the spec of AccessibleState.SHOWING for JList
2021-04-19 Aleksey Shipilev JDK-8263504 Some OutputMachOpcodes fields are uninitialized
2021-04-16 Aleksey Shipilev JDK-8231949 [PPC64, s390]: Make async profiling more reliable
2021-04-15 Aleksey Shipilev JDK-8209996 [PPC64] Fix JFR profiling.
2021-04-14 Martin Balao JDK-8261355 No data buffering in SunPKCS11 Cipher encryption when the underlying mechanism has no padding
2021-04-14 Zhengyu Gu JDK-8073446 TimeZone getOffset API does not return a DST offset between years 2038-2137
2021-04-14 Fei Yang JDK-8260029 aarch64: fix typo in verify_oop_array
2021-04-13 Zhengyu Gu JDK-8132148 G1 hs_err region dump legend out of sync with region values
2021-04-12 Fei Yang JDK-8247350 [aarch64] assert(false) failed: wrong size of mach node
2021-04-12 Dongbo He JDK-8259886 Improve SSL session cache performance and scalability
2021-04-09 Dongbo He JDK-8231841 AArch64: debug.cpp help() is missing an AArch64 line for pns
2021-04-08 Andrew Leonard JDK-8264509 jdk8u MacOS zipped debug symbols won't build
2021-04-04 Fei Yang JDK-8264562 assert(verify_field_bit(1)) failed: Attempting to write an uninitialized event field: type
2021-04-04 Fei Yang JDK-8217230 assert(t == t_no_spec) failure in NodeHash::check_no_speculative_types()
2021-04-01 Aleksey Shipilev JDK-8234011 (zipfs) Memory leak in ZipFileSystem.releaseDeflater()
2021-04-01 Fei Yang JDK-8258669 fastdebug jvm crashes when do event based tracing for monitor inflation
2021-03-25 Paul Hohensee JDK-8261867 Backport relevant test changes & additions from JDK-8130125
2021-03-24 Andrew Hughes JDK-8258419 RSA cipher buffer cleanup
2021-03-23 Paul Hohensee JDK-8230428 Cleanup dead CastIP node code in formssel.cpp
2021-03-23 Paul Hohensee JDK-8200550 Xcode 9.3 produce warning -Wexpansion-to-defined
2021-03-23 Paul Hohensee JDK-8077364 "if( !this )" construct prevents build on Xcode 6.3
2021-03-23 Paul Hohensee JDK-8055754 filemap.cpp does not compile with clang
2021-03-23 Paul Hohensee JDK-8033289 clang: clean up unused function warning
2021-03-18 Severin Gehwolf JDK-8243559 Remove root certificates with 1024-bit keys
2021-03-18 Fei Yang JDK-8190332 PngReader throws NegativeArraySizeException/OOM error when IHDR width is very large
2021-03-16 Aleksey Shipilev JDK-8256421 Add 2 HARICA roots to cacerts truststore
2021-03-15 Aleksey Shipilev JDK-8260236 better init AnnotationCollector _contended_group
2021-03-15 Adam Farley JDK-8075071 [TEST_BUG] TimSortStackSize2.java: OOME: Java heap space: MaxHeap shrinked by MaxRAMFraction
2021-03-15 Adam Farley JDK-8190679 java/util/Arrays/TimSortStackSize2.java fails with "Initial heap size set to a larger value than the maximum heap size"
2021-03-15 Adam Farley JDK-8199265 java/util/Arrays/TimSortStackSize2.java fails with OOM
2021-03-12 Aleksey Shipilev JDK-8042891 Format issues embedded in macros for two g1 source files
2021-03-10 Andrew Leonard JDK-8262864 No debug symbols in image for Windows --with-native-debug-symbols=external
2021-03-08 Hui Shi JDK-8263061 copy wrong unpack200.diz to bin directory on linux after 8252395
2021-03-05 Andrew Leonard JDK-8262730 Enable jdk8u MacOS external debug symbols
2021-03-03 Severin Gehwolf JDK-8180478 tools/launcher/MultipleJRE.sh fails on Windows because of extra-''
2021-03-01 Aleksey Shipilev JDK-8231631 sun/net/ftp/FtpURLConnectionLeak.java fails intermittently with NPE
2021-03-01 Aleksey Shipilev JDK-8241649 Optimize Character.toString
2021-02-24 Andrew Hughes JDK-7107012 sun.jvm.hostspot.code.CompressedReadStream readDouble() conversion to long mishandled
2021-02-23 Ge Guo JDK-6896810 TEST_BUG: java/lang/ref/SoftReference/Pin.java fails with OOME during System.out.println
2021-02-22 Alex Kasko JDK-8261231 Windows IME was disabled after DnD operation
2021-02-21 Fei Yang JDK-8262073 assert(allocates2(pc)) failed: not in CodeBuffer memory
2021-02-18 Simon Tooke JDK-8158525 Update a few java/net tests to use the loopback address instead of the host address
2021-02-18 Shuai Wang JDK-8080911 sun/security/krb5/auto/UseCacheAndStoreKey.java timed out intermittently
2021-02-17 Dmitry Cherepanov JDK-8236500 Windows ucrt.dll should be looked up in versioned WINSDK subdirectory
2021-02-16 Sergey Nazarkin JDK-8171410 aarch64: long multiplyExact shifts by 31 instead of 63
2021-02-16 Dmitry Cherepanov JDK-8261766 [8u] hotspot needs to recognise cl.exe 19.16 to build with VS2017
2021-02-11 Severin Gehwolf JDK-8211301 [macos] support full window content options
2021-02-10 Alexey Bakhtin JDK-8256682 JDK-8202343 is incomplete
2021-02-09 Dmitry Cherepanov JDK-8239091 Reversed arguments in call to strstr in freetype "debug" code.
2021-02-09 Zhengyu Gu JDK-8255880 UI of Swing components is not redrawn after their internal state changed
2021-02-04 Martin Balao JDK-8258833 Cancel multi-part cipher operations in SunPKCS11 after failures
2021-02-03 Dongbo He JDK-6878250 (so) IllegalBlockingModeException thrown when reading from a closed SocketChannel's InputStream
2021-01-29 Andrew Hughes JDK-8257192 Integrate AArch64 JIT port into 8u
2021-01-27 Martin Balao JDK-8250582 Revert Principal Name type to NT-UNKNOWN when requesting TGS Kerberos tickets
2021-01-27 Martin Balao JDK-8202343 Disable TLS 1.0 and 1.1
2021-01-26 Martin Balao JDK-8235874 The ordering of Cipher Suites is not maintained provided through “jdk.tls.client.cipherSuites” and “jdk.tls.server.cipherSuites” system property.
2021-01-25 Martin Balao JDK-8234728 Some security tests should support TLSv1.3
2021-01-22 Alexey Bakhtin JDK-8238579 HttpsURLConnection drops the timeout and hangs forever in read
2021-01-20 Martin Balao JDK-8223186 HotSpot compile warnings from GCC 9
2021-01-19 Martin Balao JDK-8211339 NPE during SSL handshake caused by HostnameChecker
2021-01-19 Martin Balao JDK-8242141 New System Properties to configure the TLS signature schemes
2021-01-19 Andrew Haley JDK-8259568 PPC64 builds broken after JDK-8221408 8u backport
2021-01-11 Aleksey Shipilev JDK-8259312 VerifyCACerts.java fails as soneraclass2ca cert will expire in 90 days
2021-01-11 Aleksey Shipilev JDK-8234727 sun/security/ssl/X509TrustManagerImpl tests support TLSv1.3
2021-01-11 Andrew Hughes JDK-8259384 CUP version wrong in THIRD_PARTY_README after JDK-8233548
2021-01-06 Jaroslav Bachorík JDK-8258396 SIGILL in jdk.jfr.internal.PlatformRecorder.rotateDisk()
2020-12-23 Severin Gehwolf JDK-8255908 ExceptionInInitializerError due to UncheckedIOException while initializing cgroupv1 subsystem
2020-12-18 Paul Hohensee JDK-8035186 j2se_jdk/jdk/test/java/lang/invoke/lambda/LogGeneratedClassesTest.java - assertion error
2020-12-17 Severin Gehwolf JDK-8253476 TestUseContainerSupport.java fails on some Linux kernels w/o swap limit capabilities
2020-12-16 Paul Hohensee JDK-8258430 8u backport of JDK-8063107 missing test/javax/swing/JRadioButton/8041561/bug8041561.java changes
2020-12-14 Severin Gehwolf JDK-8230388 Problemlist additional compiler/rtm tests
2020-12-14 Severin Gehwolf JDK-8258241 [8u] Missing doPrivileged() hunks from JDK-8226575
2020-12-11 Severin Gehwolf JDK-8226899 Problemlist compiler/rtm tests
2020-12-11 Severin Gehwolf JDK-8228434 jdk/net/Sockets/Test.java fails after JDK-8227642
2020-12-11 Severin Gehwolf JDK-8227642 [TESTBUG] Make docker tests podman compatible
2020-12-11 Dongbo He JDK-8256642 [TEST_BUG] jdk/test/javax/sound/midi/MidiSystem/DefaultProperties.java failed
2020-12-08 Alex Kasko JDK-8249588 libwindowsaccessbridge issues on 64bit Windows
2020-12-08 Alex Kasko JDK-8225805 Java Access Bridge does not close the logger
2020-12-07 Aleksey Shipilev JDK-8251397 NPE on ClassValue.ClassValueMap.cacheArray
2020-12-03 Aleksei Voitylov JDK-8233228 Disable weak named curves by default in TLS, CertPath, and Signed JAR
2020-12-03 Aleksei Voitylov JDK-8035166 Remove dependency on EC classes from pkcs11 provider
2020-12-03 Severin Gehwolf JDK-8078450 Implement consistent process for quarantine of tests
2020-12-03 Severin Gehwolf JDK-8254854 [cgroups v1] Metric limits not properly detected on some join controller combinations
2020-12-02 Jonathan Dowland JDK-8038723 Open up some PrinterJob tests
2020-12-01 Severin Gehwolf JDK-8217338 [Containers] Improve systemd slice memory limit support
2020-11-30 Paul Hohensee JDK-8081547 Prepare client libs regression tests for running in a concurrent, headless jtreg environment
2020-11-30 Severin Gehwolf JDK-8257397 [TESTBUG] test/lib/containers/docker/Common.java refers to -Xlog:os+container=trace
2020-11-27 Jonathan Dowland JDK-8205111 Develop new Test to verify different key types for supported TLS protocols.
2020-11-26 Alex Kasko JDK-8150204 (fs) Enhance java/nio/file/Files/probeContentType/Basic.java debugging output
2020-11-26 Jonathan Dowland JDK-8080953 [TEST_BUG]Test java/awt/FontClass/DebugFonts.java fails due to wrongly typed bugid
2020-11-26 Jonathan Dowland JDK-8166015 [PIT][TEST_BUG] stray character in java/awt/Focus/ModalDialogActivationTest/ModalDialogActivationTest.java
2020-11-26 Paul Hohensee JDK-8250984 Memory Docker tests fail on some Linux kernels w/o cgroupv1 swap limit capabilities
2020-11-26 Paul Hohensee JDK-8160217 JavaSound should clean up resources better
2020-11-25 Zhengyu Gu JDK-8141457 keytool default cert fingerprint algorithm should be SHA-256
2020-11-25 Paul Hohensee JDK-8229868 Update Apache Santuario TPRM version
2020-11-25 Martin Balao JDK-8249846 Change of behavior after JDK-8237117: Better ForkJoinPool behavior
2020-11-25 Severin Gehwolf JDK-8047180 Move functional tests AWT_Headless/Automated to OpenJDK repository
2020-11-25 Zhengyu Gu JDK-8221408 Windows 32bit build build errors/warnings in hotspot
2020-11-25 Paul Hohensee JDK-8219013 Update Apache Santuario (XML Signature) to version 2.1.3
2020-11-25 Paul Hohensee JDK-8256671 [8u] Incorrect assignment operator used in guarantee() in genCollectedHeap
2020-11-25 Aleksey Shipilev JDK-8256618 Zero: Linux x86_32 build still fails
2020-11-25 Paul Hohensee JDK-8022535 [TEST BUG] javax/swing/text/html/parser/Test8017492.java fails
2020-11-25 Paul Hohensee JDK-8198334 java/awt/FileDialog/8003399/bug8003399.java fails in headless mode
2020-11-24 Alex Kasko JDK-8252470 java/awt/dnd/DisposeFrameOnDragCrash/DisposeFrameOnDragTest.java fails on Windows
2020-11-24 Alex Kasko JDK-8249183 JVM crash in "AwtFrame::WmSize" method
2020-11-24 Vladimir Kempik JDK-8244621 [macos10.15] Garbled FX printing plus CoreText warnings on Catalina when building with Xcode 11
2020-11-24 Aleksey Shipilev JDK-8160761 [TESTBUG] Several compiler tests fail with product bits
2020-11-23 Zhengyu Gu JDK-8255937 Better cleanup for test/jdk/javax/imageio/stream/StreamFlush.java
2020-11-23 Zhengyu Gu JDK-8223108 Test java/awt/EventQueue/NonComponentSourcePost.java is unstable
2020-11-20 Andrew Leonard JDK-8256752 8252395 incorrect copy rule for macos .dSYM folder
2020-11-19 Aleksey Shipilev JDK-8156803 Turn StressLCM/StressGCM flags to diagnostic
2020-11-18 Sergey Nazarkin JDK-8251365 Build failure on AIX after 8250636
2020-11-17 Paul Hohensee JDK-8063106 Change open swing regression tests to avoid sun.awt.SunToolkit.realSync, part 1
2020-11-17 Paul Hohensee JDK-8063107 Change open swing regression tests to avoid sun.awt.SunToolkit.realSync, part 2
2020-11-17 Fei Yang JDK-8166663 Simplify oops_on_card_seq_iterate_careful
2020-11-16 Paul Hohensee JDK-8063102 Change open awt regression tests to avoid sun.awt.SunToolkit.realSync, part 1
2020-11-16 Paul Hohensee JDK-8250636 iso8601_time returns incorrect offset part on MacOS
2020-11-16 Severin Gehwolf JDK-8227006 [linux] Runtime.availableProcessors execution time increased by factor of 100
2020-11-12 Hui Shi JDK-8255717 JFR crash in WriteObjectSampleStacktrace with uninitialized klass
2020-11-12 David Alvarez JDK-8255603 Memory/Performance regression after JDK-8210985
2020-11-09 Paul Hohensee JDK-8068275 Some tests failed after JDK-8063104
2020-11-09 Paul Hohensee JDK-8168292 [TESTBUG] [macosx] Test java/awt/TrayIcon/DragEventSource/DragEventSource.java fails on OS X
2020-11-09 Paul Hohensee JDK-8058805 [TEST_BUG]Test java/awt/TrayIcon/SecurityCheck/NoPermissionTest/NoPermissionTest.java fails
2020-11-09 Paul Hohensee JDK-8130772 Util.hitMnemonics does not work: getSystemMnemonicKeyCodes() returns ALT_MASK rather than VK_ALT
2020-11-07 Paul Hohensee JDK-8046221 [TEST_BUG] Cleanup datatransfer tests
2020-11-06 Paul Hohensee JDK-8255269 Unsigned overflow in g1Policy.cpp
2020-11-04 Paul Hohensee JDK-8074807 Fix some tests unnecessary using internal API
2020-11-04 Paul Hohensee JDK-8067441 Some tests fails with error: cannot find symbol getSystemMnemonicKeyCodes()
2020-11-04 Paul Hohensee JDK-8063104 Change open awt regression tests to avoid sun.awt.SunToolkit.realSync, part 2
2020-11-04 Paul Hohensee JDK-8076315 move 4 manual functional swing tests to regression suite
2020-11-04 Paul Hohensee JDK-8055836 move awt tests from AWT_Modality to OpenJDK repository - part 9
2020-11-04 Paul Hohensee JDK-8055664 move 14 tests about setLocationRelativeTo to jdk
2020-11-04 Paul Hohensee JDK-8055360 Move the rest part of AWT ShapedAndTranslucent tests to OpenJDK
2020-11-04 Paul Hohensee JDK-8054359 move awt automated tests from AWT_Modality to OpenJDK repository - part 8
2020-11-04 Paul Hohensee JDK-8054358 move awt automated tests from AWT_Modality to OpenJDK repository - part 7
2020-11-04 Paul Hohensee JDK-8054143 move awt automated tests from AWT_Modality to OpenJDK repository - part 6
2020-11-04 Paul Hohensee JDK-8053657 [TEST_BUG] move some 5 tests related to undecorated Frame/JFrame to JDK
2020-11-04 Paul Hohensee JDK-8052408 Move AWT_BAT functional tests to OpenJDK (3 of 3)
2020-11-04 Paul Hohensee JDK-8052012 move awt automated tests from AWT_Modality to OpenJDK repository - part 5
2020-11-04 Paul Hohensee JDK-8051440 move tests about maximizing undecorated to OpenJDK
2020-11-04 Paul Hohensee JDK-8050885 move awt automated tests from AWT_Modality to OpenJDK repository - part 4
2020-11-04 Paul Hohensee JDK-8049694 Migrate functional AWT_DesktopProperties/Automated tests to OpenJDK
2020-11-04 Paul Hohensee JDK-8049617 move awt automated tests from AWT_Modality to OpenJDK repository - part 3
2020-11-04 Paul Hohensee JDK-8048246 Move AWT_DnD/Clipboard/Automated functional tests to OpenJDK
2020-11-04 Paul Hohensee JDK-8047367 move awt automated tests from AWT_Modality to OpenJDK repository - part 2
2020-11-04 Paul Hohensee JDK-8044765 Move functional tests AWT_SystemTray/Automated to openjdk repository
2020-11-03 Paul Hohensee JDK-8044429 move awt automated exclusion tests for AWT_Modality to OpenJDK repository
2020-11-03 Paul Hohensee JDK-8062606 Fix a typo in java.awt.Robot class
2020-11-03 Paul Hohensee JDK-8056911 Remove internal API usage from ExtendedRobot class
2020-11-03 Severin Gehwolf JDK-8221340 [TESTBUG] TestCgroupMetrics.java fails after fix for JDK-8219562
2020-11-03 Severin Gehwolf JDK-8219562 Line of code in osContainer_linux.cpp#L102 appears unreachable
2020-11-03 Severin Gehwolf JDK-8242480 Negative value may be returned by getFreeSwapSpaceSize() in the docker
2020-11-03 Severin Gehwolf JDK-8246648 issue with OperatingSystemImpl getFreeSwapSpaceSize in docker after 8242480
2020-11-03 Severin Gehwolf JDK-8008657 JSpinner setComponentOrientation doesn't affect on text orientation
2020-11-03 Severin Gehwolf JDK-8041561 Inconsistent opacity behaviour between JCheckBox and JRadioButton
2020-11-03 Severin Gehwolf JDK-8044172 [TEST_BUG] Move regtests for 4523758 and AltPlusNumberKeyCombinationsTest to jdk
2020-11-03 Severin Gehwolf JDK-8220579 [Containers] SubSystem.java out of sync with osContainer_linux.cpp
2020-11-03 Fei Yang JDK-8166862 CMS needs klass_or_null_acquire
2020-11-03 Fei Yang JDK-8166583 Add oopDesc::klass_or_null_acquire()
2020-10-30 Paul Hohensee JDK-8044157 [TEST_BUG] Improve recently submitted AWT_Mixing tests
2020-10-30 Paul Hohensee JDK-8043131 Move ShapedAndTranslucentWindows and GC functional AWT tests to regression tree
2020-10-30 Paul Hohensee JDK-8043126 move awt automated functional tests from AWT_Events/Lw and AWT_Events/AWT to OpenJDK repository
2020-10-30 Andrew Hughes JDK-8250861 Crash in MinINode::Ideal(PhaseGVN*, bool)
2020-10-30 Severin Gehwolf JDK-8214440 ldap over a TLS connection negotiate failed with "javax.net.ssl.SSLPeerUnverifiedException: hostname of the server '' does not match the hostname in the server's certificate"
2020-10-30 Paul Hohensee JDK-8041592 [TEST_BUG] Move 42 AWT hw/lw mixing tests to jdk
2020-10-30 Paul Hohensee JDK-8039279 Move awt tests to openjdk repository
2020-10-30 Zhengyu Gu JDK-8069211 (zipfs) ZipFileSystem creates corrupted zip if entry output stream gets closed more than once
2020-10-30 Alexey Bakhtin JDK-8253932 SSL debug log prints incorrect caller info
2020-10-30 Andrew Hughes JDK-8223940 Private key not supported by chosen signature algorithm
2020-10-30 Fei Yang JDK-8179083 Uninitialized notifier in Java Monitor Wait tracing event
2020-10-29 Andrew Hughes JDK-8254177 (tz) Upgrade time-zone data to tzdata2020b
2020-10-28 Andrey Petushkov JDK-8217362 Emergency dump does not work when disk=false is set
2020-10-28 Zhengyu Gu JDK-8163161 [PIT][TEST_BUG] increase timeout in javax/swing/plaf/nimbus/8057791/bug8057791.java
2020-10-28 Zhengyu Gu JDK-8238448 RSASSA-PSS signature verification fail when using certain odd key sizes
2020-10-28 Zhengyu Gu JDK-8043899 compiler/5091921/Test7005594.java fails if specified -Xmx is less than 1600m
2020-10-28 Zhengyu Gu JDK-8168682 jdk/test/java/lang/ClassLoader/forNameLeak/ClassForNameLeak.java fails with -Xcomp: ClassLoader was never enqueued!
2020-10-28 Severin Gehwolf JDK-8217766 Container Support doesn't work for some Join Controllers combinations
2020-10-28 Yuri Nesterenko JDK-8252497 Incorrect numeric currency code for ROL
2020-10-27 Severin Gehwolf JDK-8221710 [TESTBUG] more configurable parameters for docker testing
2020-10-26 Zhengyu Gu JDK-8248214 Add paddings for TaskQueueSuper to reduce false-sharing cache contention
2020-10-22 Severin Gehwolf JDK-8251840 Java_sun_awt_X11_XToolkit_getDefaultScreenData should not be in make/mapfiles/libawt_xawt/mapfile-vers
2020-10-22 Dongbo He JDK-8254683 [TEST_BUG] jdk/test/sun/tools/jconsole/WorkerDeadlockTest.java fails
2020-10-21 Zhengyu Gu JDK-8160438 [PIT][macosx] [TEST_BUG] javax/swing/plaf/nimbus/8057791/bug8057791.java fails
2020-10-20 Andrew Brygin JDK-8255003 Build failures on Solaris
2020-10-14 Aleksey Shipilev JDK-8212070 Introduce diagnostic flag to abort VM on failed JIT compilation
2020-10-14 Aleksey Shipilev JDK-8254144 Non-x86 Zero builds fail with return-type warning in os_linux_zero.cpp
2020-10-14 Aleksey Shipilev JDK-8254166 Zero: return-type warning in zeroInterpreter_zero.cpp
2020-10-14 Aleksey Shipilev JDK-8242335 Additional Tests for RSASSA-PSS
2020-10-13 Severin Gehwolf JDK-8224502 [TESTBUG] JDK docker test TestSystemMetrics.java fails with access issues and OOM
2020-10-13 Aleksey Shipilev JDK-8253284 Zero OrderAccess barrier mappings are incorrect
2020-10-13 Severin Gehwolf JDK-8221342 [TESTBUG] Generate Dockerfile for docker testing
2020-10-13 Severin Gehwolf JDK-8254081 java/security/cert/PolicyNode/GetPolicyQualifiers.java fails due to an expired certificate
2020-10-09 Dongbo He JDK-8253752 jdk/test/sun/management/jmxremote/bootstrap/RmiBootstrapTest.sh fails randomly
2020-10-09 Hui Shi JDK-8253837 JFR generate same symbol ID for different symbols in 8U
2020-10-08 Andrew Hughes JDK-8236512 PKCS11 Connection closed after Cipher.doFinal and NoPadding
2020-10-07 Paul Hohensee JDK-8030350 Enable additional compiler warnings for GCC
2020-10-05 Paul Hohensee JDK-8036122 Fix warning "format not a string literal"
2020-09-24 Andrew Hughes JDK-8253550 [8u] JDK-8252395 breaks the build for make STRIP_POLICY=no_strip
2020-09-24 Alex Kasko JDK-8031423 Test java/awt/dnd/DisposeFrameOnDragCrash/DisposeFrameOnDragTest.java fails by Timeout on Windows
2020-09-23 Paul Hohensee JDK-8231209 [REDO] JDK-8207266 ThreadMXBean::getThreadAllocatedBytes() can be quicker for self thread
2020-09-23 Alex Kasko JDK-8232114 JVM crashed at imjpapi.dll in native code
2020-09-22 Severin Gehwolf JDK-8148983 Fix extra comma in changes for JDK-8148916
2020-09-22 Severin Gehwolf JDK-8148916 Mark bug6400879.java as intermittently failing
2020-09-21 Zhengyu Gu JDK-8249176 jdk jtreg test security/infra/java/security/cert/CertPathValidator/certification/GlobalSignR6CA.java fails
2020-09-18 Jaroslav Bachorík JDK-8252754 Hash code calculation of JfrStackTrace is inconsistent
2020-09-17 Andrew Leonard JDK-8207766 [testbug] Adapt tests for Aix.
2020-09-16 Zhengyu Gu JDK-8250665 Wrong translation for the month of May in ar_JO, ar_LB and ar_SY
2020-09-16 Zhengyu Gu JDK-8245400 Upgrade to LittleCMS 2.11
2020-09-16 Andrew Hughes JDK-8253036 [8u] Support building the Zero assembler port on AArch64
2020-09-15 Paul Hohensee JDK-8231968 getCurrentThreadAllocatedBytes default implementation s/b getThreadAllocatedBytes
2020-09-10 Andrey Petushkov JDK-8252904 VM crashes when JFR is used and JFR event class is transformed
2020-09-10 Severin Gehwolf JDK-8252975 [8u] JDK-8252395 breaks the build for --with-native-debug-symbols=internal
2020-09-08 Mario Torre JDK-8213448 [TESTBUG] enhance jfr/jvm/TestDumpOnCrash
2020-09-07 Alex Kasko JDK-8051853 new URI("x/").resolve("..").getSchemeSpecificPart() returns null!
2020-09-04 Alex Kasko JDK-8202076 test/jdk/java/io/File/WinSpecialFiles.java on windows with VS2017
2020-09-01 Severin Gehwolf JDK-8244225 stringop-overflow warning on strncpy call from compile_the_world_in
2020-09-01 Severin Gehwolf JDK-8252395 [8u] --with-native-debug-symbols=external doesn't include debuginfo files for binaries
2020-08-29 Martin Balao JDK-8228835 Memory leak in PKCS11 provider when using AES GCM
2020-08-29 Zhengyu Gu JDK-8160768 Add capability to custom resolve host/domain names within the default JNDI LDAP provider
2020-08-28 Martin Balao JDK-8245466 Backport TLSv1.3 protocol implementation
2020-08-28 Martin Balao JDK-8225695 32-bit build failures after JDK-8080462 (Update SunPKCS11 provider with PKCS11 v2.40 support)
2020-08-28 Martin Balao JDK-8251117 Cannot check P11Key size in P11Cipher and P11AEADCipher
2020-08-28 Severin Gehwolf JDK-8252384 [TESTBUG] Some tests refer to COMPAT provider rather than JRE
2020-08-27 Andrew Hughes JDK-8251120 [8u] HotSpot build assumes ENABLE_JFR is set to either true or false
2020-08-27 Aleksey Shipilev JDK-8251469 Better cleanup for test/jdk/javax/imageio/SetOutput.java
2020-08-27 Aleksey Shipilev JDK-8243320 Add SSL root certificates to Oracle Root CA program
2020-08-27 Aleksey Shipilev JDK-6962725 Regtest javax/swing/JFileChooser/6738668/bug6738668.java fails under Linux
2020-08-25 Martin Balao JDK-8144539 Update PKCS11 tests to run with security manager
2020-08-25 Severin Gehwolf JDK-8226575 OperatingSystemMXBean should be made container aware
2020-08-25 Roman Kennke JDK-8222079 Don't use memset to initialize fields decode_env constructor in disassembler.cpp
2020-08-25 Zhengyu Gu JDK-8244151 Update MUSCLE PC/SC-Lite headers to the latest release 1.8.26
2020-08-25 Severin Gehwolf JDK-8134632 Mark javax/sound/midi/Devices/InitializationHang.java as headful
2020-08-25 Severin Gehwolf JDK-8220313 [TESTBUG] Update base image for Docker testing to OL 7.6
2020-08-25 Fei Yang JDK-8165808 Add release barriers when allocating objects with concurrent collection
2020-08-21 Martin Balao JDK-8078334 Mark regression tests using randomness
2020-08-21 Jaroslav Bachorík JDK-8249158 THREAD_START and THREAD_END event posted in primordial phase
2020-08-20 Elliott Baron JDK-8236645 JDK 8u231 introduces a regression with incompatible handling of XML messages
2020-08-20 Severin Gehwolf JDK-8251546 8u backport of JDK-8194298 breaks AIX and Solaris builds
2020-08-20 Andrew Leonard JDK-8025936 Windows .pdb and .map files does not have proper dependencies setup
2020-08-20 Aleksey Shipilev JDK-8252084 Minimal VM fails to bootcycle: undefined symbol: AgeTableTracer::is_tenuring_distribution_event_enabled
2020-08-20 Andrew Hughes JDK-8026236 Add PrimeTest for BigInteger
2020-08-20 Andrew Hughes JDK-8152077 (cal) Calendar.roll does not always roll the hours during daylight savings changes
2020-08-19 Aleksey Shipilev JDK-8193234 When using -Xcheck:jni an internally allocated buffer can leak
2020-08-19 Aleksey Shipilev JDK-8219919 RuntimeStub's name lost with PrintFrameConverterAssembly
2020-08-19 Aleksey Shipilev JDK-8231213 Migrate SimpleDateFormatConstTest to JDK Repo
2020-08-19 Aleksey Shipilev JDK-8226809 Circular reference in printed stack trace is not correctly indented & ambiguous
2020-08-19 Aleksey Shipilev JDK-8211163 UNIX version of Java_java_io_Console_echo does not return a clean boolean
2020-08-18 Elliott Baron JDK-8217878 ENVELOPING XML signature no longer works
2020-08-17 Elliott Baron JDK-8177334 Update xmldsig implementation to Apache Santuario 2.1.1
2020-08-17 Aleksey Shipilev JDK-8243321 Add Entrust root CA - G4 to Oracle Root CA program
2020-08-17 Roland Westrelin JDK-8240676 Meet not symmetric failure when running lucene on jdk8
2020-08-17 Andrew Hughes JDK-8078880 Mark a few more intermittently failing security-libs tests
2020-08-13 Severin Gehwolf JDK-8250627 Use -XX:+/-UseContainerSupport for enabling/disabling Java container metrics
2020-08-13 Zhengyu Gu JDK-8060721 Test runtime/SharedArchiveFile/LimitSharedSizes.java fails in jdk 9 fcs new platforms/compiler
2020-08-13 Severin Gehwolf JDK-8220674 [TESTBUG] MetricsMemoryTester failcount test in docker container only works with debug JVMs
2020-08-12 Severin Gehwolf JDK-8203357 Container Metrics
2020-08-12 David Alvarez JDK-8233097 Fontmetrics for large Fonts has zero width
2020-08-08 Fei Yang JDK-8148754 C2 loop unrolling fails due to unexpected graph shape
2020-08-07 Marcus Hirt JDK-8250928 JFR: Improve hash algorithm for stack traces
2020-08-07 Zhengyu Gu JDK-8243138 Enhance BaseLdapServer to support starttls extended request
2020-08-06 Zhengyu Gu JDK-8064319 Need to enable -XX:+TraceExceptions in release builds
2020-08-04 Zhengyu Gu JDK-6574989 TEST_BUG: javax/sound/sampled/Clip/bug5070081.java fails sometimes
2020-08-04 Andrey Petushkov JDK-8219566 JFR did not collect call stacks when MaxJavaStackTraceDepth is set to zero
2020-08-03 Zhengyu Gu JDK-8250755 Better cleanup for jdk/test/javax/imageio/plugins/shared/CanWriteSequence.java
2020-08-03 Zhengyu Gu JDK-8148854 Class names "SomeClass" and "LSomeClass;" treated by JVM as an equivalent
2020-07-31 Denghui Dong JDK-8250875 Incorrect parameter type for update_number in JDK_Version::jdk_update
2020-07-31 Andrey Petushkov JDK-8220657 JFR.dump does not work when filename is set
2020-07-31 Aleksey Shipilev JDK-8220165 Encryption using GCM results in RuntimeException: input length out of bound
2020-07-30 Zhengyu Gu JDK-8048933 -XX:+TraceExceptions output should include the message
2020-07-30 Alex Kasko JDK-8191678 [TESTBUG] Add keyword headful in java/awt and javax tests.
2020-07-30 Aleksey Shipilev JDK-8201633 Problems with AES-GCM native acceleration
2020-07-29 Aleksey Shipilev JDK-8163251 Hard coded loop limit prevents reading of smart card data greater than 8k
2020-07-28 Zhengyu Gu JDK-8242556 Cannot load RSASSA-PSS public key with non-null params from byte array
2020-07-28 Aleksey Shipilev JDK-8076151 [TESTBUG] Test java/awt/FontClass/CreateFont/fileaccess/FontFile.java fails
2020-07-28 Aleksey Shipilev JDK-8046274 Removing dependency on jakarta-regexp
2020-07-27 Zhengyu Gu JDK-8211049 Second parameter of "initialize" method is not used
2020-07-27 Andrey Petushkov JDK-8215727 Restore JFR thread sampler loop to old / previous behavior
2020-07-24 Martin Balao JDK-8250546 Expect changed behaviour reported in JDK-8249846
2020-07-24 Paul Hohensee JDK-8061616 HotspotDiagnosticMXBean.getVMOption() throws IllegalArgumentException for flags of type double
2020-07-23 Aleksey Shipilev JDK-8166148 Fix for JDK-8165936 broke Solaris builds
2020-07-23 Leslie Zhai JDK-8238388 libj2gss/NativeFunc.o "multiple definition" link errors with GCC10
2020-07-23 Leslie Zhai JDK-8238386 (sctp) jdk.sctp/unix/native/libsctp/SctpNet.c "multiple definition" link errors with GCC10
2020-07-23 Leslie Zhai JDK-8238380 java.base/unix/native/libjava/childproc.c "multiple definition" link errors with GCC10
2020-07-22 Anton Kozlov JDK-8249677 Regression in 8u after JDK-8237117: Better ForkJoinPool behavior
2020-07-22 Severin Gehwolf JDK-8168517 java/lang/ProcessBuilder/Basic.java failed with "java.lang.AssertionError: Some tests failed"
2020-07-21 Martin Balao JDK-8241888 Mirror jdk.security.allowNonCaAnchor system property with a security one
2020-07-21 Martin Balao JDK-8151834 Test SmallPrimeExponentP.java times out intermittently
2020-07-21 Zhengyu Gu JDK-8231779 crash HeapWord*ParallelScavengeHeap::failed_mem_allocate
2020-07-21 Zhengyu Gu JDK-8023697 failed class resolution reports different class name in detail message for the first and subsequent times
2020-07-21 Alex Kasko JDK-8192953 sun/management/jmxremote/bootstrap/*.sh tests fail with error : revokeall.exe: Permission denied
2020-07-21 Alex Kasko JDK-8025886 replace [[ and == bash extensions in regtest
2020-07-21 Zhengyu Gu JDK-8183349 Better cleanup for jdk/test/javax/imageio/plugins/shared/CanWriteSequence.java and WriteAfterAbort.java
2020-07-20 Andrey Petushkov JDK-8224217 RecordingInfo should use textual representation of path
2020-07-20 Andrey Petushkov JDK-8221569 JFR tool produces incorrect output when both --categories and --events are specified
2020-07-20 Andrey Petushkov JDK-8220555 JFR tool shows potentially misleading message when it cannot access a file
2020-07-20 Andrey Petushkov JDK-8216283 Allow shorter method sampling interval than 10 ms
2020-07-16 Zhengyu Gu JDK-8249610 Make sun.security.krb5.Config.getBooleanObject(String... keys) method public
2020-07-15 Zhengyu Gu JDK-8239385 Support the 'canonicalize' setting (krb5.conf) in the Kerberos client
2020-07-14 Andrew Hughes JDK-8226697 Several tests which need the @key headful keyword are missing it.
2020-07-14 Zhengyu Gu JDK-8217606 LdapContext#reconnect always opens a new connection
2020-07-10 Christine Flood JDK-8230303 JDB hangs when running monitor command
2020-07-08 Fei Yang JDK-8248851 CMS: Missing memory fences between free chunk check and klass read
2020-07-07 Paul Hohensee JDK-8244818 [macos] Java2D Queue Flusher crash while moving application window to external monitor
2020-07-03 Aleksey Shipilev JDK-8031625 javadoc problems referencing inner class constructors
2020-07-01 Denghui Dong JDK-8057003 Large reference arrays cause extremely long synchronization times
2020-07-01 Severin Gehwolf JDK-8194298 Add support for per Socket configuration of TCP keepalive
2020-06-30 Zhengyu Gu JDK-8240295 hs_err elapsed time in seconds is not accurate enough
2020-06-26 Zhengyu Gu JDK-8183351 Better cleanup for jdk/test/javax/imageio/spi/AppletContextTest/BadPluginConfigurationTest.sh
2020-06-26 Alex Kasko JDK-8172012 [TEST_BUG] delays needed in javax/swing/JTree/4633594/bug4633594.java
2020-06-26 Alex Kasko JDK-8145808 [PIT] test java/awt/Graphics2D/MTGraphicsAccessTest/MTGraphicsAccessTest.java hangs on Win. 8
2020-06-24 Zhengyu Gu JDK-8198004 javax/swing/JFileChooser/6868611/bug6868611.java throws error
2020-06-23 Zhengyu Gu JDK-8156169 Some sound tests rarely hangs because of incorrect synchronization
2020-06-22 Zhengyu Gu JDK-8153583 Make OutputAnalyzer.reportDiagnosticSummary public
2020-06-19 Alex Kasko JDK-8210147 adjust some WSAGetLastError usages in windows network coding
2020-06-19 Alex Kasko JDK-8137087 [TEST_BUG] Cygwin failure of java/awt/appletviewer/IOExceptionIfEncodedURLTest/IOExceptionIfEncodedURLTest.sh
2020-06-19 Zhengyu Gu JDK-8183341 Better cleanup for javax/imageio/AllowSearch.java
2020-06-19 Zhengyu Gu JDK-8177628 Opensource unit/regression tests for ImageIO
2020-06-19 Alex Kasko JDK-8242498 Invalid "sun.awt.TimedWindowEvent" object leads to JVM crash
2020-06-18 Roland Westrelin JDK-8167615 Opensource unit/regression tests for JavaSound
2020-06-17 Aleksey Shipilev JDK-8184762 ZapStackSegments should use optimized memset
2020-06-16 Zhengyu Gu JDK-8151788 NullPointerException from ntlm.Client.type3
2020-06-16 Denghui Dong JDK-8217647 JFR: recordings on 32-bit systems unreadable
2020-06-16 Andrew Hughes JDK-8075774 Small readability and performance improvements for zipfs
2020-06-15 Zhengyu Gu JDK-8153430 TESTBUG: jdk regression test javax/management/loading/MletParserLocaleTest.java reduce default timeout
2020-06-15 Alex Kasko JDK-8132376 Add @requires os.family to the client tests with access to internal OS-specific API
2020-06-12 Alex Kasko JDK-8235243 handle VS2017 15.9 and VS2019 in abstract_vm_version
2020-06-12 Alex Kasko JDK-8211714 Need to update vm_version.cpp to recognise VS2017 minor versions
2020-06-10 Sergey Nazarkin JDK-8173300 [TESTBUG]compiler/tiered/NonTieredLevelsTest.java fails with compiler.whitebox.SimpleTestCaseHelper(int) must be compiled
2020-06-09 Sergey Nazarkin JDK-8234617 C1: Incorrect result of field load due to missing narrowing conversion
2020-06-06 Paul Hohensee JDK-8006205 [TESTBUG] NEED_TEST: please JTREGIFY test/compiler/7177917/Test7177917.java
2020-06-03 Denghui Dong JDK-8246310 Clean commented-out code about ModuleEntry andPackageEntry in JFR
2020-06-02 Alex Kasko JDK-8132745 TEST_BUG: minor cleanup of java/util/Scanner/ScanTest.java
2020-06-02 Alex Kasko JDK-8132206 move ScanTest.java into OpenJDK
2020-06-01 Adam Farley JDK-8229378 jdwp library loader in linker_md.c quietly truncates on buffer overflow
2020-05-30 Martin Buchholz JDK-8178374 Problematic ByteBuffer handling in CipherSpi.bufferCrypt method
2020-05-29 Martin Balao JDK-8238842 AIOOBE in GIFImageReader.initializeStringTable
2020-05-28 Jaroslav Bachorík JDK-8243489 Thread CPU Load event may contain wrong data for CPU time under certain conditions
2020-05-25 Alex Kasko JDK-8236996 Incorrect Roboto font rendering on Windows with subpixel antialiasing
2020-05-25 Mario Torre JDK-8239819 XToolkit: Misread of screen information memory
2020-05-25 Severin Gehwolf JDK-8244843 [JDK 8u] JapanEraNameCompatTest fails
2020-05-25 Fei Yang JDK-8171934 ObjectSizeCalculator.getEffectiveMemoryLayoutSpecification() does not recognize OpenJDK's HotSpot VM
2020-05-23 Andrew Hughes JDK-8241750 x86_32 build failure after JDK-8227269
2020-05-23 Andrew Hughes JDK-8227269 Slow class loading when running with JDWP
2020-05-21 Andrew Hughes JDK-8028591 NegativeArraySizeException in sun.security.util.DerInputStream.getUnalignedBitString()
2020-05-15 Severin Gehwolf JDK-8244548 JDK 8u: sun.misc.Version.jdkUpdateVersion() returns wrong result
2020-05-14 Jaroslav Bachorík JDK-8244777 ClassLoaderStats VM Op uses constant hash value
2020-05-13 Fei Yang JDK-8244407 JVM crashes after transformation in C2 IdealLoopTree::split_fall_in
2020-05-12 Severin Gehwolf JDK-8243059 Build fails when --with-vendor-name contains a comma
2020-05-11 Severin Gehwolf JDK-8233880 Support compilers with multi-digit major version numbers
2020-05-08 Severin Gehwolf JDK-8244461 [JDK 8u] Build fails with glibc 2.32
2020-04-28 Lin Zang JDK-8243539 Copyright info (Year) should be updated for fix of 8241638
2020-04-27 Qi Ao JDK-8243474 [TESTBUG] removed three tests of 0 bytes
2020-04-26 Laurent Bourgès JDK-8148886 SEGV in sun.java2d.marlin.Renderer._endRendering
2020-04-23 Lin Zang JDK-8241638 launcher time metrics always report 1 on Linux when _JAVA_LAUNCHER_DEBUG set
2020-04-22 Dmitry Cherepanov JDK-8238225 Issues reported after replacing symlink at Contents/MacOS/libjli.dylib with binary
2020-04-22 Dmitry Cherepanov JDK-8235687 Contents/MacOS/libjli.dylib cannot be a symlink
2020-04-20 Martin Balao JDK-8181841 A TSA server returns timestamp with precision higher than milliseconds
2020-04-20 Martin Balao JDK-7147060 com/sun/org/apache/xml/internal/security/transforms/ClassLoaderTest.java doesn't run in agentvm mode
2020-04-20 Jaroslav Bachorík JDK-8233197 Invert JvmtiExport::post_vm_initialized() and Jfr:on_vm_start() start-up order for correct option parsing
2020-04-17 Martin Balao JDK-8028431 NullPointerException in DerValue.equals(DerValue)
2020-04-17 Severin Gehwolf JDK-8150986 serviceability/sa/jmap-hprof/JMapHProfLargeHeapTest.java failing because expects HPROF JAVA PROFILE 1.0.1 file format
2020-04-16 Qi Ao JDK-8242883 Incomplete backport of JDK-8078268: backport test part
2020-04-15 Aleksey Shipilev JDK-8242788 Non-PCH build is broken after JDK-8191393
2020-04-15 Sergey Nazarkin JDK-8037866 Replace the Fun class in tests with lambdas
2020-04-08 Xin Liu JDK-8191393 Random crashes during cfree+0x1c
2020-04-08 Zhengyu Gu JDK-8230769 BufImg_SetupICM add ReleasePrimitiveArrayCritical call in early return
2020-04-02 Roland Westrelin JDK-8237951 CTW: C2 compilation fails with "malformed control flow"
2020-04-01 Andrew Haley JDK-8076475 Misuses of strncpy/strncat
2020-03-31 Christoph Langer JDK-8067796 (process) Process.waitFor(timeout, unit) doesn't throw NPE if timeout is less than, or equal to zero when unit == null
2020-03-31 Simon Tooke JDK-8172559 [PIT][TEST_BUG] Move @test to be 1st annotation in java/awt/image/Raster/TestChildRasterOp.java
2020-03-31 Simon Tooke JDK-8130737 [macosx] AffineTransformOp can't handle child raster with non-zero x-offset
2020-03-31 Christoph Langer JDK-8241902 AIX Build broken after integration of JDK-8223147 (JFR Backport)
2020-03-31 Roland Westrelin JDK-8230711 ConnectionGraph::unique_java_object(Node* N) return NULL if n is not in the CG
2020-03-31 Roland Westrelin JDK-8239852 java/util/concurrent tests fail with -XX:+VerifyGraphEdges: assert(!VerifyGraphEdges) failed: verification should have failed
2020-03-31 Roland Westrelin JDK-8167300 Scheduling failures during gcm should be fatal
2020-03-31 Alex Kasko JDK-8229888 (zipfs) Updating an existing zip file does not preserve original permissions
2020-03-31 Alex Kasko JDK-4949105 Access Bridge lacks html tags parsing
2020-03-31 Alex Kasko JDK-8226253 JAWS reports wrong number of radio buttons when buttons are hidden
2020-03-30 Zhengyu Gu JDK-8233548 Update CUP to v0.11b
2020-03-30 Aleksey Shipilev JDK-8178910 Problemlist sample tests
2020-03-30 Aleksey Shipilev JDK-8176182 4 security tests are not run
2020-03-30 Andrew Haley JDK-8151582 (ch) test java/nio/channels/AsyncCloseAndInterrupt.java failing due to "Connection succeeded"
2020-03-30 Aleksey Shipilev JDK-8165936 Potential Heap buffer overflow when seaching timezone info files
2020-03-30 Aleksey Shipilev JDK-8193137 Nashorn crashes when given an empty script file.
2020-03-25 Zhengyu Gu JDK-8200313 java/awt/Gtk/GtkVersionTest/GtkVersionTest.java fails
2020-03-25 Zhengyu Gu JDK-8039082 [TEST_BUG] Test java/awt/dnd/BadSerializationTest/BadSerializationTest.java fails
2020-03-25 Roland Westrelin JDK-8214862 assert(proj != __null) at compile.cpp:3251
2020-03-25 Thomas Stuefe JDK-8241444 Metaspace::_class_vsm not initialized if compressed class pointers are disabled
2020-03-25 Severin Gehwolf JDK-8230597 Update GIFlib library to the 5.2.1
2020-03-24 Alex Kasko JDK-8035633 TEST_BUG: java/net/NetworkInterface/Equals.java and some tests failed on windows intermittently
2020-03-24 Aleksey Shipilev JDK-8225567 Wrong file headers with 8202414 fix changeset
2020-03-24 Aleksey Shipilev JDK-8141056 Erroneous assignment in HeapRegionSet.cpp
2020-03-24 Aleksey Shipilev JDK-8229899 java.io.File.isInvalid() is racy
2020-03-24 Zhengyu Gu JDK-8035493 JVMTI PopFrame capability must instruct compilers not to prune locals
2020-03-23 Zhengyu Gu JDK-8239055 Wrong implementation of VMState.hasListener
2020-03-23 Zhengyu Gu JDK-8209113 Use WeakReference for lastFontStrike for created Fonts
2020-03-23 Aleksey Shipilev JDK-8238452 Keytool generates wrong expiration date if validity is set to 2050/01/01
2020-03-20 Simon Tooke JDK-8036088 Replace strtok() with its safe equivalent strtok_s() in DefaultProxySelector.c
2020-03-20 Simon Tooke JDK-8234339 replace JLI_StrTok in java_md_solinux.c
2020-03-20 Simon Tooke JDK-8230926 [macosx] Two apostrophes are entered instead of one with "U.S. International - PC" layout
2020-03-19 Roland Westrelin JDK-8146612 C2: Precedence edges specification violated
2020-03-18 Zhengyu Gu JDK-8233494 Avoid calling MallocTracker::record_malloc and record_free when NMT is off
2020-03-16 Aleksey Shipilev JDK-8030680 292 cleanup from default method code assessment
2020-03-16 Aleksey Shipilev JDK-8216528 test/jdk/java/rmi/transport/runtimeThreadInheritanceLeak/RuntimeThreadInheritanceLeak.java failing with Xcomp
2020-03-13 Fei Yang JDK-8240576 JVM crashes after transformation in C2 IdealLoopTree::merge_many_backedges
2020-03-11 Severin Gehwolf JDK-8215355 Object monitor deadlock with no threads holding the monitor (using jemalloc 5.1)
2020-03-10 Severin Gehwolf JDK-8224475 JTextPane does not show images in HTML rendering
2020-03-10 Severin Gehwolf JDK-8226892 ActionListeners on JRadioButtons don't get notified when selection is changed with arrow keys
2020-03-10 Severin Gehwolf JDK-8230856 Java_java_net_NetworkInterface_getByName0 on unix misses ReleaseStringUTFChars in early return
2020-03-09 Christoph Langer JDK-8232984 Upgrading Joni License version to 2.1.16
2020-03-03 Martin Balao JDK-8238555 Allow initialization of SunPKCS11 with NSS when there are external FIPS modules in the NSSDB
2020-03-03 Andrew Hughes JDK-8240375 Disable JFR by default for July 2020 release
2020-03-03 Andrew Hughes JDK-8239140 Backport JFR to OpenJDK 8
2020-02-28 Laurent Bourgès JDK-8149338 JVM Crash caused by Marlin renderer not handling NaN coordinates
2020-02-27 Zhengyu Gu JDK-8230782 Robot.createScreenCapture() fails if “awt.robot.gtk” is set to false
2020-02-26 Zhengyu Gu JDK-8234270 [REDO] JDK-8204128 NMT might report incorrect numbers for Compiler area
2020-02-25 Severin Gehwolf JDK-8068184 Fix for JDK-8032832 caused a deadlock
2020-02-24 Mario Torre JDK-8235904 Infinite loop when rendering huge lines
2020-02-24 Laurent Bourgès JDK-8144718 Pisces / Marlin Strokers may generate invalid curves with huge coordinates and round joins
2020-02-24 Laurent Bourgès JDK-8144654 Improve Marlin logging
2020-02-24 Laurent Bourgès JDK-8144526 Remove Marlin logging use of deleted internal API
2020-02-21 Aleksey Shipilev JDK-8166976 TestCipherPBECons has wrong @run line
2020-02-20 Alex Kasko JDK-8216472 (se) Stack overflow during selection operation leads to crash (win)
2020-02-20 Elliott Baron JDK-8132130 Some docs cleanup
2020-02-20 Elliott Baron JDK-8079693 Add support for ECDSA P-384 and P-521 curves to XML Signature
2020-02-20 Aleksey Shipilev JDK-8229022 BufferedReader performance can be improved by using StringBuilder
2020-02-20 Aleksey Shipilev JDK-8191227 Unsafe handle resolution in ConstantOopWriteValue::write_on() / print_on() and LIR_Assembler::jobject2reg()
2020-02-20 Aleksey Shipilev JDK-8187078 -XX:+VerifyOops finds numerous problems when running JPRT
2020-02-20 Aleksey Shipilev JDK-8181872 C1: possible overflow when strength reducing integer multiply by constant
2020-02-20 Andrew Hughes JDK-8022263 use same Clang warnings on BSD as on Linux
2020-02-19 Laurent Bourgès JDK-8144446 Automate the Marlin crash test
2020-02-19 Laurent Bourgès JDK-8144445 Maximum size checking in Marlin ArrayCache utility methods is not optimal
2020-02-19 Laurent Bourgès JDK-8144630 Use PrivilegedAction to create Thread in Marlin RendererStats
2020-02-19 Aleksey Shipilev JDK-8231430 C2: Memory stomp in max_array_length() for T_ILLEGAL type
2020-02-19 Aleksey Shipilev JDK-8225128 Add exception for expiring DocuSign root to VerifyCACerts test
2020-02-18 Zhengyu Gu JDK-8041915 Move 8 awt tests to OpenJDK regression tests tree
2020-02-18 Zhengyu Gu JDK-8038631 Create wrapper for awt.Robot with additional functionality
2020-02-17 Aleksey Shipilev JDK-8236179 C1 register allocation failure with T_ADDRESS
2020-02-17 Aleksey Shipilev JDK-8237368 Problem with NullPointerException in RMI TCPEndpoint.read
2020-02-17 Paul Hohensee JDK-8229345 Memory leak due to vtable stubs not being shared on SPARC
2020-02-14 Andrew Hughes JDK-8233223 Add Amazon Root CA certificates
2020-02-14 Andrew Hughes JDK-8234245 sun/security/lib/cacerts/VerifyCACerts.java fails due to wrong checksum
2020-02-14 Andrew Hughes JDK-8232019 Add LuxTrust certificate updates to the existing root program
2020-02-13 Andrew Hughes JDK-8225392 Comparison builds are failing due to cacerts file
2020-02-06 Laurent Bourgès JDK-8145055 Marlin renderer causes unaligned write accesses
2020-02-03 Elliott Baron JDK-8046724 XML Signature ECKeyValue elements cannot be marshalled or unmarshalled
2020-01-31 Andrew Hughes JDK-8235142 JDK-8193255 backport broke bootstrap with JDK 10
2020-01-31 Andrew Hughes JDK-8193255 Root Certificates should be stored in text format and assembled at build time
2020-01-27 Laurent Bourgès JDK-8143849 Integrate Marlin renderer per JEP 265
2020-01-24 Elliott Baron JDK-8162723 Array index overflow in Base64 utility class
2020-01-21 Paul Hohensee JDK-8033215 clang: node.cpp:284 IDX_INIT macro use uninitialized field _out
2020-01-21 Paul Hohensee JDK-8232154 Update Mesa 3-D Headers to version 19.2.1
2020-01-21 Jaikiran Pai JDK-7143743 (zipfs) Potential memory leak with zip provider
2020-01-20 Severin Gehwolf JDK-8237523 8u backport of JDK-8216354 didn't include generated-configure.sh changes
2020-01-17 Paul Hohensee JDK-8236873 Worker has a deadlock bug
2020-01-17 Paul Hohensee JDK-8223158 Docked MacBook cannot start any Java Swing applications
2020-01-17 Martin Balao JDK-8005819 Support cross-realm MSSFU
2020-01-17 Paul Hohensee JDK-8210776 Upgrade X Window System 6.8.2 to the latest XWD 1.0.7
2020-01-16 Mario Torre JDK-8227662 freetype seeks to index at the end of the font data
2020-01-07 Severin Gehwolf JDK-8232003 (fs) Files.write can leak file descriptor in the exception case
2020-01-02 Andrew Dinn JDK-8150460 (linux|bsd|aix)_close.c: file descriptor table may become large or may not work at all
2019-12-26 Fairoz Matte JDK-8235637 jhsdb jmap from OpenJDK 11.0.5 doesn't work if prelink is enabled
2019-12-18 Paul Hohensee JDK-8056313 TEST_BUG: java/util/Timer/NameConstructors.java fails intermittently
2019-12-17 Paul Hohensee JDK-8041620 Solaris Studio 12.4 C++ 5.13 change in behavior for placing friend declarations within surrounding scope
2019-12-13 Paul Hohensee JDK-8232355 Two obsolete flags have the wrong obsolete version in 8u
2019-12-13 Andrew Hughes JDK-8195667 ProblemList PKCS11 tests Secmod/AddTrustedCert.java and tls/TestKeyMaterial.java due to JDK-8180837
2019-12-12 Paul Hohensee JDK-8234288 Turkey Time Zone returns incorrect time zone name
2019-12-10 Paul Hohensee JDK-8213119 [macos] java/awt/GraphicsDevice/CheckDisplayModes.java fails
2019-12-10 David Alvarez JDK-8234591 [11u] Build with old C compiler broken by 8223490
2019-12-10 David Alvarez JDK-8231124 Missing closedir call with JDK-8223490
2019-12-10 David Alvarez JDK-8223490 Optimize search algorithm for determining default time zone
2019-12-06 David Alvarez JDK-8221246 NullPointerException within Win32ShellFolder2
2019-12-06 David Alvarez JDK-8221172 SunEC specific test is not limited to SunEC
2019-12-05 David Alvarez JDK-8134424 BlockDataInputStream.readUTFBody: size local StringBuffer with the given length
2019-12-05 Paul Hohensee JDK-8029629 (process) Improvements to test/java/lang/ProcessBuilder/Basic.java
2019-12-03 Fei Yang JDK-8167409 Invalid value passed to critical JNI function
2019-12-02 Severin Gehwolf JDK-8196969 JTreg Failure: serviceability/sa/ClhsdbJstack.java causes NPE
2019-11-27 Yuri Nesterenko JDK-8233886 TEST_BUG jdk/java/net/CookieHandler/B6791927.java hit hardcoded expiration date
2019-11-26 Martin Doerr JDK-8130341 GHASH 32bit intrinsics has AEADBadTagException
2019-11-26 Yuri Nesterenko JDK-8185898 setRequestProperty(key, null) results in HTTP header without colon in request
2019-11-26 Denghui Dong JDK-8156028 G1YoungGenSizer _adaptive_size not correct when setting NewSize and MaxNewSize to the same value
2019-11-25 Anton Kozlov JDK-8231584 Deadlock with ClassLoader.findLibrary and System.loadLibrary call
2019-11-23 David Alvarez JDK-8139178 Wrong fontMetrics when printing in Landscape (OpenJDK)
2019-11-22 Martin Balao JDK-8233404 System property to set the number of PBE iterations in JCEKS keystores
2019-11-22 Elliott Baron JDK-8079140 IgnoreAllErrorHandler should use doPrivileged when it reads system properties
2019-11-21 Martin Balao JDK-8173956 KeyStore regression due to default keystore being changed to PKCS12
2019-11-21 Elliott Baron JDK-8031191 Warning exception when XMLSignature logging is enabled
2019-11-21 Martin Balao JDK-8170641 sun/net/www/protocol/https/HttpsURLConnection/PostThruProxy.sh fails with timeout
2019-11-21 Bradford Wetmore JDK-8230978 Add support for RSASSA-PSS Signature algorithm (Java SE 8)
2019-11-21 Bradford Wetmore JDK-8230977 JEP 244: TLS Application-Layer Protocol Negotiation Extension (Java SE 8)
2019-11-21 Martin Balao JDK-8131778 java disables UseAES flag when using VIS=2 on sparc
2019-11-20 Martin Balao JDK-8073108 Use x86 and SPARC CPU instructions for GHASH acceleration
2019-11-20 Elliott Baron JDK-8046044 Fix raw and unchecked lint warnings in XML Signature Impl
2019-11-20 Elliott Baron JDK-8038431 Close InputStream when finished retrieving XML Signature HTTP References
2019-11-20 Martin Balao JDK-8055351 sun/security/provider/DSA/TestAlgParameterGenerator.java failed with interrupted! (timed out?)
2019-11-20 Mario Torre JDK-8234107 Several AWT modal dialog tests failing on Linux after JDK-8231991
2019-11-20 Mario Torre JDK-8231991 Mouse wheel change focus on awt/swing windows
2019-11-19 Martin Balao JDK-8215032 Support Kerberos cross-realm referrals (RFC 6806)
2019-11-19 Martin Balao JDK-8080462 Update SunPKCS11 provider with PKCS11 v2.40 support
2019-11-19 Severin Gehwolf JDK-8204288 Matching the end of a string followed by an empty greedy regex and a word boundary fails
2019-11-18 David Alvarez JDK-8218580 endpoint identification algorithm should be case-insensitive
2019-11-18 Severin Gehwolf JDK-8204290 Add check to limit number of capture groups
2019-11-15 Paul Hohensee JDK-8234264 Incorrect 8047434 JDK 8 backport in 8219677
2019-11-12 Christoph Langer JDK-8028480 (zipfs) NoSuchFileException on creating a file in ZipFileSystem with CREATE and WRITE
2019-11-12 Christoph Langer JDK-8034773 (zipfs) newOutputstream uses CREATE_NEW when no options specified
2019-11-12 Christoph Langer JDK-8233995 java.vm.vendor (and potentially other properties/fields) not correctly set in Windows/Hotspot build of OpenJDK8
2019-11-11 Alex Kasko JDK-8225505 ctrl-F1 does not show the tooltip of a menu item (JMenuItems)
2019-11-08 Gustavo Romero JDK-8206173 MallocSiteTable::initialize() doesn't take function descriptors into account
2019-11-06 David Alvarez JDK-8057986 freetype code to get glyph outline does not handle initial control point properly
2019-11-06 Martin Balao JDK-8165996 PKCS11 using NSS throws an error regarding secmod.db when NSS uses sqlite
2019-11-05 Severin Gehwolf JDK-8233023 assert(Opcode() == mem->Opcode() || phase->C->get_alias_index(adr_type()) == Compile::AliasIdxRaw) failed: no mismatched stores, except on raw memory
2019-11-04 Aleksey Shipilev JDK-8231201 hs_err should print coalesced safepoint operations in Events section
2019-10-31 Vladimir Kempik JDK-8229872 (fs) Increase buffer size used with getmntent
2019-10-30 Mario Torre JDK-8212071 Need to set the FreeType LCD Filter to reduce fringing.
2019-10-29 Fei Yang JDK-8231988 Unexpected test result caused by C2 IdealLoopTree::do_remove_empty_loop
2019-10-28 Alex Kasko JDK-8219914 Change the environment variable for Java Access Bridge logging to have a directory
2019-10-28 Alex Kasko JDK-8196681 Java Access Bridge logging and debug flags dynamically controlled
2019-10-28 Zhengyu Gu JDK-8229020 Failure on CPUs allowing loads reordering: assert(_tasks[t] == 1) failed: What else?
2019-10-28 Zhengyu Gu JDK-8229420 [Redo] jstat reports incorrect values for OU for CMS GC
2019-10-28 Zhengyu Gu JDK-8225101 Crash at sun.awt.X11.XlibWrapper.XkbGetUpdatedMap when change keybord map
2019-10-25 Zhengyu Gu JDK-8213568 Typo in java/awt/GraphicsEnvironment/LoadLock/GE_init5.java
2019-10-25 Roland Westrelin JDK-8134739 compiler/loopopts/superword/TestVectorizationWithInvariant crashes in loop opts
2019-10-24 Aleksey Shipilev JDK-8133951 Zero interpreter asserts in stubRoutines.cpp
2019-10-18 David Alvarez JDK-8146238 [macosx] Java2D Queue Flusher crash on OSX after switching between user accounts
2019-10-16 Denghui Dong JDK-8144732 VM_HeapDumper hits assert with bad dump_len
2019-10-11 Severin Gehwolf JDK-8213734 SAXParser.parse(File, ..) does not close resources when Exception occurs.
2019-10-10 Christoph Langer JDK-8231887 Test security/infra/java/security/cert/CertPathValidator/certification/ComodoCA.java fails because certificate was revoked
2019-10-09 Paul Hohensee JDK-8068736 Avoid synchronization on Executable/Field.declaredAnnotations
2019-10-09 Andrew Haley JDK-8048556 Unnecessary GCLocker-initiated young GCs
2019-10-09 Roland Westrelin JDK-8228888 C2 compilation fails with assert "m has strange control"
2019-10-09 Roland Westrelin JDK-8230363 C2: Let ConnectionGraph::not_global_escape(Node* n) return false if n is not in the CG
2019-10-08 Zhengyu Gu JDK-8229169 False failure of GenericTaskQueue::pop_local on architectures with weak memory model
2019-10-07 Yuri Nesterenko JDK-8215210 [macos] Hangul text does not shape to the precomposed form on JDK8u
2019-10-03 Severin Gehwolf JDK-8134579 [TESTBUG] Some bmi tests fail if can_access_local_variables is on.
2019-10-01 Severin Gehwolf JDK-8195088 [TEST_BUG] StartManagementAgent got unexpected exception
2019-09-30 Severin Gehwolf JDK-8227397 Add --with-extra-asflags configure option
2019-09-27 Xin Liu JDK-8055283 Expand ResourceHashtable with C_HEAP allocation, removal and some unit tests
2019-09-24 Aleksey Shipilev JDK-8231398 Add time tracing for gc log rotation at safepoint cleanup
2019-09-18 Evgeny Mandrikov JDK-8073347 javadoc of Formattable messed up by JDK-8019857
2019-09-10 Aleksey Shipilev JDK-8230813 Add JDK-8010500 to compiler/loopopts/superword/TestFuzzPreLoop.java bug list
2019-09-10 Aleksey Shipilev JDK-8230238 Add another regression test for JDK-8134739
2019-09-09 Alex Kasko JDK-8132249 Clean up JAB debugging code
2019-09-03 Jiří Vaněk JDK-8154313 Generated javadoc scattered all over the place
2019-09-02 Andrew Hughes JDK-8222496 [8u] Switch on GTK3 as a default GTK L&F in client-libs
2019-09-02 Severin Gehwolf JDK-8218780 Update MUSCLE PCSC-Lite header files
2019-08-30 Andrew Hughes JDK-8141570 Fix Zero interpreter build for --disable-precompiled-headers
2019-08-30 David Alvarez JDK-8208715 Conversion of milliseconds to nanoseconds in UNIXProcess contains bug.
2019-08-29 Mario Torre JDK-8139965 Hang seen when using com.sun.jndi.ldap.search.replyQueueSize
2019-08-28 David Alvarez JDK-8206879 Currency decimal marker incorrect for Peru
2019-08-28 Xin Liu JDK-8062808 Turn on the -Wreturn-type warning
2019-08-28 David Alvarez JDK-8217731 Font rendering and glyph spacing changed from jdk-8 to jdk-11
2019-08-26 Simon Tooke JDK-8215756 Memory leaks in the AWT on macOS
2019-08-23 Zhengyu Gu JDK-8225141 Better handling of classes in error state by fast class initialization checks
2019-08-23 Zhengyu Gu JDK-8226798 JVM crash in klassItable::initialize_itable_for_interface(int, InstanceKlass*, bool, Thread*)
2019-08-22 Mario Torre JDK-8222980 Upgrade IANA Language Subtag Registry to Version 2019-04-03
2019-08-21 Roman Kennke JDK-8217359 C2 compiler triggers SIGSEGV after transformation in ConvI2LNode::Ideal
2019-08-21 Roman Kennke JDK-8215265 C2: range check elimination may allow illegal out of bound access
2019-08-21 Aleksey Shipilev JDK-8202948 C2: assert(init_offset >= 0) failed: positive offset from object start
2019-08-21 Roland Westrelin JDK-8211232 GraphKit::make_runtime_call() sometimes attaches wrong memory state to call
2019-08-21 Roland Westrelin JDK-8219517 assert(false) failed: infinite loop in PhaseIterGVN::optimize
2019-08-20 Simon Tooke JDK-8203324 Use out of scope in getMacOSXLocale of java_props_macosx.c:120
2019-08-20 Andrew Leonard JDK-8067429 java.lang.VerifyError: Inconsistent stackmap frames at branch target
2019-08-20 Fei Yang JDK-8047212 runtime/ParallelClassLoading/bootstrap/random/inner-complex assert(ObjectSynchronizer::verify_objmon_isinpool(inf)) failed: monitor is invalid
2019-08-20 Martin Balao JDK-8229767 Typo in java.security: Sasl.createClient and Sasl.createServer
2019-08-19 Zhengyu Gu JDK-8219244 NMT: Change ThreadSafepointState's allocation type from mtInternal to mtThread
2019-08-19 Simon Tooke JDK-8220072 GCC 8.3 reports errors in java.base
2019-08-19 Zhengyu Gu JDK-8226964 [Yaru] GTK L&F: There is no difference between menu selected and de-selected
2019-08-16 Christine Flood JDK-8218280 LineNumberReader throws "Mark invalid" exception if CRLF straddles buffer.
2019-08-16 Simon Tooke JDK-8150432 java/util/Locale/LocaleProviders.sh failed on Win10.
2019-08-15 Simon Tooke JDK-8215130 Fix errors in LittleCMS 2.9 reported by GCC 8
2019-08-15 Aleksey Shipilev JDK-8080157 assert(allocates2(pc)) failed: not in CodeBuffer memory
2019-08-14 Martin Balao JDK-8218553 Enhance keystore load debug output
2019-08-13 Paul Hohensee JDK-8229501 jdk/test/lib/testlibrary/ClassFileInstaller.java should match hotspot/test/testlibrary version
2019-08-13 Zhengyu Gu JDK-8151066 assert(0 <= i && i < length()) failed: index out of bounds
2019-08-13 Zhengyu Gu JDK-8155951 VM crash in nsk/jvmti/RedefineClasses/StressRedefine: assert failed: Corrupted constant pool
2019-08-12 Paul Hohensee JDK-8214702 Wrong text position for whitespaced string in printing Swing text
2019-08-12 Zhengyu Gu JDK-8225423 GTK L&F: JSplitPane: There is no divider shown
2019-08-12 Paul Hohensee JDK-8216401 Allow "file:" URLs in Class-Path of local JARs
2019-08-12 Andrew Leonard JDK-8217896 Make better use of LCPUs when building on AIX
2019-08-09 Severin Gehwolf JDK-8135318 CMS: wrong max_eden_size for check_gc_overhead_limit
2019-08-08 Martin Balao JDK-8147502 Digest is incorrectly truncated for ECDSA signatures when the bit length of n is less than the field size
2019-08-08 Aleksey Shipilev JDK-8218201 Failures when vmIntrinsics::_getClass is not inlined
2019-08-08 Aleksey Shipilev JDK-8087128 C2: Disallow definition split on MachCopySpill nodes
2019-08-07 Aleksey Shipilev JDK-8223227 Rename acquire_tag_map() to tag_map_acquire() in jvmtiEnvBase
2019-08-07 Aleksey Shipilev JDK-8223177 Data race on JvmtiEnvBase::_tag_map in double-checked locking
2019-08-05 Martin Balao JDK-8133489 Better messaging for PKIX path validation matching
2019-08-05 Martin Balao JDK-8200400 Allow Sasl mechanisms to be restricted
2019-07-31 Fei Yang JDK-8152545 Use preprocessor instead of compiling a program to generate native nio constants
2019-07-31 Zhengyu Gu JDK-8218558 NMT stack traces in output should show mt component for virtual memory allocations
2019-07-30 Severin Gehwolf JDK-8213561 ZipFile/MultiThreadedReadTest.java timed out in tier1
2019-07-30 Mario Torre JDK-8210863 Remove Xrandr include files from JDK sources
2019-07-29 Aleksey Shipilev JDK-8073154 NULL-pointer dereferencing in LIR_OpProfileType::print_instr
2019-07-29 Zhengyu Gu JDK-8217785 Padding ParallelTaskTerminator::_offered_termination variable
2019-07-29 Severin Gehwolf JDK-8075546 Add tiered testing definitions to the langtools repo
2019-07-26 Aleksey Shipilev JDK-8226543 Reduce GC pressure during message digest calculations in password-based encryption
2019-07-26 Fei Yang JDK-8146792 Predicate moved after partial peel may lead to broken graph
2019-07-20 Martin Balao JDK-8220513 Wrapper Key may get deleted when closing sessions in SunPKCS11 crypto provider
2019-07-19 Martin Balao JDK-8216597 SIGBUS in Java_sun_security_pkcs11_wrapper_PKCS11_getNativeKeyInfo after JDK-6913047
2019-07-19 Martin Balao JDK-6913047 Long term memory leak when using PKCS11 and JCE exceeds 32 bit process address space
2019-07-19 Andrew Hughes JDK-8228440 TestAESCiphers tests fail with "access denied" trying to access ArrayUtil
2019-07-19 Aleksey Shipilev JDK-8075136 Unnecessary sign extension for byte array access
2019-07-18 Aleksey Shipilev JDK-8228405 Incorrect format strings in PhaseIdealLoop::rc_predicate
2019-07-18 Paul Hohensee JDK-8185900 hotspot build failed with gcc version Red Hat 4.4.7-3
2019-07-18 Martin Balao JDK-6946830 javax.crypto.Cipher.doFinal behavior differs depending on platform
2019-07-18 Paul Hohensee JDK-8152856 Xcode 7.3 -Wshift-negative-value compile failure on Mac OS X
2019-07-16 Aleksey Shipilev JDK-8202252 (aio) Closed AsynchronousSocketChannel keeps completion handler alive
2019-07-16 Kazunori Ogata JDK-8188868 PPC64: Support AES intrinsics on Big Endian
2019-07-12 Martin Balao JDK-8221304 Problem list java/awt/FontMetrics/MaxAdvanceIsMax.java
2019-07-12 Martin Balao JDK-8218854 FontMetrics.getMaxAdvance may be less than the maximum FontMetrics.charWidth
2019-07-12 Martin Balao JDK-8214002 Cannot use italic font style if the font has embedded bitmap
2019-07-08 Severin Gehwolf JDK-8075573 Add jdk_other and jdk_svc to jdk tier 2 test definition
2019-07-08 Severin Gehwolf JDK-8075544 Add tiered testing definitions to the jdk repo
2019-07-07 Andrew Hughes JDK-8157792 After Integrating tzdata2016d the test/sun/util/calendar/zi/TestZoneInfo310.java fails for "Asia/Oral" and "Asia/Qyzylorda" Timezones
2019-07-06 Andrew Hughes JDK-8224560 (tz) Upgrade time-zone data to tzdata2019a
2019-07-04 Aleksey Shipilev JDK-8224580 Matcher can cause oop field/array element to be reloaded
2019-07-04 Aleksey Shipilev JDK-8218721 C1's CEE optimization produces safepoint poll with invalid debug information
2019-07-02 Aleksey Shipilev JDK-8214687 Optimize Collections.nCopies().hashCode() and equals()
2019-07-02 Aleksey Shipilev JDK-8151486 Class.forName causes memory leak
2019-07-01 Aleksey Shipilev JDK-8227018 CompletableFuture should not call Runtime.availableProcessors on fast path
2019-06-28 Severin Gehwolf JDK-8226928 [TESTBUG] test/java/net/NetworkInterface/IPv4Only.java fails intermittently on AIX
2019-06-27 Severin Gehwolf JDK-8222737 [TESTBUG] Allow for tier 1 like testing in OpenJDK 8u
2019-06-27 Severin Gehwolf JDK-8226870 OpenJDK 8u JRE contains clhsdb and hsdb launchers
2019-06-26 Severin Gehwolf JDK-8210761 libjsig is being compiled without optimization
2019-06-25 Andrew Hughes JDK-8195478 sun/text/resources/LocaleDataTest.java fails with java.lang.Exception
2019-06-24 Severin Gehwolf JDK-8226392 Launcher should not enable legacy stdio streams on GNU/Linux (glibc)
2019-06-22 Andrew Hughes JDK-8187946 Support ISO 4217 Amendments 163 and 164
2019-06-22 Andrew Hughes JDK-8193552 ISO 4217 Amendment #165 Update
2019-06-22 Andrew Hughes JDK-8177472 Remove hard-coded IANA Subtag Registry map in LocaleEquivalentMap.java
2019-06-22 Andrew Hughes JDK-8040211 Update LSR datafile for BCP 47
2019-06-22 Andrew Hughes JDK-8191404 Upgrading JDK with latest available LSR data from IANA.
2019-06-22 Andrew Hughes JDK-8203872 Upgrading JDK with latest available LSR data from IANA.
2019-06-19 Andrew Hughes JDK-8218781 Localized names for Japanese Era Reiwa in COMPAT provider
2019-06-19 Aleksey Shipilev JDK-6996807 FieldReflectorKey hash code computation can be improved
2019-06-19 Aleksey Shipilev JDK-8168417 Pending exceptions in java.base/windows/native/libnio
2019-06-18 Andrew Hughes JDK-8201317 X25519/X448 code improvements
2019-06-18 Andrew Hughes JDK-8203228 Branch-free output conversion for X25519 and X448
2019-06-18 Andrew Hughes JDK-8038392 Generating prelink cache breaks JAVA 'jinfo' utility normal behaviour
2019-06-18 Yasumasa Suenaga JDK-8225636 SA can't handle prelinked libraries
2019-06-17 Andrew Haley JDK-8225716 G1 GC: Undefined behaviour in G1BlockOffsetTablePart::block_at_or_preceding
2019-06-14 Paul Hohensee JDK-8181594 Efficient and constant-time modular arithmetic
2019-06-14 Paul Hohensee JDK-8208648 ECC Field Arithmetic Enhancements
2019-06-13 Aleksey Shipilev JDK-8205587 Implicit function declaration in jni_util.c
2019-06-12 Aleksey Shipilev JDK-8219807 C2 crash in IfNode::up_one_dom(Node*, bool)
2019-06-12 Andrew Hughes JDK-8182999 SunEC throws ProviderException on invalid curves
2019-06-12 Aleksey Shipilev JDK-8170494 JNI exception pending in PlainDatagramSocketImpl.c
2019-06-12 Aleksey Shipilev JDK-8197930 JNI exception pending in initializeEncoding of jni_util.c
2019-06-11 Fei Yang JDK-8147611 G1 - Missing memory barrier in start_cset_region_for_worker
2019-06-07 Hiroshi Horii JDK-8185979 PPC64: Implement SHA2 intrinsic
2019-06-05 Andrew Hughes JDK-8202353 os::readdir should use readdir instead of readdir_r
2019-06-04 Mario Torre JDK-8209775 ISO 4217 Amendment #169 Update
2019-06-04 Simon Tooke JDK-8193830 Xalan Update: Xalan Java 2.7.2
2019-06-04 Christoph Langer JDK-8044289 In ImageIO.write() and ImageIO.read() null stream is not handled properly.
2019-06-04 Martin Buchholz JDK-8225213 Backport jsr166 tck tests to jdk8u
2019-06-03 Xin Liu JDK-8222670 pathological case of JIT recompilation and code cache bloat
2019-06-03 Aleksey Shipilev JDK-8075939 Stream.flatMap() causes breaking of short-circuiting of terminal operations
2019-05-30 Paul Hohensee JDK-8225065 Revert 8221166 (8u backport of 8048782)
2019-05-30 Hiroshi Horii JDK-8185969 PPC64: Improve VSR support to use up to 64 registers
2019-05-29 Zhengyu Gu JDK-8196775 java/net/Socket/asyncClose/Race.java failed intermittently on Windows with ConnectException: Connection refused
2019-05-28 Roman Kennke JDK-8019816 [TEST_BUG][macosx] closed/java/awt/BasicStroke/DashZeroWidth.java not on EDT
2019-05-28 Roman Kennke JDK-8218020 Fix version number in mesa.md 3rd party legal file
2019-05-28 Zhengyu Gu JDK-8055705 Rename UnixPrintServiceLookup and Win32PrintServiceLookup as a platform neutral class name
2019-05-27 Dmitry Cherepanov JDK-8220495 Update GIFlib library to the 5.1.8
2019-05-27 Aleksey Shipilev JDK-8202414 Unsafe write after primitive array creation may result in array length change
2019-05-27 Simon Tooke JDK-8210886 Remove references in xwindows.md to non-existent files.
2019-05-27 Severin Gehwolf JDK-8151226 Mark UdpTest.java as intermittently failing
2019-05-27 Severin Gehwolf JDK-8143097 java/net/ipv6tests/UdpTest.java fails intermittently with "checkTime failed: got 1998 expected 4000"
2019-05-27 Christoph Langer JDK-8224727 Problem list test security/infra/java/security/cert/CertPathValidator/certification/ActalisCA.java
2019-05-25 Christoph Langer JDK-8202651 Test ComodoCA.java fails
2019-05-25 Zhengyu Gu JDK-8221412 lookupPrintServices() does not always update the list of Windows remote printers
2019-05-25 Zhengyu Gu JDK-8221263 [TEST_BUG] RemotePrinterStatusRefresh test is hard to use
2019-05-25 Zhengyu Gu JDK-8212202 [Windows] Exception if no printers are installed.
2019-05-24 Paul Hohensee JDK-8210985 Update the default SSL session cache size to 20480
2019-05-24 Zhengyu Gu JDK-8153732 Windows remote printer changes do not reflect in lookupPrintServices()
2019-05-24 Hiroshi Horii JDK-8166684 PPC64: implement intrinsic code with vector instructions for Unsafe.copyMemory()
2019-05-20 Christoph Langer JDK-8223499 Remove two DocuSign root certificates that are expiring
2019-05-18 Xin Liu JDK-8223537 testlibrary_tests/ctw/ClassesListTest.java fails with Agent timeout frequently
2019-05-18 Xin Liu JDK-8059575 JEP-JDK-8043304: Test task: Tiered Compilation level transition tests
2019-05-17 Severin Gehwolf JDK-8203190 SessionId.hashCode generates too many collisions
2019-05-16 Christoph Langer JDK-8222136 Remove two Comodo root CA certificates that are expiring
2019-05-15 Andrew Hughes JDK-8204929 Fonts with embedded bitmaps are not always rotated
2019-05-15 Christoph Langer JDK-8213213 Remove src/java.desktop/unix/classes/sun/awt/X11/keysym2ucs.h
2019-05-14 Paul Hohensee JDK-8223883 Fix jni.cpp copyright date after 8223528
2019-05-14 Severin Gehwolf JDK-8210425 [x86] sharedRuntimeTrig/sharedRuntimeTrans compiled without optimization
2019-05-14 Hiroshi Horii JDK-8158232 PPC64: improve byte, int and long array copy stubs by using VSX instructions
2019-05-14 Paul Hohensee JDK-8151322 Implement os::set_native_thread_name() on Solaris
2019-05-14 Paul Hohensee JDK-7102541 RFE: os::set_native_thread_name() cleanups
2019-05-13 Yasumasa Suenaga JDK-8144332 HSDB could not terminate when close button is pushed.
2019-05-10 Christoph Langer JDK-8223555 Cleanups in cacerts tests
2019-05-10 Paul Hohensee JDK-8223664 Add jtreg tests for 8223528, backport to jdk8u of 8176100
2019-05-08 Paul Hohensee JDK-8218674 HTML Tooltip with "img src=" on component doesn't show
2019-05-07 Fei Yang JDK-7100957 SOCKS proxying does not work with IPv6 connections
2019-05-06 Aleksey Shipilev JDK-8134030 test/serviceability/dcmd/gc/HeapDumpTest fails to verify the dump
2019-05-03 Aleksey Shipilev JDK-8217315 Proper units should print more significant digits
2019-05-02 Aleksey Shipilev JDK-8190974 Parallel stream execution within a custom ForkJoinPool should obey the parallelism
2019-05-02 Aleksey Shipilev JDK-8154387 Parallel unordered Stream.limit() tries to collect 128 elements even if limit is less
2019-05-02 Severin Gehwolf JDK-8210416 [linux] Poor StrictMath performance due to non-optimized compilation
2019-05-02 Christoph Langer JDK-8222137 Remove T-Systems root CA certificate
2019-05-02 Christoph Langer JDK-8216577 Add GlobalSign's R6 Root certificate
2019-05-02 Christoph Langer JDK-8195793 Remove GTE CyberTrust Global Root
2019-05-02 Christoph Langer JDK-8210432 Add additional TeliaSonera root certificate
2019-05-02 Christoph Langer JDK-8209506 Add Google Trust Services GlobalSign root certificates
2019-05-02 Christoph Langer JDK-8199779 Add T-Systems, GlobalSign and Starfield services root certificates
2019-05-02 Christoph Langer JDK-8195774 Add Entrust root certificates
2019-05-02 Christoph Langer JDK-8204923 Restore Symantec root verisignclass2g2ca
2019-05-02 Christoph Langer JDK-8196141 Add GoDaddy root certificates
2019-05-02 Christoph Langer JDK-8191031 Remove several Symantec Root CAs
2019-05-02 Christoph Langer JDK-8189949 Remove Baltimore Cybertrust Code Signing CA
2019-05-02 Christoph Langer JDK-8191844 Remove SECOM root (secomevrootca1)
2019-05-02 Christoph Langer JDK-8189131 Open-source the Oracle JDK Root Certificates
2019-05-02 Andrew Hughes JDK-8223219 Backport of JDK-8199552 to OpenJDK 8 leads to duplicate -fstack-protector flags, overriding --with-extra-cflags
2019-05-01 Steve Groeger JDK-8218152 [javac] fails and exits with no error if a bad annotation processor provided
2019-04-30 Aleksey Shipilev JDK-8151539 Remove duplicate AlwaysTrueClosures
2019-04-26 Dmitry Cherepanov JDK-8202768 [macos] Appkit thread slows when any Window Manager active
2019-04-25 Simon Tooke JDK-8222975 Fix 'release' file to reflect actual repo checkin used to compile JDK
2019-04-25 Andrew Hughes JDK-8222965 Backport of JDK-8129988 broke the build
2019-04-25 Xin Liu JDK-8205916 [test] Fix jdk/tools/launcher/RunpathTest to handle both, RPATH and RUNPATH
2019-04-22 Paul Hohensee JDK-8129988 JSSE should create a single instance of the cacerts KeyStore
2019-04-12 Paul Hohensee JDK-8206955 MethodHandleProxies.asInterfaceInstance does not support default methods
2019-04-12 Severin Gehwolf JDK-8055814 [TESTBUG] runtime/NMT/NMTWithCDS.java fails with product builds due to missing UnlockDiagnosticVMOptions
2019-04-11 Paul Hohensee JDK-8176100 [REDO][REDO] G1 Needs pre barrier on dereference of weak JNI handles
2019-04-11 Paul Hohensee JDK-8150013 ParNew: Prune nmethods scavengable list
2019-04-10 Severin Gehwolf JDK-8221355 Performance regression after JDK-8155635 backport into 8u
2019-04-08 Aleksey Shipilev JDK-8220349 The fix done for JDK-8214253 have caused issues in JTree behaviour
2019-04-03 Andrew Hughes JDK-8219890 Calendar.getDisplayName() returns empty string for new Japanese Era on some locales
2019-04-02 Andrew Hughes JDK-8208656 Move java/util/Calendar/CalendarTestScripts tests into OpenJDK
2019-04-02 Andrew Hughes JDK-8205432 Replace the placeholder Japanese era name
2019-04-01 Simon Tooke JDK-8216354 Syntax error in toolchain_windows.m4
2019-04-01 Gustavo Romero JDK-8154156 PPC64: improve array copy stubs by using vector instructions
2019-03-30 Andrew Hughes JDK-8197546 Fix for 8171000 breaks Solaris + Linux builds
2019-03-29 Andrew Hughes JDK-8200115 System property java.vm.vendor value includes quotation marks
2019-03-28 Zhengyu Gu JDK-8171000 Robot.createScreenCapture() crashes in wayland mode
2019-03-28 Daisy Zhou JDK-8214770 java/time/test/java/time/format/TestNonIsoFormatter.java failed in non-english locales.
2019-03-27 Paul Hohensee JDK-8207760 SAXException: Invalid UTF-16 surrogate detected: d83c ?
2019-03-25 Deepak Kejriwal JDK-8210633 Cannot parse JapaneseDate string with DateTimeFormatterBuilder Mapped-values
2019-03-25 Deepak Kejriwal JDK-8042131 DateTimeFormatterBuilder Mapped-values do not work for JapaneseDate
2019-03-25 Aleksey Shipilev JDK-8217597 [TESTBUG] runtime/containers/docker/TestCPUAwareness.java fails in docker not supporting --cpus
2019-03-20 Xin Liu JDK-8192854 FONTCONFIG_CFLAGS missing from spec.gmk.in
2019-03-20 Aleksey Shipilev JDK-8220718 Missing ResourceMark in nmethod::metadata_do
2019-03-20 Aleksey Shipilev JDK-8025209 Intermittent test failure java/net/Socket/asyncClose/AsyncClose.java
2019-03-20 Aleksey Shipilev JDK-8031113 TEST_BUG: java/nio/channels/AsynchronousChannelGroup/Basic.java fails intermittently
2019-03-20 Aleksey Shipilev JDK-8031563 TEST_BUG: java/nio/channels/Selector/ChangingInterests.java failed once
2019-03-20 Aleksey Shipilev JDK-8022879 TEST_BUG: sun/nio/cs/MalformedSurrogates.java fails intermittently
2019-03-20 Aleksey Shipilev JDK-8030690 TEST_BUG java/nio/Buffer/Chars.java fails intermittently
2019-03-20 Aleksey Shipilev JDK-8031666 TEST_BUG: java/net/ipv6tests/UdpTest.java failed because of SocketTimeoutException
2019-03-20 Aleksey Shipilev JDK-8217263 Automate DashOffset test
2019-03-20 Aleksey Shipilev JDK-8156035 Remove intermittent key from sun/security/rsa/SpecTest.java
2019-03-20 Aleksey Shipilev JDK-8137231 sun/security/rsa/SpecTest.java timeout with Agent error: java.lang.Exception
2019-03-20 Aleksey Shipilev JDK-8151225 Mark SpecTest.java as intermittently failing
2019-03-20 Aleksey Shipilev JDK-8073078 java/nio/file/FileStore/Basic.java sensitive to NFS configuration
2019-03-20 Aleksey Shipilev JDK-8157287 java/nio/file/FileStore/Basic.java failed with "java.nio.file.AccessDeniedException : /zones/zoneone/root "
2019-03-19 Paul Hohensee JDK-8048782 OpenJDK: PiscesCache : xmax/ymax rounding up can cause RasterFormatException
2019-03-19 Aleksey Shipilev JDK-8214112 The whole text in target JPasswordField image are not selected.
2019-03-19 Aleksey Shipilev JDK-8209951 Problematic sparc intrinsic: com.sun.crypto.provider.CipherBlockChaining
2019-03-19 Aleksey Shipilev JDK-8214111 There is no icon in all JOptionPane target image
2019-03-19 Aleksey Shipilev JDK-8214109 XToolkit is not correctly displayed color on 16-bit high color setting
2019-03-19 Aleksey Shipilev JDK-8214252 Expanded & Collapsed nodes of a JTree look the same on GTK3
2019-03-18 Aleksey Shipilev JDK-8214253 Tooltip is transparent rather than having a black background
2019-03-18 Aleksey Shipilev JDK-8214765 All TrayIcon MessageType icons does not show up with gtk3 option set
2019-03-18 Aleksey Shipilev JDK-8203627 Swing applications with JRadioButton and JCheckbox fail to render correctly when using GTK3 and the GTK L&F
2019-03-18 Aleksey Shipilev JDK-8218472 JProgressBar display issue with GTKLookAndFeel
2019-03-18 Aleksey Shipilev JDK-8218470 JScrollBar display issue with GTKLookAndFeel
2019-03-18 Aleksey Shipilev JDK-8218469 JSlider display issue with slider for GTKLookAndFeel
2019-03-18 Aleksey Shipilev JDK-8218473 JOptionPane display issue with GTKLookAndFeel
2019-03-18 Aleksey Shipilev JDK-8218479 JTextPane display issue with GTKLookAndFeel
2019-03-15 Andrew Hughes JDK-8220641 [TESTBUG] New test KdcPolicy.java introduced by JDK-8164656 needs same change as JDK-8190690
2019-03-13 Severin Gehwolf JDK-8213983 [macosx] Keyboard shortcut “cmd +`” stops working properly if popup window is displayed
2019-03-12 Andrew Haley JDK-8215976 OpenJDK fails to build with GCC 8.2 when the #include inside zip.cpp comes from a non-sysroot path
2019-03-11 Andrew Hughes JDK-8193764 Cannot set COMPANY_NAME when configuring a build
2019-03-11 Andrew Hughes JDK-8220397 REGRESSION: JDK-8036003 backport regresses no_strip builds
2019-03-11 Andrew Hughes JDK-8217753 Remove Linux version check from HotSpot builds
2019-03-07 Paul Hohensee JDK-8217305 Missing 0 in java.dll file version cause issues with patch management software
2019-03-07 Christoph Langer JDK-8211106 [windows] Update OS detection code to recognize Windows Server 2019
2019-03-06 Paul Hohensee JDK-8133731 [TEST_BUG] Unmappable in ASCII character such as Thai should be escaped in the regtests targeted for a regular non-I18n runs
2019-03-06 Paul Hohensee JDK-8133108 [PIT] Container size is wrong in JEditorPane
2019-03-06 Paul Hohensee JDK-8132136 [PIT] RTL orientation in JEditorPane is broken
2019-03-06 Paul Hohensee JDK-8077608 [TESTBUG] Enable Hotspot jtreg tests to run in agentvm mode
2019-03-06 Andrew Hughes JDK-7127191 SA JSDB does not display native symbols correctly for transported Linux cores
2019-03-06 Severin Gehwolf JDK-8164656 krb5 does not retry if TCP connection timeouts
2019-03-06 Andrew Hughes JDK-8133802 replace some tags (obsolete in html5) in security-libs docs
2019-03-06 Andrew Hughes JDK-8175120 Remove old tests on kdc timeout policy
2019-03-06 Aleksey Shipilev JDK-8213825 assert(false) failed: Non-balanced monitor enter/exit! Likely JNI locking
2019-03-05 Paul Hohensee JDK-8180904 Hotspot tests running with -agentvm failing due to classpath
2019-03-04 Deepak Kejriwal JDK-8217609 New era placeholder not recognized by java.text.SimpleDateFormat
2019-03-01 Dmitry Cherepanov JDK-8170681 Remove fontconfig header files from JDK source tree
2019-03-01 Andrew Hughes JDK-8189761 COMPANY_NAME, IMPLEMENTOR, BUNDLE_VENDOR, VENDOR, but no configure flag
2019-03-01 Simon Tooke JDK-8195153 [test] runtime/6981737/Test6981737.java shouldn't check 'java.vendor' and 'java.vm.vendor' properties
2019-03-01 Aleksey Shipilev JDK-8148928 java/util/stream/test/**/SequentialOpTest.java timed out intermittently
2019-03-01 Goetz Lindenmaier JDK-8219961 [ppc64] Increase code size for interpreter generation.
2019-02-28 Paul Hohensee JDK-8218915 Change isJavaIdentifierStart and isJavaIdentifierPart to handle new code points
2019-02-28 Paul Hohensee JDK-8180469 Wrong short form text for supplemental Japanese era
2019-02-28 Paul Hohensee JDK-8202088 Japanese new era implementation
2019-02-28 Paul Hohensee JDK-8206120 Add test cases for lenient Japanese era parsing
2019-02-28 Paul Hohensee JDK-8207152 Placeholder for Japanese new era should be two characters
2019-02-28 Paul Hohensee JDK-8211398 Square character support for the Japanese new era
2019-02-28 Paul Hohensee JDK-8217710 Add 5 currency code points to Java SE 8uX
2019-02-27 Aleksey Shipilev JDK-8076458 java/util/stream/test/org/openjdk/tests/java/util/stream/FlatMapOpTest.java timeout
2019-02-27 Aleksey Shipilev JDK-8044047 Missing null pointer checks for streams
2019-02-27 Aleksey Shipilev JDK-8068269 RTM tests that assert on non-zero lock statistics are too strict in RTMTotalCountIncrRate > 1 cases
2019-02-27 Paul Hohensee JDK-8076164 [JTextField] When input too long Thai character, cursor's behavior is odd
2019-02-27 Paul Hohensee JDK-8043387 java/time/test/java/util/TestFormatter.java failed.
2019-02-26 Paul Hohensee JDK-8216280 Allow later Symantec Policy distrust date for two Apple SubCAs
2019-02-26 Paul Hohensee JDK-8207258 Distrust TLS server certificates anchored by Symantec Root CAs
2019-02-26 Aleksey Shipilev JDK-8200109 NMT: diff_malloc_site assert(early->flags() == current->flags(), "Must be the same memory type")
2019-02-26 Aleksey Shipilev JDK-8076274 [TESTBUG] Remove @ignore from runtime\NMT\JcmdDetailDiff.java
2019-02-26 Aleksey Shipilev JDK-8028254 gc/arguments/TestMinInitialErgonomics.java failed with unexpected initial heap size
2019-02-25 Severin Gehwolf JDK-8139803 Fix for 8132985 breaks OpenJDK build on windows.
2019-02-25 Severin Gehwolf JDK-8132985 Crash in freetypescaler.c due to double free
2019-02-25 Aleksey Shipilev JDK-8211382 ISO2022JP and GB18030 NIO converter issues
2019-02-25 Aleksey Shipilev JDK-8187364 Unable to enter zero width non-joiner (ZWNJ) symbol in Swing text component
2019-02-25 Aleksey Shipilev JDK-8219636 Windows build failure after JDK-8207070 8u backport
2019-02-25 Aleksey Shipilev JDK-8213154 Update copyright headers of files in src tree that are missing Classpath exception
2019-02-23 Paul Hohensee JDK-8080932 [TEST_BUG] Test java/awt/BasicStroke/DashStrokeTest.java fails with Bad script error due to improper @run notation
2019-02-22 Martin Balao JDK-8211435 Exception in thread "AWT-EventQueue-1" java.lang.IllegalArgumentException: null source
2019-02-22 Paul Hohensee JDK-8129822 Define "headful" jtreg keyword
2019-02-22 Christoph Langer JDK-8214189 test/hotspot/jtreg/compiler/intrinsics/mathexact/MulExactLConstantTest.java fails on Windows x64 when run with -XX:-TieredCompilation
2019-02-22 Christoph Langer JDK-8207070 Webstart app popup on wrong screen in a one-screen setup changing to multi-monitor
2019-02-22 Christoph Langer JDK-8213583 Error while opening the JFileChooser when desktop contains shortcuts pointing to deleted files
2019-02-22 Christoph Langer JDK-8215364 JavaFX crashes on Ubuntu 18.04 with Wayland while using Swing-FX interop
2019-02-22 Christoph Langer JDK-8217579 TLS_EMPTY_RENEGOTIATION_INFO_SCSV is disabled after 8211883
2019-02-22 Christoph Langer JDK-8027434 "-XX:OnOutOfMemoryError" uses fork instead of vfork
2019-02-22 Christoph Langer JDK-8204142 AWT hang occurs when sequenced events arrive out of sequence in multiple AppContexts.
2019-02-22 Christoph Langer JDK-8213952 Relax DNSName restriction as per RFC 1123