PUSHES REPORT: 11.0.12

This report shows who pushed the backports to the given release. This usually shows who did the backporting, testing, and review work.

Report generated: Tue Nov 01 05:55:54 CET 2022

Distribution by priority

Count Priority
1 P1
21 P2
123 P3
132 P4
1 P5

Distribution by components

Count Component
278 100% Total
154 55.4% hotspot
91 32.7% hotspot/compiler
37 13.3% hotspot/runtime
11 4.0% hotspot/jfr
10 3.6% hotspot/gc
2 0.7% hotspot/jvmti
2 0.7% hotspot/test
1 0.4% hotspot/svc-agent
40 14.4% client-libs
14 5.0% client-libs/2d
9 3.2% client-libs/java.awt
6 2.2% client-libs
6 2.2% client-libs/javax.swing
3 1.1% client-libs/javax.accessibility
1 0.4% client-libs/javax.sound
1 0.4% client-libs/javax.imageio
31 11.2% security-libs
14 5.0% security-libs/java.security
8 2.9% security-libs/javax.net.ssl
3 1.1% security-libs/javax.crypto:pkcs11
2 0.7% security-libs/jdk.security
2 0.7% security-libs
2 0.7% security-libs/org.ietf.jgss:krb5
29 10.4% core-libs
10 3.6% core-libs/java.net
7 2.5% core-libs/java.util:i18n
4 1.4% core-libs/java.lang
4 1.4% core-libs/java.nio
2 0.7% core-libs/javax.naming
1 0.4% core-libs/java.util.logging
1 0.4% core-libs
12 4.3% tools
7 2.5% tools/jshell
2 0.7% tools/javac
2 0.7% tools/jlink
1 0.4% tools/launcher
6 2.2% infrastructure
4 1.4% infrastructure/build
2 0.7% infrastructure
3 1.1% core-svc
1 0.4% core-svc/java.lang.instrument
1 0.4% core-svc/debugger
1 0.4% core-svc/java.lang.management
3 1.1% xml
3 1.1% xml/jaxp

Distribution by affiliation

This Release Pushes

Original Pushes

Count Committer
277 100% Total
95 34.3% SAP
54 19.5% Martin Doerr
16 5.8% Matthias Baesken
10 3.6% Thomas Stuefe
9 3.2% Goetz Lindenmaier
4 1.4% Richard Reingruber
2 0.7% Christoph Langer
76 27.4% Red Hat
55 19.9% Aleksey Shipilev
8 2.9% Roland Westrelin
7 2.5% Severin Gehwolf
2 0.7% Andrew Haley
2 0.7% Martin Balao
1 0.4% Andrew Dinn
1 0.4% Andrew Hughes
32 11.6% Independent
19 6.9% Vladimir Kempik
12 4.3% Zhengyu Gu
1 0.4% Vyom Tewari
28 10.1% BellSoft
28 10.1% Alexandr Scherbatiy
27 9.7% Amazon
27 9.7% Paul Hohensee
8 2.9% @iscas.ac.cn
8 2.9% Fei Yang
6 2.2% Azul
6 2.2% Yuri Nesterenko
2 0.7% DataDog
2 0.7% Jaroslav Bachorík
1 0.4% @amazon.de
1 0.4% Roman Kennke
1 0.4% Google
1 0.4% Jiangli Zhou
1 0.4% Oracle
1 0.4% Ramanand Patil
Count Committer
277 100% Total
119 43.0% Oracle
13 4.7% Philip Race
9 3.2% Weijun Wang
6 2.2% Nils Eliasson
6 2.2% Naoto Sato
5 1.8% Tobias Hartmann
4 1.4% Daniel Fuchs
4 1.4% Robert Field
4 1.4% Jan Lahoda
4 1.4% Vladimir Kozlov
4 1.4% Christian Hagedorn
3 1.1% Markus Grönlund
3 1.1% Brian Burkhalter
3 1.1% Roberto Castaneda Lozano
3 1.1% Joe Wang
2 0.7% Jayathirth D V
2 0.7% Roger Riggs
2 0.7% Kim Barrett
2 0.7% Alexander Zuev
2 0.7% Fernando Guallini
2 0.7% Rajan Halade
2 0.7% Alexey Ivanov
2 0.7% Harold Seigel
2 0.7% Vladimir Ivanov
1 0.4% Sibabrata Sahoo
1 0.4% Sean Mullan
1 0.4% Calvin Cheung
1 0.4% Gerard Ziemski
1 0.4% Jamsheed C M
1 0.4% Valerie Peng
1 0.4% Rickard Backman
1 0.4% Ambarish Rapte
1 0.4% Dean Long
1 0.4% Erik Joelsson
1 0.4% Thomas Schatzl
1 0.4% Patric Hedlin
1 0.4% Prajwal Kumaraswamy
1 0.4% Erik Gahlin
1 0.4% Pankaj Bansal
1 0.4% David Holmes
1 0.4% Vicente Arturo Romero Zaldivar
1 0.4% Igor Veresov
1 0.4% Prasanta Sadhukhan
1 0.4% Coleen Phillimore
1 0.4% Igor Ignatyev
1 0.4% Dmitry Markov
1 0.4% Daniil Titov
1 0.4% Sergey Kuksenko
1 0.4% Joe Darcy
1 0.4% Evan Whelan
1 0.4% Bradford Wetmore
1 0.4% Jesper Wilhelmsson
1 0.4% Mikael Vidstedt
1 0.4% Robbin Ehn
46 16.6% SAP
13 4.7% Thomas Stuefe
12 4.3% Matthias Baesken
12 4.3% Lucy Schmidt
3 1.1% Goetz Lindenmaier
3 1.1% Richard Reingruber
2 0.7% Christoph Langer
1 0.4% Martin Doerr
24 8.7% Red Hat
8 2.9% Aleksey Shipilev
6 2.2% Roland Westrelin
3 1.1% Severin Gehwolf
2 0.7% Andrew Haley
2 0.7% Martin Balao
1 0.4% Andrew Leonard
1 0.4% Jonathan Dowland
1 0.4% Jie Kang
16 5.8% Amazon
9 3.2% Sergey Bylokhov
3 1.1% Paul Hohensee
1 0.4% Clive Verghese
1 0.4% ec2-user
1 0.4% eastig
1 0.4% Volker Simonis
15 5.4% ARM
9 3.2% Ningsheng Jian
4 1.4% Nick Gasson
2 0.7% Pengfei Li
14 5.1% BellSoft
6 2.2% Boris Ulasevich
5 1.8% Dmitrij Pochepko
3 1.1% Dmitry Chuyko
10 3.6% Independent
3 1.1% Zhengyu Gu
2 0.7% Vladimir Kempik
2 0.7% Bernard Blaser
1 0.4% Rahul Raghavan
1 0.4% 30433125+djelinski
1 0.4% Vyom Tewari
4 1.4% NTT DATA
4 1.4% Yasumasa Suenaga
4 1.4% Tencent
3 1.1% Jie Fu
1 0.4% Hui Shi
3 1.1% @iscas.ac.cn
3 1.1% Fei Yang
3 1.1% Azul
1 0.4% Alexey Bakhtin
1 0.4% Anton Kozlov
1 0.4% Olga Mikhaltcova
3 1.1% Intel
1 0.4% Sandhya Viswanathan
1 0.4% Jatin Bhateja
1 0.4% Vivek Deshpande
3 1.1% Microdoc
3 1.1% Christoph Göttschkes
2 0.7% @global.tencent.com
2 0.7% Xuelei Fan
2 0.7% DataDog
2 0.7% Jaroslav Bachorík
2 0.7% Facebook
2 0.7% Ziyi Luo
2 0.7% Google
1 0.4% Man Cao
1 0.4% Jiangli Zhou
2 0.7% Huawei
1 0.4% Dong Bo
1 0.4% Hamlin Li
2 0.7% Unknown
2 0.7% N/A
1 0.4% Alibaba
1 0.4% kuaiwei.kw

Chronological push log:

Days Ago This Release Push By Original Push By Bug Summary
Name Affiliation Name Affiliation
494 Christoph Langer SAP Rajan Halade Oracle JDK-8269291 LetsEncryptCA.java test fails as Let’s Encrypt Authority X3 is retired
517 Goetz Lindenmaier SAP Markus Grönlund Oracle JDK-8268022 OldObjectSample events too expensive
517 Severin Gehwolf Red Hat Jie Kang Red Hat JDK-8268027 JFR EventWriter does not use first string from StringPool with id 0
518 Martin Doerr SAP N/A Unknown JDK-8267975 Revert the change to the default PKCS12 macAlgorithm and macIterationCount props for 11u/8u/7u
521 Matthias Baesken SAP Weijun Wang Oracle JDK-8267925 sun/security/mscapi tests fail with "Key pair not generated, alias already exists"
521 Vladimir Kempik Independent Alexey Bakhtin Azul JDK-8267913 NullPointerException in sun.security.ssl.HKDF.extract(HKDF.java:93)
522 Paul Hohensee Amazon eastig Amazon JDK-8267864 Enable sun/security/pkcs11 tests for Amazon Linux 2 AArch64
522 Paul Hohensee Amazon Yasumasa Suenaga NTT DATA JDK-8267863 GCC 10 warnings -Wtype-limits with JFR code
523 Martin Balao Red Hat Martin Balao Red Hat JDK-8267797 Handle multiple slots in the NSS Internal Module from SunPKCS11's Secmod
524 Martin Doerr SAP Sergey Bylokhov Amazon JDK-8267722 javax/swing/text/JTextComponent/5074573/bug5074573.java fails
524 Zhengyu Gu Independent Zhengyu Gu Independent JDK-8267561 Shenandoah: Reference processing not properly setup for outside of cycle degenerated GC
524 Severin Gehwolf Red Hat Severin Gehwolf Red Hat JDK-8266929 Unable to use algorithms from 3p providers
524 Martin Doerr SAP Jan Lahoda Oracle JDK-8267693 Paste locks up jshell
524 Paul Hohensee Amazon Paul Hohensee Amazon JDK-8267641 [11u] 8227609 backport typo
525 Vladimir Kempik Independent Vladimir Kempik Independent JDK-8267622 [macos_aarch64] InterpreterRuntime::throw_pending_exception messing up LR results in crash
525 Jaroslav Bachorík DataDog Jaroslav Bachorík DataDog JDK-8267619 SIGSEGV at MethodIteratorHost
525 Yuri Nesterenko Azul Brian Burkhalter Oracle JDK-8267615 (fs) Files.newInputStream(...).skip(n) should allow skipping beyond file size
528 Yuri Nesterenko Azul Brian Burkhalter Oracle JDK-8267533 (fs) Files.newInputStream(...).skip(n) is slow
529 Zhengyu Gu Independent Aleksey Shipilev Red Hat JDK-8267499 Shenandoah: Round up region size to page size unconditionally
529 Vladimir Kempik Independent Alexander Zuev Oracle JDK-8267498 Bad JNI lookup getFocusOwner in accessibility code on macOS
529 Vladimir Kempik Independent Philip Race Oracle JDK-8267497 [macOS] Incorrect JNI parameters in number conversion in A11Y code
529 Vladimir Kempik Independent Alexander Zuev Oracle JDK-8267496 [macOS] Bad JNI lookup error : Accessible actions do not work on macOS
529 Vladimir Kempik Independent Philip Race Oracle JDK-8267495 Bad JNI lookup during printing
529 Vladimir Kempik Independent Philip Race Oracle JDK-8267494 Remove JNF dependency from libsaproc/MacosxDebuggerLocal.m
529 Vladimir Kempik Independent Philip Race Oracle JDK-8267493 Missed JNFInstanceOf -> IsInstanceOf conversion
529 Vladimir Kempik Independent Philip Race Oracle JDK-8267492 Removing remaining JNF dependencies in the java.desktop module
529 Vladimir Kempik Independent Philip Race Oracle JDK-8267491 [macOS] Remove desktop module dependencies on JNF Reference APIs
529 Vladimir Kempik Independent Philip Race Oracle JDK-8267490 [macOS] Replace JNF_COCOA_ENTER/EXIT macros
529 Vladimir Kempik Independent Philip Race Oracle JDK-8267489 [macOS] Update JNI error handling in Cocoa code.
529 Vladimir Kempik Independent Philip Race Oracle JDK-8267488 Remove dependencies on JNF's JNI utility functions in AWT and 2D code
529 Vladimir Kempik Independent Weijun Wang Oracle JDK-8267487 [macOS]: Remove JNF dependency from libosxkrb5/SCDynamicStoreConfig.m
529 Vladimir Kempik Independent Weijun Wang Oracle JDK-8267486 [macOS]: Remove JNF dependency from libosxsecurity/KeystoreImpl.m
529 Fei Yang @iscas.ac.cn Vicente Arturo Romero Zaldivar Oracle JDK-8267482 ClassReader::adjustMethodParams can potentially return null if the args list is empty
529 Martin Doerr SAP Andrew Leonard Red Hat JDK-8266818 Enable AIX build platform to make external debug symbols
529 Martin Doerr SAP Weijun Wang Oracle JDK-8267454 keytool still prompt for store password on a password-less pkcs12 file if -storetype pkcs12 is specified
529 Martin Doerr SAP Weijun Wang Oracle JDK-8267453 Key protection using PBEWithMD5AndDES fails with "java.security.InvalidAlgorithmParameterException: Salt must be 8 bytes long"
529 Martin Doerr SAP Yasumasa Suenaga NTT DATA JDK-8254634 Build failure with VS 2019 (16.5.0) due to C2039 and C2873
529 Matthias Baesken SAP Matthias Baesken SAP JDK-8267441 Adjust problematic String.format calls in jdk/internal/util/Preconditions.java outOfBoundsMessage
530 Thomas Stuefe SAP Thomas Stuefe SAP JDK-8267438 Improve stringStream buffer handling
530 Thomas Stuefe SAP Thomas Stuefe SAP JDK-8267437 SafeFetch may crash if invoked in non-JavaThreads
530 Thomas Stuefe SAP Thomas Stuefe SAP JDK-8267436 [Windows] Structured Exception Catcher missing around gtest execution
530 Martin Doerr SAP Jie Fu Tencent JDK-8267420 Some vmTestbase/nsk/monitoring/RuntimeMXBean tests fail with hostnames starting from digits
532 Andrew Dinn Red Hat Nils Eliasson Oracle JDK-8266894 Unreachable nodes keep speculative types alive
532 Roland Westrelin Red Hat Tobias Hartmann Oracle JDK-8267227 C2's conditional move optimization does not handle top Phi
535 Matthias Baesken SAP Yasumasa Suenaga NTT DATA JDK-8267157 Clean up GCC 8.3 errors in LittleCMS
535 Matthias Baesken SAP Yasumasa Suenaga NTT DATA JDK-8267156 HotSpot build failed with GCC 9.2.1
535 Matthias Baesken SAP Matthias Baesken SAP JDK-8267154 avoid maybe-uninitialized gcc warnings on linux s390x
535 Alexandr Scherbatiy BellSoft Boris Ulasevich BellSoft JDK-8267147 AArch64: save two words in itable lookup stub
535 Alexandr Scherbatiy BellSoft Boris Ulasevich BellSoft JDK-8267146 AArch64: more L2I conversions can be skipped
537 Paul Hohensee Amazon Erik Gahlin Oracle JDK-8267053 JFR: Could not create chunk in repository with over 200 recordings
537 Paul Hohensee Amazon Ziyi Luo Facebook JDK-8267052 RsaPrivateKeySpec is always recognized as RSAPrivateCrtKeySpec in RSAKeyFactory.engineGetKeySpec
537 Paul Hohensee Amazon Ziyi Luo Facebook JDK-8267051 isAssignableFrom checks in KeyFactorySpi.engineGetKeySpec appear to be backwards
537 Zhengyu Gu Independent Calvin Cheung Oracle JDK-8266708 CDS/appCDS tests failed on Windows due to long path to a classlist file
537 Martin Doerr SAP Martin Doerr SAP JDK-8267029 [C2] Hoisting of DecodeN leaves MachTemp inputs behind
537 Martin Doerr SAP Weijun Wang Oracle JDK-8267028 Upgrade the default PKCS12 encryption/MAC algorithms
537 Severin Gehwolf Red Hat Severin Gehwolf Red Hat JDK-8266713 [AIX] Build failure after 11u backport of JDK-8247753
538 Fei Yang @iscas.ac.cn Man Cao Google JDK-8266922 ASAN build broken
538 Zhengyu Gu Independent Zhengyu Gu Independent JDK-8266917 Shenandoah: Shenandoah heap region count could be off by 1
538 Zhengyu Gu Independent David Holmes Oracle JDK-8266915 [TESTBUG] runtime/NMT/CheckForProperDetailStackTrace.java fails with Expected stack trace missing from output
538 Alexandr Scherbatiy BellSoft Boris Ulasevich BellSoft JDK-8266896 AArch64: I2L/L2I conversions can be skipped for masked positive values
539 Thomas Stuefe SAP Thomas Stuefe SAP JDK-8266880 Extend settings printout in jcmd VM.metaspace
539 Thomas Stuefe SAP Thomas Stuefe SAP JDK-8266879 Trace resource exhausted events unconditionally
539 Thomas Stuefe SAP Thomas Stuefe SAP JDK-8266878 java/lang/instrument/PremainClass/InheritAgent0100.java times out
542 Alexandr Scherbatiy BellSoft Boris Ulasevich BellSoft JDK-8266718 Need to eliminate excessive i2l conversions
542 Alexandr Scherbatiy BellSoft Boris Ulasevich BellSoft JDK-8266717 compiler/c2/TestBit.java failed "RuntimeException: 'test' missing from stdout/stderr"
542 Alexandr Scherbatiy BellSoft Boris Ulasevich BellSoft JDK-8266716 IdealGraph bit check expression canonicalization
542 Alexandr Scherbatiy BellSoft Nick Gasson ARM JDK-8266715 AArch64: Add support for SqrtVF
543 Paul Hohensee Amazon Aleksey Shipilev Red Hat JDK-8266635 x86_32 build failures after JDK-8226721 (Missing intrinsics for Math.ceil, floor, rint)
543 Paul Hohensee Amazon Nils Eliasson Oracle JDK-8266634 Missing intrinsics for Math.ceil, floor, rint
543 Martin Doerr SAP Mikael Vidstedt Oracle JDK-8266632 Remove unused JIMAGE_ResourcePath
543 Matthias Baesken SAP Dmitry Chuyko BellSoft JDK-8266617 JDWP: Unforseen output truncation in logging
543 Matthias Baesken SAP Dmitry Chuyko BellSoft JDK-8266616 GCC 8 compilation error in libjli
544 Paul Hohensee Amazon Vladimir Kempik Independent JDK-8266602 Fix issues with cross-compile on macos
544 Vladimir Kempik Independent Sergey Bylokhov Amazon JDK-8266597 [macOS] All Swing/AWT apps cause Allow Notifications prompt to appear when app is launched
545 Ramanand Patil Oracle Pankaj Bansal Oracle JDK-8266535 UIManager.getSytemLookAndFeelClassName() returns wrong value on Fedora 32
545 Goetz Lindenmaier SAP Goetz Lindenmaier SAP JDK-8261020 Wrong format parameter in create_emergency_chunk_path
545 Alexandr Scherbatiy BellSoft ec2-user Amazon JDK-8266482 handle ContendedPaddingWidth in vm_version_aarch64
545 Vladimir Kempik Independent Brian Burkhalter Oracle JDK-8266481 DirectIOTest fails on a system with large block size
545 Aleksey Shipilev Red Hat Fernando Guallini Oracle JDK-8266478 Harden TLS interop tests
545 Aleksey Shipilev Red Hat Sergey Bylokhov Amazon JDK-8266477 Test should not use System.exit
545 Aleksey Shipilev Red Hat Roger Riggs Oracle JDK-8266476 java/lang/ProcessHandle/PermissionTest.java fails with TestNG 7.1
545 Aleksey Shipilev Red Hat Christoph Göttschkes Microdoc JDK-8266475 java/lang/String/StringRepeat.java test is missing a memory requirement
546 Paul Hohensee Amazon Thomas Schatzl Oracle JDK-8265693 G1 adaptive IHOP does not account for reclamation of humongous objects by young GC
546 Paul Hohensee Amazon Paul Hohensee Amazon JDK-8265692 G1 old gen allocation tracking is not in a separate class
546 Aleksey Shipilev Red Hat Aleksey Shipilev Red Hat JDK-8266425 Use the latest Ubuntu base image version in Docker testing
546 Aleksey Shipilev Red Hat Sergey Bylokhov Amazon JDK-8266424 java.lang.NullPointerException: HDC for component at sun.java2d.loops.Blit.Blit
549 Martin Doerr SAP Jan Lahoda Oracle JDK-8266378 ToolBasicTest fails to access HTTP server it starts
550 Martin Doerr SAP Philip Race Oracle JDK-8266302 java/awt/FontClass/CreateFont/DeleteFont.sh is unstable
550 Martin Doerr SAP Prasanta Sadhukhan Oracle JDK-8266301 [macOS] javax/swing/JFrame/NSTexturedJFrame/NSTexturedJFrame.java
551 Jaroslav Bachorík DataDog Jaroslav Bachorík DataDog JDK-8265750 Fatal error in safepoint.cpp after backport of 8258414
551 Martin Doerr SAP Lucy Schmidt SAP JDK-8266223 [s390] Improve Hardware Feature Detection And Reporting
551 Martin Doerr SAP Lucy Schmidt SAP JDK-8266221 [s390] Support latest hardware (z14 and z15)
551 Martin Doerr SAP Lucy Schmidt SAP JDK-8266215 [s390] jtreg test failure after JDK-8238696: not conformant features string
551 Richard Reingruber SAP Richard Reingruber SAP JDK-8265677 CMS: CardTableBarrierSet::write_ref_array_work() lacks storestore barrier
552 Yuri Nesterenko Azul Anton Kozlov Azul JDK-8266046 CMS ParScanClosure misses a barrier
553 Alexandr Scherbatiy BellSoft Dong Bo Huawei JDK-8266006 AArch64: Implement Base64.encodeBlock accelerator/intrinsic
553 Aleksey Shipilev Red Hat Aleksey Shipilev Red Hat JDK-8265537 x86 version string truncated after JDK-8249672 11u backport
553 Aleksey Shipilev Red Hat Sergey Bylokhov Amazon JDK-8265996 Test OwnedWindowsLeak.java intermittently fails
553 Martin Doerr SAP Roland Westrelin Red Hat JDK-8265960 C2 compilation fails with assert(!had_error) failed: bad dominance
553 Martin Doerr SAP Sergey Bylokhov Amazon JDK-8265959 SoftMainMixer.processAudioBuffers(): Wrong handling of stoppedMixers
553 Aleksey Shipilev Red Hat Jie Fu Tencent JDK-8265950 [TESTBUG] TestUseSHA512IntrinsicsOptionOnSupportedCPU.java fails on x86_32
553 Aleksey Shipilev Red Hat Vladimir Kozlov Oracle JDK-8265949 test/hotspot/jtreg/compiler/intrinsics/sha/cli/TestUseSHAOptionOnUnsupportedCPU.java fails on any other CPU
556 Paul Hohensee Amazon Lucy Schmidt SAP JDK-8265864 CodeHeap State Analytics processes dead nmethods
556 Paul Hohensee Amazon Lucy Schmidt SAP JDK-8265863 [REDO] - Optimize CodeHeap Analytics
556 Paul Hohensee Amazon Lucy Schmidt SAP JDK-8265862 SIGILL in CodeHeapState::print_names()
556 Fei Yang @iscas.ac.cn Vladimir Ivanov Oracle JDK-8265846 C2: -XX:+AggressiveUnboxing is broken
556 Aleksey Shipilev Red Hat Kim Barrett Oracle JDK-8265841 ARM32: runtime/ErrorHandling/ShowRegistersOnAssertTest.java jtreg test fail
556 Aleksey Shipilev Red Hat Kim Barrett Oracle JDK-8265840 ARM32 builds fail after JDK-8247910
556 Martin Doerr SAP Hui Shi Tencent JDK-8265839 CodeHeap::verify fails extra_hops assertion in fastdebug test
556 Richard Reingruber SAP Richard Reingruber SAP JDK-8265838 C2: Out-of-Bounds Array Load from Clone Source
556 Thomas Stuefe SAP Thomas Stuefe SAP JDK-8265833 JNI_ArgumentPusherVaArg leaks valist
557 Yuri Nesterenko Azul Weijun Wang Oracle JDK-8265752 Customizing the generation of a PKCS12 keystore
557 Aleksey Shipilev Red Hat Tobias Hartmann Oracle JDK-8265749 TestSHA512MultiBlockIntrinsics failed on AArch64
557 Martin Doerr SAP Sergey Bylokhov Amazon JDK-8265745 Broken license in javax/swing/JComboBox/8072767/bug8072767.java
557 Martin Doerr SAP Sibabrata Sahoo Oracle JDK-8265744 javax/net/ssl/TLSCommon/TestSessionLocalPrincipal.java failed with Read timed out
557 Martin Doerr SAP Alexey Ivanov Oracle JDK-8265743 Watch registry changes for remote printers update instead of polling
557 Aleksey Shipilev Red Hat Daniel Fuchs Oracle JDK-8265740 HTTP/2 tunnel connections through proxy may be reused regardless of which proxy is selected
557 Aleksey Shipilev Red Hat Daniel Fuchs Oracle JDK-8265739 HttpClient should have more tests for HEAD requests
557 Aleksey Shipilev Red Hat Sandhya Viswanathan Intel JDK-8265738 vinserti128 operand mix up for KNL platforms
557 Aleksey Shipilev Red Hat Roland Westrelin Red Hat JDK-8265737 C2 compilation fails with assert "n is later than its clone"
557 Aleksey Shipilev Red Hat Nils Eliasson Oracle JDK-8265736 C1 should be able to inline excluded methods
557 Aleksey Shipilev Red Hat Vladimir Kozlov Oracle JDK-8265735 CTW: fatal error: meet not symmetric
557 Aleksey Shipilev Red Hat Rickard Backman Oracle JDK-8265733 C1: LoopInvariantCodeMotion constructor can leave some fields uninitialized
557 Aleksey Shipilev Red Hat Aleksey Shipilev Red Hat JDK-8265718 Build failure after JDK-8258414 11u backport
557 Richard Reingruber SAP Igor Ignatyev Oracle JDK-8265728 [testbug] compiler/loopstripmining/CheckLoopStripMining.java sets too short a SafepointTimeoutDelay
558 Paul Hohensee Amazon Jan Lahoda Oracle JDK-8265695 incomplete classpath causes NPE in Flow
558 Thomas Stuefe SAP Thomas Stuefe SAP JDK-8265417 Backport of JDK-8249672 breaks Solaris x86 build
559 Andrew Hughes Red Hat N/A Unknown JDK-8265618 compiler/graalunit/CoreTest.java fails with NPE after JDK-8244543
559 Aleksey Shipilev Red Hat Dean Long Oracle JDK-8265519 ARM32: Jtreg test compiler/c2/Test8062950.java fails on ARM
559 Martin Doerr SAP Nils Eliasson Oracle JDK-8265516 G1BarrierSetC2::step_over_gc_barrier fails with assert "bad barrier shape"
559 Martin Doerr SAP Roland Westrelin Red Hat JDK-8265515 Loop strip mining verification fails with "should be on the backedge"
559 Aleksey Shipilev Red Hat Daniel Fuchs Oracle JDK-8265508 HttpServer.stop() blocks indefinitely when called on dispatch thread
559 Aleksey Shipilev Red Hat Ambarish Rapte Oracle JDK-8265507 Class cast exception on (CompoundEdit) UndoableEditEvent.getEdit()
559 Aleksey Shipilev Red Hat Prajwal Kumaraswamy Oracle JDK-8265506 StartTlsResponse.close() hangs due to synchronization issues
559 Aleksey Shipilev Red Hat Roger Riggs Oracle JDK-8265504 [test] divert spurious output away from stream under test in ProcessBuilder Basic test
559 Aleksey Shipilev Red Hat Rajan Halade Oracle JDK-8265503 Remove Telia Company CA certificate expiring in April 2021
559 Aleksey Shipilev Red Hat Fei Yang @iscas.ac.cn JDK-8265502 slowdebug jvm crashes when StrInflatedCopy match rule is not supported
560 Thomas Stuefe SAP Thomas Stuefe SAP JDK-8265501 [windows] CDS archive may fail to open with long file names
560 Richard Reingruber SAP Richard Reingruber SAP JDK-8265420 Linux/PPC: runtime/CompressedOops/CompressedClassPointers: smallHeapTest fails
560 Aleksey Shipilev Red Hat Harold Seigel Oracle JDK-8265413 Method::is_valid_method() compares 'this' with NULL
562 Alexandr Scherbatiy BellSoft Vladimir Kozlov Oracle JDK-8265398 compiler/graalunit/HotspotTest.java failed after JDK-8251525
562 Alexandr Scherbatiy BellSoft Dmitry Chuyko BellSoft JDK-8265397 AArch64: Faster Math.signum(fp)
562 Alexandr Scherbatiy BellSoft Ningsheng Jian ARM JDK-8265396 AArch64: Adjust default value of FLOATPRESSURE
563 Paul Hohensee Amazon Lucy Schmidt SAP JDK-8265365 MethodInvocationCounters frequently run into overflow
563 Martin Doerr SAP Philip Race Oracle JDK-8265347 Upgrade to FreeType 2.10.4
563 Martin Doerr SAP Christoph Langer SAP JDK-8265346 MulticastSocket tests failing on AIX
563 Roland Westrelin Red Hat Nils Eliasson Oracle JDK-8265344 Incorrect arraycopy stub selected by C2 for SATB collectors
563 Vladimir Kempik Independent Philip Race Oracle JDK-8265340 Cleanup whitespace in .cc, .hh, .m, and .mm files
564 Paul Hohensee Amazon Lucy Schmidt SAP JDK-8265306 Break cycle in vm_version* includes
564 Roland Westrelin Red Hat Vladimir Kozlov Oracle JDK-8265296 java/util/concurrent/tck/JSR166TestCase.java failed "assert(false) failed: unexpected node"
564 Zhengyu Gu Independent Naoto Sato Oracle JDK-8265290 TimeZone getOffset API does not return a DST offset between years 2038-2137
564 Zhengyu Gu Independent Naoto Sato Oracle JDK-8265289 DST starts from incorrect time in 2038
564 Aleksey Shipilev Red Hat Dmitrij Pochepko BellSoft JDK-8265287 ARM32: wrong stack alignment on Deoptimization::unpack_frames
564 Martin Doerr SAP Philip Race Oracle JDK-8265286 Upgrade to LittleCMS 2.12
564 Martin Doerr SAP Lucy Schmidt SAP JDK-8265269 MethodArityHistogram should use Compile_lock in favour of fancy checks
565 Paul Hohensee Amazon Jiangli Zhou Google JDK-8265224 runtime/LoadClass/TestResize.java fails with "Load factor too high" when running in CDS mode
565 Goetz Lindenmaier SAP Lucy Schmidt SAP JDK-8265205 [macos] libjvm.dylib linker warning due to macOS version mismatch
565 Severin Gehwolf Red Hat Severin Gehwolf Red Hat JDK-8264981 Duplicate global variable 'jvm' in libjavajpeg and libawt
566 Martin Balao Red Hat Martin Balao Red Hat JDK-8265142 No data buffering in SunPKCS11 Cipher encryption when the underlying mechanism has no padding
567 Paul Hohensee Amazon Paul Hohensee Amazon JDK-8265099 Revert backport to 11u of 8236859: WebSocket over authenticating proxy fails with NPE
570 Paul Hohensee Amazon Dmitrij Pochepko BellSoft JDK-8264995 ARM32: Interpreter doesn't call result handler after native calls
570 Yuri Nesterenko Azul Daniel Fuchs Oracle JDK-8264988 WebSocket over authenticating proxy fails with NPE
570 Aleksey Shipilev Red Hat Dmitrij Pochepko BellSoft JDK-8264985 AArch64: Enable Minimal and Client VM builds
570 Zhengyu Gu Independent Robbin Ehn Oracle JDK-8264982 Kitchensink24HStress.java crashed with EXCEPTION_ACCESS_VIOLATION
570 Martin Doerr SAP Xuelei Fan @global.tencent.com JDK-8264974 Restrict TLS signature schemes and named groups
570 Alexandr Scherbatiy BellSoft Nick Gasson ARM JDK-8264971 AArch64: PopFrame causes assert(oopDesc::is_oop(obj)) failed: not an oop
570 Alexandr Scherbatiy BellSoft Pengfei Li ARM JDK-8264970 AArch64: Add support for integer vector abs
570 Alexandr Scherbatiy BellSoft Ningsheng Jian ARM JDK-8264969 Better implementation for signed extract
570 Aleksey Shipilev Red Hat Aleksey Shipilev Red Hat JDK-8264955 PNGImageWriter.write_zTXt throws Exception with a typo
571 Aleksey Shipilev Red Hat Aleksey Shipilev Red Hat JDK-8264943 Streamline Java SHA2 implementation
571 Aleksey Shipilev Red Hat Zhengyu Gu Independent JDK-8264932 Memory leak in ImageFileReader
571 Fei Yang @iscas.ac.cn Ningsheng Jian ARM JDK-8264929 AArch64: debug.cpp help() is missing an AArch64 line for pns
571 Aleksey Shipilev Red Hat Weijun Wang Oracle JDK-8264926 ArrayIndexOutOfBoundsException buf for TextCallbackHandler
571 Aleksey Shipilev Red Hat Jayathirth D V Oracle JDK-8264925 PNGImageReader.readNullTerminatedString() doesnt check for non-null terminated strings with length equal to maxLen
571 Aleksey Shipilev Red Hat Jayathirth D V Oracle JDK-8264924 Add length limit for strings in PNGImageWriter
571 Zhengyu Gu Independent Igor Veresov Oracle JDK-8264922 ciMethod::ensure_method_data() should return false is loading resulted in empty state
571 Aleksey Shipilev Red Hat Harold Seigel Oracle JDK-8264921 CTW: Class.getDeclaredMethods fails with assert(k->is_subclass_of(SystemDictionary::Throwable_klass())) failed: invalid exception class
571 Aleksey Shipilev Red Hat Nils Eliasson Oracle JDK-8264919 Very long compilation times and high memory consumption in C2 debug builds
571 Zhengyu Gu Independent Thomas Stuefe SAP JDK-8264916 Possible NULL dereference in fast path arena free if ZapResourceArea is true
571 Zhengyu Gu Independent Tobias Hartmann Oracle JDK-8264913 String inflation C2 intrinsic prevents insertion of anti-dependencies
573 Aleksey Shipilev Red Hat Volker Simonis Amazon JDK-8264751 MethodHandle performance suffers from bad ResolvedMethodTable hash function
574 Alexandr Scherbatiy BellSoft Pengfei Li ARM JDK-8264702 AArch64: Add support for MulVB
574 Alexandr Scherbatiy BellSoft Ningsheng Jian ARM JDK-8264701 AArch64: Add missing support for PopCountVI node
574 Alexandr Scherbatiy BellSoft Jamsheed C M Oracle JDK-8264700 assert(t->singleton()) failed: must be a constant
576 Martin Doerr SAP Bradford Wetmore Oracle JDK-8264675 Better support ALPN byte wire values in SunJSSE
577 Paul Hohensee Amazon Clive Verghese Amazon JDK-8263435 Don't wrap SocketExceptions into SSLExceptions in SSLSocketImpl
578 Vladimir Kempik Independent Gerard Ziemski Oracle JDK-8264635 try catch Method failing to work when dividing an integer by 0
578 Fei Yang @iscas.ac.cn Fei Yang @iscas.ac.cn JDK-8264630 AArch64: one potential bug in C1 LIRGenerator::generate_address()
578 Fei Yang @iscas.ac.cn Daniil Titov Oracle JDK-8264628 assert(thread->is_Java_thread()) failed: just checking
579 Goetz Lindenmaier SAP Christoph Langer SAP JDK-8264494 Exclude some failing tests from security/infra/java/security/cert/CertPathValidator
581 Jiangli Zhou Google Jesper Wilhelmsson Oracle JDK-8264401 ThreadSnapshot::_threadObj can become stale
581 Martin Doerr SAP Aleksey Shipilev Red Hat JDK-8264351 Some OutputMachOpcodes fields are uninitialized
581 Martin Doerr SAP Rahul Raghavan Independent JDK-8264350 assert(false) failed: bad AD file
581 Martin Doerr SAP Roberto Castaneda Lozano Oracle JDK-8264349 C2 compilation fails with assert(store->find_edge(load) != -1) failed: missing precedence edge
581 Martin Doerr SAP Naoto Sato Oracle JDK-8264348 Update IANA Language Subtag Registry to Version 2020-09-29
581 Martin Doerr SAP Naoto Sato Oracle JDK-8264347 Update IANA Language Subtag Registry to Version 2020-04-01
584 Martin Doerr SAP Xuelei Fan @global.tencent.com JDK-8264278 Support the certificate_authorities extension
584 Martin Doerr SAP Joe Wang Oracle JDK-8264265 Update Commons BCEL to Version 6.4.1
584 Martin Doerr SAP Hamlin Li Huawei JDK-8264264 Migrate Locale matching tests to JDK Repo.
584 Alexandr Scherbatiy BellSoft Ningsheng Jian ARM JDK-8264262 AArch64: redundant load_klass in itable stub
585 Paul Hohensee Amazon Tobias Hartmann Oracle JDK-8264197 Cleanup dead CastIP node code in formssel.cpp
586 Severin Gehwolf Red Hat Jonathan Dowland Red Hat JDK-8264132 JNI local refs exceeds capacity warning in NetworkInterface::getAll
586 Roland Westrelin Red Hat kuaiwei.kw Alibaba JDK-8264122 handle split_USE correctly
586 Martin Doerr SAP Naoto Sato Oracle JDK-8264116 Update IANA Language Subtag Registry to Version 2020-03-16
586 Aleksey Shipilev Red Hat Dmitrij Pochepko BellSoft JDK-8264113 ARM32: disable TypeProfiling, CriticalJNINatives, Serviceablity tests for ARM32
587 Alexandr Scherbatiy BellSoft Ningsheng Jian ARM JDK-8264060 AArch64: Incorrect mapping between OptoReg and VMReg for high 64 bits of Vector Register
587 Alexandr Scherbatiy BellSoft Ningsheng Jian ARM JDK-8264056 AArch64: Add missing match rules for smaddl, smsubl and smnegl
587 Matthias Baesken SAP Matthias Baesken SAP JDK-8264042 handle wcstombsdmp return value correctly in unix awt_InputMethod.c
587 Martin Doerr SAP Christian Hagedorn Oracle JDK-8264039 C2: assert(_base == Int) failed: Not an Int
587 Martin Doerr SAP Christian Hagedorn Oracle JDK-8264038 C2 crashes with SIGFPE due to a division that floats above its zero check
587 Martin Doerr SAP Christian Hagedorn Oracle JDK-8264037 [TESTBUG] TestDivZeroWithSplitIf.java fails due to missing UnlockDiagnosticVMOptions
587 Martin Doerr SAP Christian Hagedorn Oracle JDK-8264036 C2 crashes with SIGFPE due to a division that floats above its zero check
587 Zhengyu Gu Independent Thomas Stuefe SAP JDK-8264035 Possible NULL dereference in Arena::destruct_contents()
587 Roland Westrelin Red Hat Roberto Castaneda Lozano Oracle JDK-8264034 C2: assert(found) failed: memory-writing node is not placed in its original loop or an ancestor of it
587 Aleksey Shipilev Red Hat Christoph Göttschkes Microdoc JDK-8264030 Test test/hotspot/jtreg/gc/parallel/TestDynShrinkHeap.java killed by Linux OOM Killer
588 Aleksey Shipilev Red Hat Jan Lahoda Oracle JDK-8263931 Can't use `java.util.List` object after importing `java.awt.List`
591 Alexandr Scherbatiy BellSoft Dmitrij Pochepko BellSoft JDK-8263883 AARCH64: multiple instructions encoding issues
591 Roman Kennke @amazon.de Markus Grönlund Oracle JDK-8263882 JFR StringPool misses cached items across consecutive recordings
591 Paul Hohensee Amazon Bernard Blaser Independent JDK-8263881 compiler/intrinsics/math/TestFpMinMaxIntrinsics.java timedout
591 Paul Hohensee Amazon Vivek Deshpande Intel JDK-8263880 vmTestbase/jit/FloatingPoint/gen_math/Loops04/Loops04.java hits assert(((!attributes->uses_vl()) || (attributes->get_vector_len() == AVX_512bit) || (!_legacy_mode_vl) || (attributes->is_legacy_mode()))) failed: XMM register should be 0-15
591 Paul Hohensee Amazon Bernard Blaser Independent JDK-8263879 x86: Add floating-point Math.min/max intrinsics
591 Paul Hohensee Amazon 30433125+djelinski Independent JDK-8263878 Improve SSL session cache performance and scalability
591 Andrew Haley Red Hat Andrew Haley Red Hat JDK-8263877 AArch64: Optimize LSE atomics in C++ code
591 Andrew Haley Red Hat Andrew Haley Red Hat JDK-8263876 AArch64: Support for LSE atomics C++ HotSpot code
591 Fei Yang @iscas.ac.cn Nick Gasson ARM JDK-8263873 AArch64: two potential bugs in C1 LIRGenerator::generate_address()
591 Roland Westrelin Red Hat Roberto Castaneda Lozano Oracle JDK-8263870 C2: OSR miscompilation caused by invalid memory instruction placement
591 Martin Doerr SAP Fernando Guallini Oracle JDK-8263868 Several test failures due to javax.net.ssl.SSLException: Connection reset
591 Martin Doerr SAP Roland Westrelin Red Hat JDK-8263867 C2: "failed: parsing found no loops but there are some" assert failure
591 Matthias Baesken SAP Matthias Baesken SAP JDK-8263860 do not use uninitialized expand_ms value in G1CollectedHeap::expand_heap_after_young_collection
592 Martin Doerr SAP Alexey Ivanov Oracle JDK-8263816 Native crash in Win32PrintServiceLookup.getAllPrinterNames()
592 Martin Doerr SAP Dmitry Markov Oracle JDK-8263815 DragAndDrop hangs on Windows
592 Martin Doerr SAP Evan Whelan Oracle JDK-8263814 AccessDeniedException caused by delayed file deletion on Windows
592 Martin Doerr SAP Weijun Wang Oracle JDK-8263813 Cannot read Kerberos settings in dynamic store on macOS Big Sur
592 Martin Doerr SAP Jie Fu Tencent JDK-8263812 [TESTBUG] com/sun/jndi/dns/ConfigTests/PortUnreachable.java fails due to the hard coded threshold is small
592 Martin Doerr SAP Sean Mullan Oracle JDK-8263662 Remove root certificates with 1024-bit keys
592 Goetz Lindenmaier SAP Goetz Lindenmaier SAP JDK-8262121 [11u] Redo 8244287: JFR: Methods samples have line number 0
592 Goetz Lindenmaier SAP Joe Wang Oracle JDK-8263791 isStandalone property: remove dependency on pretty-print
592 Matthias Baesken SAP Matthias Baesken SAP JDK-8263787 (sctp) handleSendFailed in SctpChannelImpl.c potential leaks
592 Matthias Baesken SAP Matthias Baesken SAP JDK-8263786 (sctp) free memory in early return in Java_sun_nio_ch_sctp_SctpChannelImpl_receive0
592 Alexandr Scherbatiy BellSoft Lucy Schmidt SAP JDK-8263785 Performance issue (CodeHeap) with large free blocks
592 Alexandr Scherbatiy BellSoft Lucy Schmidt SAP JDK-8263784 Improve CodeHeap Free Space Management
592 Alexandr Scherbatiy BellSoft Fei Yang @iscas.ac.cn JDK-8263783 aarch64: expand minI_rReg and maxI_rReg patterns into separate instructions
592 Alexandr Scherbatiy BellSoft Ningsheng Jian ARM JDK-8263782 AArch64: Add vectorization support for fmin/fmax
594 Martin Doerr SAP Sergey Bylokhov Amazon JDK-8263666 sun/java2d/pipe/InterpolationQualityTest.java fails on Windows & Linux
594 Martin Doerr SAP Sergey Bylokhov Amazon JDK-8263665 Cleanup the code for PrinterJob on windows
594 Aleksey Shipilev Red Hat Robert Field Oracle JDK-8263657 JShell NullPointerException due to class file with unexpected package
594 Aleksey Shipilev Red Hat Robert Field Oracle JDK-8263656 JShell tests: jdk/jshell/FailOverDirectExecutionControlTest.java failed with java.lang.UnsupportedOperationException
594 Aleksey Shipilev Red Hat Robert Field Oracle JDK-8263655 test/langtools/jdk/jshell/FailOverExecutionControlTest.java fails No ExecutionControlProvider with name 'nonExistent' and parameter keys: []
594 Aleksey Shipilev Red Hat Robert Field Oracle JDK-8263654 JShell: When FailOverExecutionControlProvider fails the proximal cause is not shown
594 Aleksey Shipilev Red Hat Matthias Baesken SAP JDK-8263653 better init AnnotationCollector _contended_group
594 Aleksey Shipilev Red Hat Coleen Phillimore Oracle JDK-8263652 Buffer overflow in jcmd GC.class_stats due to too many classes
595 Roland Westrelin Red Hat Thomas Stuefe SAP JDK-8263592 Inlining trace leaks memory
596 Christoph Langer SAP Patric Hedlin Oracle JDK-8263563 AArch64: Insufficient error handling when CodeBuffer is exhausted
599 Vyom Tewari Independent Vyom Tewari Independent JDK-8263100 HttpsURLConnection does not work with other JSSE provider.
599 Paul Hohensee Amazon Christoph Göttschkes Microdoc JDK-8263458 Multiple GC test are missing memory requirements
599 Yuri Nesterenko Azul Olga Mikhaltcova Azul JDK-8263444 Drag n Drop target area is wrong on high DPI systems
599 Goetz Lindenmaier SAP Joe Darcy Oracle JDK-8263419 Double-rounding possibility in float fma
599 Goetz Lindenmaier SAP Joe Wang Oracle JDK-8263418 XML declaration is not followed by a newline
600 Aleksey Shipilev Red Hat Valerie Peng Oracle JDK-8263370 The SHA3 message digests impl of SUN provider are not thread safe after cloned
600 Aleksey Shipilev Red Hat Vladimir Ivanov Oracle JDK-8263369 C2: Empty expression stack when reexecuting tableswitch/lookupswitch instructions after deoptimization
600 Aleksey Shipilev Red Hat Markus Grönlund Oracle JDK-8263368 Failure observed with JfrVirtualMemory::initialize
600 Aleksey Shipilev Red Hat Jatin Bhateja Intel JDK-8263367 Incorrect predication condition generated by ADLC
600 Aleksey Shipilev Red Hat Christian Hagedorn Oracle JDK-8263366 C1 compilation fails with assert(res->vreg_number() == index) failed: conversion check
600 Aleksey Shipilev Red Hat Roland Westrelin Red Hat JDK-8263365 IfNode::fold_compares_helper faces non-canonicalized bool when running JRuby JSON workload
601 Alexandr Scherbatiy BellSoft Ningsheng Jian ARM JDK-8263238 AArch64: Vectorize Adler32 intrinsics
601 Alexandr Scherbatiy BellSoft Sergey Kuksenko Oracle JDK-8263237 improve performance of forall loops by better inlining of "iterator()" methods.
601 Matthias Baesken SAP Matthias Baesken SAP JDK-8263228 print_process_memory_info add a close call after fopen
601 Matthias Baesken SAP Matthias Baesken SAP JDK-8263226 initialize last parameter of getpwuid_r
602 Thomas Stuefe SAP Thomas Stuefe SAP JDK-8263193 [windows] add loop fuse to map_or_reserve_memory_aligned
602 Roland Westrelin Red Hat Roland Westrelin Red Hat JDK-8263171 C2 doesn't always run loop opts for compilations that include loops
605 Severin Gehwolf Red Hat Tobias Hartmann Oracle JDK-8262395 C2 compilation fails with assert(found_sfpt) failed: no node in loop that's not input to safepoint
605 Severin Gehwolf Red Hat Naoto Sato Oracle JDK-8261667 Update the root locale display names
605 Martin Doerr SAP Erik Joelsson Oracle JDK-8263078 The version extra fields needs to be overridable in jib-profiles.js
605 Matthias Baesken SAP Matthias Baesken SAP JDK-8263077 allocateSpaceForGP in freetypeScaler.c might leak memory
605 Matthias Baesken SAP Matthias Baesken SAP JDK-8263074 awt debug_mem.c DMem_AllocateBlock might leak memory
605 Matthias Baesken SAP Matthias Baesken SAP JDK-8263073 initialize dli_fname array before calling dll_address_to_library_name
606 Fei Yang @iscas.ac.cn Nick Gasson ARM JDK-8263052 AArch64: C1 StubAssembler::call_RT can corrupt stack
606 Goetz Lindenmaier SAP Goetz Lindenmaier SAP JDK-8257580 Bump update version for OpenJDK: jdk-11.0.12

No changesets log

Committer push log

Andrew Dinn, Red Hat

Bug Summary
JDK-8266894 Unreachable nodes keep speculative types alive

Alexandr Scherbatiy, BellSoft

Bug Summary
JDK-8264056 AArch64: Add missing match rules for smaddl, smsubl and smnegl
JDK-8264701 AArch64: Add missing support for PopCountVI node
JDK-8264970 AArch64: Add support for integer vector abs
JDK-8264702 AArch64: Add support for MulVB
JDK-8266715 AArch64: Add support for SqrtVF
JDK-8263782 AArch64: Add vectorization support for fmin/fmax
JDK-8265396 AArch64: Adjust default value of FLOATPRESSURE
JDK-8263783 aarch64: expand minI_rReg and maxI_rReg patterns into separate instructions
JDK-8265397 AArch64: Faster Math.signum(fp)
JDK-8266896 AArch64: I2L/L2I conversions can be skipped for masked positive values
JDK-8266006 AArch64: Implement Base64.encodeBlock accelerator/intrinsic
JDK-8264060 AArch64: Incorrect mapping between OptoReg and VMReg for high 64 bits of Vector Register
JDK-8267146 AArch64: more L2I conversions can be skipped
JDK-8263883 AARCH64: multiple instructions encoding issues
JDK-8264971 AArch64: PopFrame causes assert(oopDesc::is_oop(obj)) failed: not an oop
JDK-8264262 AArch64: redundant load_klass in itable stub
JDK-8267147 AArch64: save two words in itable lookup stub
JDK-8263238 AArch64: Vectorize Adler32 intrinsics
JDK-8264700 assert(t->singleton()) failed: must be a constant
JDK-8264969 Better implementation for signed extract
JDK-8266717 compiler/c2/TestBit.java failed "RuntimeException: 'test' missing from stdout/stderr"
JDK-8265398 compiler/graalunit/HotspotTest.java failed after JDK-8251525
JDK-8266482 handle ContendedPaddingWidth in vm_version_aarch64
JDK-8266716 IdealGraph bit check expression canonicalization
JDK-8263784 Improve CodeHeap Free Space Management
JDK-8263237 improve performance of forall loops by better inlining of "iterator()" methods.
JDK-8266718 Need to eliminate excessive i2l conversions
JDK-8263785 Performance issue (CodeHeap) with large free blocks

Andrew Hughes, Red Hat

Bug Summary
JDK-8265618 compiler/graalunit/CoreTest.java fails with NPE after JDK-8244543

Andrew Haley, Red Hat

Bug Summary
JDK-8263877 AArch64: Optimize LSE atomics in C++ code
JDK-8263876 AArch64: Support for LSE atomics C++ HotSpot code

Christoph Langer, SAP

Bug Summary
JDK-8263563 AArch64: Insufficient error handling when CodeBuffer is exhausted
JDK-8269291 LetsEncryptCA.java test fails as Let’s Encrypt Authority X3 is retired

Fei Yang, @iscas.ac.cn

Bug Summary
JDK-8263052 AArch64: C1 StubAssembler::call_RT can corrupt stack
JDK-8264929 AArch64: debug.cpp help() is missing an AArch64 line for pns
JDK-8264630 AArch64: one potential bug in C1 LIRGenerator::generate_address()
JDK-8263873 AArch64: two potential bugs in C1 LIRGenerator::generate_address()
JDK-8266922 ASAN build broken
JDK-8264628 assert(thread->is_Java_thread()) failed: just checking
JDK-8265846 C2: -XX:+AggressiveUnboxing is broken
JDK-8267482 ClassReader::adjustMethodParams can potentially return null if the args list is empty

Goetz Lindenmaier, SAP

Bug Summary
JDK-8262121 [11u] Redo 8244287: JFR: Methods samples have line number 0
JDK-8265205 [macos] libjvm.dylib linker warning due to macOS version mismatch
JDK-8257580 Bump update version for OpenJDK: jdk-11.0.12
JDK-8263419 Double-rounding possibility in float fma
JDK-8264494 Exclude some failing tests from security/infra/java/security/cert/CertPathValidator
JDK-8263791 isStandalone property: remove dependency on pretty-print
JDK-8268022 OldObjectSample events too expensive
JDK-8261020 Wrong format parameter in create_emergency_chunk_path
JDK-8263418 XML declaration is not followed by a newline

Jaroslav Bachorík, DataDog

Bug Summary
JDK-8265750 Fatal error in safepoint.cpp after backport of 8258414
JDK-8267619 SIGSEGV at MethodIteratorHost

Jiangli Zhou, Google

Bug Summary
JDK-8264401 ThreadSnapshot::_threadObj can become stale

Matthias Baesken, SAP

Bug Summary
JDK-8263786 (sctp) free memory in early return in Java_sun_nio_ch_sctp_SctpChannelImpl_receive0
JDK-8263787 (sctp) handleSendFailed in SctpChannelImpl.c potential leaks
JDK-8267441 Adjust problematic String.format calls in jdk/internal/util/Preconditions.java outOfBoundsMessage
JDK-8263077 allocateSpaceForGP in freetypeScaler.c might leak memory
JDK-8267154 avoid maybe-uninitialized gcc warnings on linux s390x
JDK-8263074 awt debug_mem.c DMem_AllocateBlock might leak memory
JDK-8267157 Clean up GCC 8.3 errors in LittleCMS
JDK-8263860 do not use uninitialized expand_ms value in G1CollectedHeap::expand_heap_after_young_collection
JDK-8266616 GCC 8 compilation error in libjli
JDK-8264042 handle wcstombsdmp return value correctly in unix awt_InputMethod.c
JDK-8267156 HotSpot build failed with GCC 9.2.1
JDK-8263073 initialize dli_fname array before calling dll_address_to_library_name
JDK-8263226 initialize last parameter of getpwuid_r
JDK-8266617 JDWP: Unforseen output truncation in logging
JDK-8263228 print_process_memory_info add a close call after fopen
JDK-8267925 sun/security/mscapi tests fail with "Key pair not generated, alias already exists"

Martin Balao, Red Hat

Bug Summary
JDK-8267797 Handle multiple slots in the NSS Internal Module from SunPKCS11's Secmod
JDK-8265142 No data buffering in SunPKCS11 Cipher encryption when the underlying mechanism has no padding

Martin Doerr, SAP

Bug Summary
JDK-8267029 [C2] Hoisting of DecodeN leaves MachTemp inputs behind
JDK-8266301 [macOS] javax/swing/JFrame/NSTexturedJFrame/NSTexturedJFrame.java
JDK-8266223 [s390] Improve Hardware Feature Detection And Reporting
JDK-8266215 [s390] jtreg test failure after JDK-8238696: not conformant features string
JDK-8266221 [s390] Support latest hardware (z14 and z15)
JDK-8263812 [TESTBUG] com/sun/jndi/dns/ConfigTests/PortUnreachable.java fails due to the hard coded threshold is small
JDK-8264037 [TESTBUG] TestDivZeroWithSplitIf.java fails due to missing UnlockDiagnosticVMOptions
JDK-8263814 AccessDeniedException caused by delayed file deletion on Windows
JDK-8264350 assert(false) failed: bad AD file
JDK-8264675 Better support ALPN byte wire values in SunJSSE
JDK-8265745 Broken license in javax/swing/JComboBox/8072767/bug8072767.java
JDK-8254634 Build failure with VS 2019 (16.5.0) due to C2039 and C2873
JDK-8265960 C2 compilation fails with assert(!had_error) failed: bad dominance
JDK-8264349 C2 compilation fails with assert(store->find_edge(load) != -1) failed: missing precedence edge
JDK-8264038 C2 crashes with SIGFPE due to a division that floats above its zero check
JDK-8263867 C2: "failed: parsing found no loops but there are some" assert failure
JDK-8264039 C2: assert(_base == Int) failed: Not an Int
JDK-8263813 Cannot read Kerberos settings in dynamic store on macOS Big Sur
JDK-8263665 Cleanup the code for PrinterJob on windows
JDK-8265839 CodeHeap::verify fails extra_hops assertion in fastdebug test
JDK-8263815 DragAndDrop hangs on Windows
JDK-8266818 Enable AIX build platform to make external debug symbols
JDK-8265516 G1BarrierSetC2::step_over_gc_barrier fails with assert "bad barrier shape"
JDK-8266302 java/awt/FontClass/CreateFont/DeleteFont.sh is unstable
JDK-8265744 javax/net/ssl/TLSCommon/TestSessionLocalPrincipal.java failed with Read timed out
JDK-8267722 javax/swing/text/JTextComponent/5074573/bug5074573.java fails
JDK-8267453 Key protection using PBEWithMD5AndDES fails with "java.security.InvalidAlgorithmParameterException: Salt must be 8 bytes long"
JDK-8267454 keytool still prompt for store password on a password-less pkcs12 file if -storetype pkcs12 is specified
JDK-8265515 Loop strip mining verification fails with "should be on the backedge"
JDK-8265269 MethodArityHistogram should use Compile_lock in favour of fancy checks
JDK-8264264 Migrate Locale matching tests to JDK Repo.
JDK-8265346 MulticastSocket tests failing on AIX
JDK-8263816 Native crash in Win32PrintServiceLookup.getAllPrinterNames()
JDK-8267693 Paste locks up jshell
JDK-8263662 Remove root certificates with 1024-bit keys
JDK-8266632 Remove unused JIMAGE_ResourcePath
JDK-8264974 Restrict TLS signature schemes and named groups
JDK-8267975 Revert the change to the default PKCS12 macAlgorithm and macIterationCount props for 11u/8u/7u
JDK-8263868 Several test failures due to javax.net.ssl.SSLException: Connection reset
JDK-8265959 SoftMainMixer.processAudioBuffers(): Wrong handling of stoppedMixers
JDK-8264351 Some OutputMachOpcodes fields are uninitialized
JDK-8267420 Some vmTestbase/nsk/monitoring/RuntimeMXBean tests fail with hostnames starting from digits
JDK-8263666 sun/java2d/pipe/InterpolationQualityTest.java fails on Windows & Linux
JDK-8264278 Support the certificate_authorities extension
JDK-8263078 The version extra fields needs to be overridable in jib-profiles.js
JDK-8266378 ToolBasicTest fails to access HTTP server it starts
JDK-8264265 Update Commons BCEL to Version 6.4.1
JDK-8264116 Update IANA Language Subtag Registry to Version 2020-03-16
JDK-8264347 Update IANA Language Subtag Registry to Version 2020-04-01
JDK-8264348 Update IANA Language Subtag Registry to Version 2020-09-29
JDK-8267028 Upgrade the default PKCS12 encryption/MAC algorithms
JDK-8265347 Upgrade to FreeType 2.10.4
JDK-8265286 Upgrade to LittleCMS 2.12
JDK-8265743 Watch registry changes for remote printers update instead of polling

Paul Hohensee, Amazon

Bug Summary
JDK-8267641 [11u] 8227609 backport typo
JDK-8265863 [REDO] - Optimize CodeHeap Analytics
JDK-8264995 ARM32: Interpreter doesn't call result handler after native calls
JDK-8265306 Break cycle in vm_version* includes
JDK-8264197 Cleanup dead CastIP node code in formssel.cpp
JDK-8265864 CodeHeap State Analytics processes dead nmethods
JDK-8263881 compiler/intrinsics/math/TestFpMinMaxIntrinsics.java timedout
JDK-8263435 Don't wrap SocketExceptions into SSLExceptions in SSLSocketImpl
JDK-8267864 Enable sun/security/pkcs11 tests for Amazon Linux 2 AArch64
JDK-8266602 Fix issues with cross-compile on macos
JDK-8265693 G1 adaptive IHOP does not account for reclamation of humongous objects by young GC
JDK-8265692 G1 old gen allocation tracking is not in a separate class
JDK-8267863 GCC 10 warnings -Wtype-limits with JFR code
JDK-8263878 Improve SSL session cache performance and scalability
JDK-8265695 incomplete classpath causes NPE in Flow
JDK-8267051 isAssignableFrom checks in KeyFactorySpi.engineGetKeySpec appear to be backwards
JDK-8267053 JFR: Could not create chunk in repository with over 200 recordings
JDK-8265365 MethodInvocationCounters frequently run into overflow
JDK-8266634 Missing intrinsics for Math.ceil, floor, rint
JDK-8263458 Multiple GC test are missing memory requirements
JDK-8265099 Revert backport to 11u of 8236859: WebSocket over authenticating proxy fails with NPE
JDK-8267052 RsaPrivateKeySpec is always recognized as RSAPrivateCrtKeySpec in RSAKeyFactory.engineGetKeySpec
JDK-8265224 runtime/LoadClass/TestResize.java fails with "Load factor too high" when running in CDS mode
JDK-8265862 SIGILL in CodeHeapState::print_names()
JDK-8263880 vmTestbase/jit/FloatingPoint/gen_math/Loops04/Loops04.java hits assert(((!attributes->uses_vl()) || (attributes->get_vector_len() == AVX_512bit) || (!_legacy_mode_vl) || (attributes->is_legacy_mode()))) failed: XMM register should be 0-15
JDK-8263879 x86: Add floating-point Math.min/max intrinsics
JDK-8266635 x86_32 build failures after JDK-8226721 (Missing intrinsics for Math.ceil, floor, rint)

Roman Kennke, @amazon.de

Bug Summary
JDK-8263882 JFR StringPool misses cached items across consecutive recordings

Roland Westrelin, Red Hat

Bug Summary
JDK-8263171 C2 doesn't always run loop opts for compilations that include loops
JDK-8267227 C2's conditional move optimization does not handle top Phi
JDK-8264034 C2: assert(found) failed: memory-writing node is not placed in its original loop or an ancestor of it
JDK-8263870 C2: OSR miscompilation caused by invalid memory instruction placement
JDK-8264122 handle split_USE correctly
JDK-8265344 Incorrect arraycopy stub selected by C2 for SATB collectors
JDK-8263592 Inlining trace leaks memory
JDK-8265296 java/util/concurrent/tck/JSR166TestCase.java failed "assert(false) failed: unexpected node"

Ramanand Patil, Oracle

Bug Summary
JDK-8266535 UIManager.getSytemLookAndFeelClassName() returns wrong value on Fedora 32

Richard Reingruber, SAP

Bug Summary
JDK-8265728 [testbug] compiler/loopstripmining/CheckLoopStripMining.java sets too short a SafepointTimeoutDelay
JDK-8265838 C2: Out-of-Bounds Array Load from Clone Source
JDK-8265677 CMS: CardTableBarrierSet::write_ref_array_work() lacks storestore barrier
JDK-8265420 Linux/PPC: runtime/CompressedOops/CompressedClassPointers: smallHeapTest fails

Severin Gehwolf, Red Hat

Bug Summary
JDK-8266713 [AIX] Build failure after 11u backport of JDK-8247753
JDK-8262395 C2 compilation fails with assert(found_sfpt) failed: no node in loop that's not input to safepoint
JDK-8264981 Duplicate global variable 'jvm' in libjavajpeg and libawt
JDK-8268027 JFR EventWriter does not use first string from StringPool with id 0
JDK-8264132 JNI local refs exceeds capacity warning in NetworkInterface::getAll
JDK-8266929 Unable to use algorithms from 3p providers
JDK-8261667 Update the root locale display names

Aleksey Shipilev, Red Hat

Bug Summary
JDK-8265504 [test] divert spurious output away from stream under test in ProcessBuilder Basic test
JDK-8265950 [TESTBUG] TestUseSHA512IntrinsicsOptionOnSupportedCPU.java fails on x86_32
JDK-8264985 AArch64: Enable Minimal and Client VM builds
JDK-8264924 Add length limit for strings in PNGImageWriter
JDK-8265840 ARM32 builds fail after JDK-8247910
JDK-8264113 ARM32: disable TypeProfiling, CriticalJNINatives, Serviceablity tests for ARM32
JDK-8265519 ARM32: Jtreg test compiler/c2/Test8062950.java fails on ARM
JDK-8265841 ARM32: runtime/ErrorHandling/ShowRegistersOnAssertTest.java jtreg test fail
JDK-8265287 ARM32: wrong stack alignment on Deoptimization::unpack_frames
JDK-8264926 ArrayIndexOutOfBoundsException buf for TextCallbackHandler
JDK-8263653 better init AnnotationCollector _contended_group
JDK-8263652 Buffer overflow in jcmd GC.class_stats due to too many classes
JDK-8265718 Build failure after JDK-8258414 11u backport
JDK-8263366 C1 compilation fails with assert(res->vreg_number() == index) failed: conversion check
JDK-8265736 C1 should be able to inline excluded methods
JDK-8265733 C1: LoopInvariantCodeMotion constructor can leave some fields uninitialized
JDK-8265737 C2 compilation fails with assert "n is later than its clone"
JDK-8263369 C2: Empty expression stack when reexecuting tableswitch/lookupswitch instructions after deoptimization
JDK-8263931 Can't use `java.util.List` object after importing `java.awt.List`
JDK-8265507 Class cast exception on (CompoundEdit) UndoableEditEvent.getEdit()
JDK-8264921 CTW: Class.getDeclaredMethods fails with assert(k->is_subclass_of(SystemDictionary::Throwable_klass())) failed: invalid exception class
JDK-8265735 CTW: fatal error: meet not symmetric
JDK-8263368 Failure observed with JfrVirtualMemory::initialize
JDK-8266478 Harden TLS interop tests
JDK-8265740 HTTP/2 tunnel connections through proxy may be reused regardless of which proxy is selected
JDK-8265739 HttpClient should have more tests for HEAD requests
JDK-8265508 HttpServer.stop() blocks indefinitely when called on dispatch thread
JDK-8263365 IfNode::fold_compares_helper faces non-canonicalized bool when running JRuby JSON workload
JDK-8263367 Incorrect predication condition generated by ADLC
JDK-8266424 java.lang.NullPointerException: HDC for component at sun.java2d.loops.Blit.Blit
JDK-8266476 java/lang/ProcessHandle/PermissionTest.java fails with TestNG 7.1
JDK-8266475 java/lang/String/StringRepeat.java test is missing a memory requirement
JDK-8263657 JShell NullPointerException due to class file with unexpected package
JDK-8263656 JShell tests: jdk/jshell/FailOverDirectExecutionControlTest.java failed with java.lang.UnsupportedOperationException
JDK-8263654 JShell: When FailOverExecutionControlProvider fails the proximal cause is not shown
JDK-8264932 Memory leak in ImageFileReader
JDK-8265413 Method::is_valid_method() compares 'this' with NULL
JDK-8264751 MethodHandle performance suffers from bad ResolvedMethodTable hash function
JDK-8264925 PNGImageReader.readNullTerminatedString() doesnt check for non-null terminated strings with length equal to maxLen
JDK-8264955 PNGImageWriter.write_zTXt throws Exception with a typo
JDK-8265503 Remove Telia Company CA certificate expiring in April 2021
JDK-8265502 slowdebug jvm crashes when StrInflatedCopy match rule is not supported
JDK-8265506 StartTlsResponse.close() hangs due to synchronization issues
JDK-8264943 Streamline Java SHA2 implementation
JDK-8265996 Test OwnedWindowsLeak.java intermittently fails
JDK-8266477 Test should not use System.exit
JDK-8264030 Test test/hotspot/jtreg/gc/parallel/TestDynShrinkHeap.java killed by Linux OOM Killer
JDK-8265949 test/hotspot/jtreg/compiler/intrinsics/sha/cli/TestUseSHAOptionOnUnsupportedCPU.java fails on any other CPU
JDK-8263655 test/langtools/jdk/jshell/FailOverExecutionControlTest.java fails No ExecutionControlProvider with name 'nonExistent' and parameter keys: []
JDK-8265749 TestSHA512MultiBlockIntrinsics failed on AArch64
JDK-8263370 The SHA3 message digests impl of SUN provider are not thread safe after cloned
JDK-8266425 Use the latest Ubuntu base image version in Docker testing
JDK-8264919 Very long compilation times and high memory consumption in C2 debug builds
JDK-8265738 vinserti128 operand mix up for KNL platforms
JDK-8265537 x86 version string truncated after JDK-8249672 11u backport

Thomas Stuefe, SAP

Bug Summary
JDK-8263193 [windows] add loop fuse to map_or_reserve_memory_aligned
JDK-8265501 [windows] CDS archive may fail to open with long file names
JDK-8267436 [Windows] Structured Exception Catcher missing around gtest execution
JDK-8265417 Backport of JDK-8249672 breaks Solaris x86 build
JDK-8266880 Extend settings printout in jcmd VM.metaspace
JDK-8267438 Improve stringStream buffer handling
JDK-8266878 java/lang/instrument/PremainClass/InheritAgent0100.java times out
JDK-8265833 JNI_ArgumentPusherVaArg leaks valist
JDK-8267437 SafeFetch may crash if invoked in non-JavaThreads
JDK-8266879 Trace resource exhausted events unconditionally

Vladimir Kempik, Independent

Bug Summary
JDK-8266597 [macOS] All Swing/AWT apps cause Allow Notifications prompt to appear when app is launched
JDK-8267496 [macOS] Bad JNI lookup error : Accessible actions do not work on macOS
JDK-8267497 [macOS] Incorrect JNI parameters in number conversion in A11Y code
JDK-8267491 [macOS] Remove desktop module dependencies on JNF Reference APIs
JDK-8267490 [macOS] Replace JNF_COCOA_ENTER/EXIT macros
JDK-8267489 [macOS] Update JNI error handling in Cocoa code.
JDK-8267487 [macOS]: Remove JNF dependency from libosxkrb5/SCDynamicStoreConfig.m
JDK-8267486 [macOS]: Remove JNF dependency from libosxsecurity/KeystoreImpl.m
JDK-8267622 [macos_aarch64] InterpreterRuntime::throw_pending_exception messing up LR results in crash
JDK-8267495 Bad JNI lookup during printing
JDK-8267498 Bad JNI lookup getFocusOwner in accessibility code on macOS
JDK-8265340 Cleanup whitespace in .cc, .hh, .m, and .mm files
JDK-8266481 DirectIOTest fails on a system with large block size
JDK-8267493 Missed JNFInstanceOf -> IsInstanceOf conversion
JDK-8267913 NullPointerException in sun.security.ssl.HKDF.extract(HKDF.java:93)
JDK-8267488 Remove dependencies on JNF's JNI utility functions in AWT and 2D code
JDK-8267494 Remove JNF dependency from libsaproc/MacosxDebuggerLocal.m
JDK-8267492 Removing remaining JNF dependencies in the java.desktop module
JDK-8264635 try catch Method failing to work when dividing an integer by 0

Vyom Tewari, Independent

Bug Summary
JDK-8263100 HttpsURLConnection does not work with other JSSE provider.

Yuri Nesterenko, Azul

Bug Summary
JDK-8267533 (fs) Files.newInputStream(...).skip(n) is slow
JDK-8267615 (fs) Files.newInputStream(...).skip(n) should allow skipping beyond file size
JDK-8266046 CMS ParScanClosure misses a barrier
JDK-8265752 Customizing the generation of a PKCS12 keystore
JDK-8263444 Drag n Drop target area is wrong on high DPI systems
JDK-8264988 WebSocket over authenticating proxy fails with NPE

Zhengyu Gu, Independent

Bug Summary
JDK-8266915 [TESTBUG] runtime/NMT/CheckForProperDetailStackTrace.java fails with Expected stack trace missing from output
JDK-8266708 CDS/appCDS tests failed on Windows due to long path to a classlist file
JDK-8264922 ciMethod::ensure_method_data() should return false is loading resulted in empty state
JDK-8265289 DST starts from incorrect time in 2038
JDK-8264982 Kitchensink24HStress.java crashed with EXCEPTION_ACCESS_VIOLATION
JDK-8264035 Possible NULL dereference in Arena::destruct_contents()
JDK-8264916 Possible NULL dereference in fast path arena free if ZapResourceArea is true
JDK-8267561 Shenandoah: Reference processing not properly setup for outside of cycle degenerated GC
JDK-8267499 Shenandoah: Round up region size to page size unconditionally
JDK-8266917 Shenandoah: Shenandoah heap region count could be off by 1
JDK-8264913 String inflation C2 intrinsic prevents insertion of anti-dependencies
JDK-8265290 TimeZone getOffset API does not return a DST offset between years 2038-2137