PUSHES REPORT: 11.0.14

This report shows who pushed the backports to the given release. This usually shows who did the backporting, testing, and review work.

Report generated: Fri Jul 01 04:45:28 CEST 2022

Distribution by priority

Count Priority
2 P1
19 P2
101 P3
222 P4
10 P5

Distribution by components

Count Component
354 100% Total
116 32.8% hotspot
45 12.7% hotspot/compiler
26 7.3% hotspot/runtime
14 4.0% hotspot/jvmti
13 3.7% hotspot/gc
13 3.7% hotspot/test
2 0.6% hotspot/svc-agent
2 0.6% hotspot/jfr
1 0.3% hotspot/svc
94 26.6% client-libs
48 13.6% client-libs/javax.swing
22 6.2% client-libs/java.awt
12 3.4% client-libs
9 2.5% client-libs/2d
3 0.8% client-libs/javax.accessibility
65 18.4% core-libs
28 7.9% core-libs/java.net
7 2.0% core-libs
6 1.7% core-libs/java.time
5 1.4% core-libs/java.lang
5 1.4% core-libs/java.nio
4 1.1% core-libs/java.lang.invoke
4 1.1% core-libs/java.util:i18n
2 0.6% core-libs/java.util
1 0.3% core-libs/java.util.stream
1 0.3% core-libs/java.util.logging
1 0.3% core-libs/java.math
1 0.3% core-libs/java.io
37 10.5% security-libs
13 3.7% security-libs/java.security
10 2.8% security-libs/javax.net.ssl
3 0.8% security-libs/jdk.security
3 0.8% security-libs/javax.crypto:pkcs11
3 0.8% security-libs
2 0.6% security-libs/javax.security
2 0.6% security-libs/org.ietf.jgss:krb5
1 0.3% security-libs/javax.crypto
15 4.2% infrastructure
14 4.0% infrastructure/build
1 0.3% infrastructure
14 4.0% tools
5 1.4% tools/javac
3 0.8% tools/javadoc(tool)
3 0.8% tools/jshell
2 0.6% tools/launcher
1 0.3% tools/jconsole
10 2.8% core-svc
5 1.4% core-svc/tools
3 0.8% core-svc/java.lang.management
1 0.3% core-svc/javax.management
1 0.3% core-svc/debugger
2 0.6% other-libs
2 0.6% other-libs/other
1 0.3% xml
1 0.3% xml/jaxp

Distribution by affiliation

This Release Pushes

Original Pushes

Count Committer
354 100% Total
254 71.8% SAP
105 29.7% Goetz Lindenmaier
73 20.6% Martin Doerr
67 18.9% Christoph Langer
5 1.4% Thomas Stuefe
2 0.6% Matthias Baesken
1 0.3% Richard Reingruber
1 0.3% Lucy Schmidt
54 15.3% Red Hat
23 6.5% Aleksey Shipilev
12 3.4% Jonathan Dowland
11 3.1% Zhengyu Gu
2 0.6% Severin Gehwolf
1 0.3% Andrew Haley
1 0.3% Martin Balao
1 0.3% Andrew Hughes
1 0.3% Adam Farley
1 0.3% Alex Kasko
1 0.3% pmikova
15 4.2% Tencent
10 2.8% Jie Fu
4 1.1% Bin Liao
1 0.3% Peng Xie
7 2.0% JetBrains
7 2.0% Vladimir Kempik
6 1.7% Microsoft
6 1.7% Reka Kovacs
4 1.1% Amazon
2 0.6% joshcao
1 0.3% Clive Verghese
1 0.3% Sergey Bylokhov
4 1.1% Azul
2 0.6% Alexey Pavlyutkin
1 0.3% Sergey Nazarkin
1 0.3% Ilarion Nakonechnyy
4 1.1% Loongson
4 1.1% Qi Ao
3 0.8% Independent
3 0.8% 54955201+macarte
1 0.3% Alibaba
1 0.3% Yi Yang
1 0.3% IBM
1 0.3% Tyler Steele
1 0.3% Oracle
1 0.3% Bernhard Urban-Forster
Count Committer
354 100% Total
215 60.7% Oracle
31 8.8% Prasanta Sadhukhan
11 3.1% Daniel Fuchs
10 2.8% Pankaj Bansal
9 2.5% Philip Race
6 1.7% Weijun Wang
6 1.7% Patric Hedlin
6 1.7% Naoto Sato
5 1.4% Sean Coffey
5 1.4% Tobias Hartmann
5 1.4% Lance Andersen
5 1.4% Rajan Halade
4 1.1% Jayathirth D V
4 1.1% Ambarish Rapte
4 1.1% David Holmes
4 1.1% Fernando Guallini
4 1.1% Thejasvi Voniadka
4 1.1% Jaikiran Pai
4 1.1% Abdul Kolarkunnu
3 0.8% Alan Bateman
3 0.8% Michael McMahon
3 0.8% Yoshiki Sato
3 0.8% Erik Joelsson
3 0.8% Alexander Zuev
3 0.8% Igor Ignatyev
3 0.8% Daniil Titov
3 0.8% Mandy Chung
3 0.8% Christian Hagedorn
3 0.8% Evan Whelan
3 0.8% Mikael Vidstedt
2 0.6% Sibabrata Sahoo
2 0.6% Brian Burkhalter
2 0.6% Roger Riggs
2 0.6% Tejpal Rebari
2 0.6% Alexander Zvegintsev
2 0.6% Rajat Mahajan
2 0.6% Daniel Daugherty
2 0.6% Magnus Ihse Bursie
2 0.6% Jan Lahoda
2 0.6% Aleksej Efimov
2 0.6% Coleen Phillimore
2 0.6% Amy Lu
2 0.6% Shashidhara Veerabhadraiah
2 0.6% Joe Darcy
2 0.6% Vladimir Ivanov
1 0.3% Semyon Sadetsky
1 0.3% Joe Wang
1 0.3% Gerard Ziemski
1 0.3% Poonam Bajaj Parhar
1 0.3% Stefan Karlsson
1 0.3% Kevin Walls
1 0.3% Erik Österlund
1 0.3% Jini George
1 0.3% Alex Menkov
1 0.3% Brent Christian
1 0.3% Thomas Schatzl
1 0.3% Conor Cleary
1 0.3% Stuart Marks
1 0.3% Nils Eliasson
1 0.3% Chris Plummer
1 0.3% Vicente Arturo Romero Zaldivar
1 0.3% Christian Stein
1 0.3% Mikhailo Seledtsov
1 0.3% Claes Redestad
1 0.3% Harold Seigel
1 0.3% Vladimir Kozlov
1 0.3% Jamil Nimeh
1 0.3% Jonathan Gibbons
1 0.3% Anton Litvinov
1 0.3% Serguei Spitsyn
28 7.9% Red Hat
14 4.0% Aleksey Shipilev
5 1.4% Roland Westrelin
4 1.1% Zhengyu Gu
2 0.6% Andrew Haley
2 0.6% Severin Gehwolf
1 0.3% Alex Kasko
23 6.5% Google
22 6.2% Jean Christophe Beyler
1 0.3% Jiangli Zhou
21 5.9% SAP
6 1.7% Matthias Baesken
3 0.8% Christoph Langer
3 0.8% Thomas Stuefe
2 0.6% Goetz Lindenmaier
2 0.6% Ralf Schmelter
2 0.6% Richard Reingruber
1 0.3% Martin Doerr
1 0.3% Lucy Schmidt
1 0.3% Arno Zeller
16 4.5% Amazon
13 3.7% Sergey Bylokhov
1 0.3% Clive Verghese
1 0.3% joshcao
1 0.3% Paul Hohensee
16 4.5% Tencent
8 2.3% Jie Fu
4 1.1% Xuelei Fan
2 0.6% Wang Chao
1 0.3% Peng Xie
1 0.3% John Jiang
7 2.0% Independent
2 0.6% Chris Hegarty
1 0.3% 72060147+amresh-sahu
1 0.3% heinz
1 0.3% 70650887+skodanda
1 0.3% Guoxiong Li
1 0.3% Anirvan Sarkar
7 2.0% Unknown
7 2.0% N/A
5 1.4% Azul
4 1.1% Anton Kozlov
1 0.3% Ilarion Nakonechnyy
5 1.4% JetBrains
2 0.6% Artem Semenov
2 0.6% Vladimir Kempik
1 0.3% Dmitry Batrak
4 1.1% Microsoft
2 0.6% Mat Carter
1 0.3% Monica Beckwith
1 0.3% Reka Kovacs
2 0.6% Loongson
1 0.3% sunxu01
1 0.3% Qi Ao
1 0.3% @malloc.se
1 0.3% Per Liden
1 0.3% ARM
1 0.3% Nick Gasson
1 0.3% Ampere
1 0.3% Patrick Zhang
1 0.3% Debian
1 0.3% John Paul Adrian Glaubitz
1 0.3% NTT DATA
1 0.3% Yasumasa Suenaga

Chronological push log:

Days Ago This Release Push By Original Push By Bug Summary
Name Affiliation Name Affiliation
186 Tyler Steele IBM Matthias Baesken SAP JDK-8279284 build fails on AIX in hotspot cpp tests (for example getstacktr001.cpp)
203 Martin Doerr SAP Christian Hagedorn Oracle JDK-8278498 SIGSEGV in C2 CompilerThread Node::rematerialize() compiling Packet::readUnsignedTrint
205 Martin Doerr SAP Lance Andersen Oracle JDK-8278333 (zipfs) Files.walkFileTree walks infinitely if zip has dir named "." inside
210 Martin Doerr SAP Daniel Fuchs Oracle JDK-8278155 Cookie stored in CookieHandler not sent if user headers contain cookie
213 54955201+macarte Independent Mat Carter Microsoft JDK-8277959 Extend minimal retry for loopback connections on Windows to PlainSocketImpl
213 Reka Kovacs Microsoft N/A Unknown JDK-8264183 Windows-AArch64: Enable and test ZGC and ShenandoahGC
213 54955201+macarte Independent Mat Carter Microsoft JDK-8277953 Support for identifying the full range of IPv4 localhost addresses on Windows
213 Goetz Lindenmaier SAP Jean Christophe Beyler Google JDK-8277943 Remove remaining NSK_CPP_STUBs
213 Zhengyu Gu Red Hat Poonam Bajaj Parhar Oracle JDK-8277939 [TESTBUG] serviceability/sa/ClhsdbCDSCore.java fails with -Xcomp -XX:TieredStopAtLevel=1
213 Zhengyu Gu Red Hat Magnus Ihse Bursie Oracle JDK-8277937 Replace some enums with static const members in hotspot/runtime
213 Goetz Lindenmaier SAP Jean Christophe Beyler Google JDK-8277914 Remove the NSK_CPP_STUB macros from vmTestbase for jvmti/scenarios/[E-M]
213 Goetz Lindenmaier SAP Jean Christophe Beyler Google JDK-8277913 Handle remaining gc/lock native code and fix two strings
213 Goetz Lindenmaier SAP Jean Christophe Beyler Google JDK-8277911 Remove the NSK_CPP_STUB macros for remaining vmTestbase/jvmti/[sS]*
213 Goetz Lindenmaier SAP Jean Christophe Beyler Google JDK-8277910 [REDO] Handle JNIGlobalRefLocker.cpp
213 Thomas Stuefe SAP Daniel Daugherty Oracle JDK-8277903 gc/stress/TestReclaimStringsLeaksMemory.java fails because Reserved memory size is too big
213 Alex Kasko Red Hat Alex Kasko Red Hat JDK-8277898 NTLM authentication fails if HEAD request is used
213 Goetz Lindenmaier SAP Jean Christophe Beyler Google JDK-8277889 Remove the NSK_CPP_STUB macros from vmTestbase for jvmti/[I-S]*
213 Goetz Lindenmaier SAP Jean Christophe Beyler Google JDK-8277888 Remove the NSK_STUB macros from vmTestbase for non jvmti
216 54955201+macarte Independent Alan Bateman Oracle JDK-8277876 Configure initial RTO to use minimal retry for loopback connections on Windows
216 Reka Kovacs Microsoft Monica Beckwith Microsoft JDK-8277875 Implementation: JEP 388: Windows AArch64 Support
216 Reka Kovacs Microsoft Reka Kovacs Microsoft JDK-8272181 Windows-AArch64:Backport fix of `Backtracing broken on PAC enabled systems`
217 Martin Doerr SAP Martin Doerr SAP JDK-8277841 [TESTBUG] UnsafeIntrinsicsTest intermittently fails on weak memory model platform
217 Martin Doerr SAP Sean Coffey Oracle JDK-8277840 sun.security.pkcs.PKCS9Attributes.toString() throws NPE
217 Christoph Langer SAP Christoph Langer SAP JDK-8277815 Fix mistakes in legal header backports
217 Goetz Lindenmaier SAP Jean Christophe Beyler Google JDK-8277839 Remove the NSK_CPP_STUB macros from vmTestbase for jvmti/scenarios/[A-E]
217 Goetz Lindenmaier SAP Jean Christophe Beyler Google JDK-8277838 Remove multiple casts for EM06 file
217 Goetz Lindenmaier SAP Jean Christophe Beyler Google JDK-8277837 Remove the NSK_CPP_STUB macros from vmTestbase for jvmti/[G-I]*
217 Goetz Lindenmaier SAP Jean Christophe Beyler Google JDK-8277836 Remove the NSK_CPP_STUB macros from vmTestbase for jvmti/[A-G]*
217 Goetz Lindenmaier SAP Chris Plummer Oracle JDK-8277835 [TESTBUG] hs203t003 fails with "# ERROR: hs203t003.cpp, 218: NSK_CPP_STUB2 ( ResumeThread, jvmti, thread)"
217 Goetz Lindenmaier SAP Jean Christophe Beyler Google JDK-8277834 Remove the multi-line old C style for string literals
217 Goetz Lindenmaier SAP Jean Christophe Beyler Google JDK-8277827 Fix up a few minor nits forgotten by JDK-8210665
217 Goetz Lindenmaier SAP Jean Christophe Beyler Google JDK-8277826 Clean up JNI_ENV_ARG and factorize the macros for vmTestbase/jvmti[A-N] tests
218 Andrew Haley Red Hat Andrew Haley Red Hat JDK-8277800 AArch64: AES Galois CounterMode (GCM) interleaved implementation using vector instructions
218 Jie Fu Tencent Kevin Walls Oracle JDK-8277747 TestJpsHostName.java not reliable, better to expand HostIdentifierCreate.java test
218 Goetz Lindenmaier SAP Jean Christophe Beyler Google JDK-8277745 Clean up JNI_ENV_ARG and factorize the macros for vmTestbase/jvmti/unit tests
218 Goetz Lindenmaier SAP Jean Christophe Beyler Google JDK-8277744 Remove #ifdef cplusplus from vmTestbase
218 Goetz Lindenmaier SAP Jean Christophe Beyler Google JDK-8277743 Clean up JNI_ENV_ARG and factorize the macros for vmTestbase/jvmti[R-U] tests
218 Goetz Lindenmaier SAP Jean Christophe Beyler Google JDK-8277742 Clean up JNI_ENV_ARG and factorize the macros for vmTestbase/jvmti[N-R] tests
218 Goetz Lindenmaier SAP Jean Christophe Beyler Google JDK-8277741 Clean up JNI_ENV_ARG for vmTestbase/jvmti/Get[G-Z] tests
219 Zhengyu Gu Red Hat David Holmes Oracle JDK-8277680 [TESTBUG] vmTestbase/nsk/stress/jni/jnistress001.java crashes with EXCEPTION_ACCESS_VIOLATION on windows-x86
219 Adam Farley Red Hat Christian Stein Oracle JDK-8277644 tools/launcher/HelpFlagsTest.java Fails on Windows 32bit
220 Ilarion Nakonechnyy Azul Ilarion Nakonechnyy Azul JDK-8277568 Slow LoginContext.login() on multi threading application
220 Goetz Lindenmaier SAP Jean Christophe Beyler Google JDK-8277565 Clean up JNI_ENV_ARG for vmTestbase/jvmti/Get[A-F] tests
221 Goetz Lindenmaier SAP Jean Christophe Beyler Google JDK-8277509 Remove macros for C compilation from vmTestBase but non jvmti
222 Goetz Lindenmaier SAP Matthias Baesken SAP JDK-8277506 compile error in libfollowref003.cpp with XCode 10.2 on macosx
222 Goetz Lindenmaier SAP Igor Ignatyev Oracle JDK-8277505 use C++ compiler for hotspot tests
223 joshcao Amazon joshcao Amazon JDK-8274860 gcc 10.2.1 produces an uninitialized warning in sharedRuntimeTrig.cpp
223 Thomas Stuefe SAP Thomas Stuefe SAP JDK-8277482 JMM GetDiagnosticXXXInfo APIs should verify output array sizes
224 Martin Doerr SAP Yoshiki Sato Oracle JDK-8277378 Update TimeZoneNames files to follow the changes made by JDK-8275766
224 Martin Doerr SAP Yoshiki Sato Oracle JDK-8277377 TestZoneInfo310.java fails with tzdata2021e
224 Martin Doerr SAP Yoshiki Sato Oracle JDK-8277376 (tz) Update Timezone Data to 2021e
225 Jie Fu Tencent Jie Fu Tencent JDK-8277364 RegisterImpl::max_slots_per_register is incorrect on AMD64
225 Aleksey Shipilev Red Hat Aleksey Shipilev Red Hat JDK-8277341 C2: Compiler stack overflow during escape analysis on Linux x86_32
225 Aleksey Shipilev Red Hat Rajan Halade Oracle JDK-8277327 security/infra/java/security/cert/CertPathValidator/certification/ComodoCA.java fails due to revoked cert
225 Goetz Lindenmaier SAP Sergey Bylokhov Amazon JDK-8277320 The javax/swing/JPopupMenu/7154841/bug7154841.java fail on big screens
225 Goetz Lindenmaier SAP Daniil Titov Oracle JDK-8277034 [Graal] fromTonga/nsk/jvmti/unit/FollowReferences/followref003/TestDescription.java fails with "Location mismatch" errors
226 Zhengyu Gu Red Hat Zhengyu Gu Red Hat JDK-8277226 Shenandoah: Race results degenerated GC to enter wrong entry point
226 Goetz Lindenmaier SAP Serguei Spitsyn Oracle JDK-8277181 nsk.nsk/jvmti/ThreadStart/threadstart003 Wrong number of thread end events
227 Christoph Langer SAP Igor Ignatyev Oracle JDK-8277143 testlibrary_tests/ctw/JarDirTest.java fails with InvalidPathException on windows
227 Goetz Lindenmaier SAP Jean Christophe Beyler Google JDK-8277118 Make string buffer size dynamic in mlvmJvmtiUtils.c
227 Goetz Lindenmaier SAP Jaikiran Pai Oracle JDK-8277115 java/nio/file/WatchService/LotsOfEvents.java fails intermittently
227 Goetz Lindenmaier SAP Pankaj Bansal Oracle JDK-8277114 [TESTBUG] auto failed with the "Applet thread threw exception: java.lang.UnsupportedOperationException" exception
227 pmikova Red Hat Thomas Schatzl Oracle JDK-8277109 Add @requires to vmTestbase/gc/g1 tests
227 Thomas Stuefe SAP David Holmes Oracle JDK-8277098 gtest/GTestWrapper.java vmErrorTest.unimplemented1_vm_assert failed
230 Aleksey Shipilev Red Hat Aleksey Shipilev Red Hat JDK-8277037 Use SHA256 hash in build.tools.depend.Depend
231 Andrew Hughes Red Hat Daniel Fuchs Oracle JDK-8277035 HttpClient leaves HTTP/2 sockets in CLOSE_WAIT, when using proxy tunnel
231 Aleksey Shipilev Red Hat Anirvan Sarkar Independent JDK-8276984 Windows GHA builds fail due to broken Cygwin
232 Christoph Langer SAP Prasanta Sadhukhan Oracle JDK-8276974 java/awt/Focus/6382144/EndlessLoopTest.java fails on mac
232 Christoph Langer SAP Pankaj Bansal Oracle JDK-8276973 [macosx]Test java/awt/Focus/8073453/AWTFocusTransitionTest.java fails on MacOSX
232 Zhengyu Gu Red Hat Zhengyu Gu Red Hat JDK-8276943 Backout JDK-8274338 11u backport
232 Aleksey Shipilev Red Hat Aleksey Shipilev Red Hat JDK-8276938 java/lang/management/ManagementFactory/MXBeanException.java test fails with Shenandoah
232 Christoph Langer SAP Alexander Zuev Oracle JDK-8276924 [TEST_BUG] [macos] javax/swing/JPopupMenu/7156657/bug7156657.java fails on OS X
232 Christoph Langer SAP Jayathirth D V Oracle JDK-8276923 [TESTBUG] Swing StyledEditorKit test bug4506788.java fails on MacOS
233 Jie Fu Tencent Jie Fu Tencent JDK-8276912 javax/swing/text/html/parser/Parser/8078268/bug8078268.java timeout
233 Jie Fu Tencent Jie Fu Tencent JDK-8276911 -XX:MaxRAMPercentage=0 is unreasonable for jtreg tests on many-core machines
233 Alexey Pavlyutkin Azul Andrew Haley Red Hat JDK-8276888 AArch64: size_fits_all_mem_uses should return false if its output is a CAS
233 Christoph Langer SAP Jayathirth D V Oracle JDK-8276840 [TESTBUG] Swing text test bug8014863.java fails on macos
234 Jie Fu Tencent Jie Fu Tencent JDK-8276834 Remove src/hotspot/share/adlc/Test/i486.ad
234 Aleksey Shipilev Red Hat Aleksey Shipilev Red Hat JDK-8276802 Update qemu-debootstrap cross-compilation recipe
236 Zhengyu Gu Red Hat Coleen Phillimore Oracle JDK-8276785 com/sun/jdi/RedefineCrossEvent.java failed "assert(m != __null) failed: NULL mirror"
236 Christoph Langer SAP Prasanta Sadhukhan Oracle JDK-8276778 [TESTBUG] Swing ActionListenerCalledTwiceTest.java fails on macos
236 Christoph Langer SAP Prasanta Sadhukhan Oracle JDK-8276777 [TESTBUG] JMenuItem test bug4171437.java fails on macos
236 Christoph Langer SAP Prasanta Sadhukhan Oracle JDK-8276776 [TESTBUG] ToolTipManager/Test6256140.java is failing on macos
236 Bernhard Urban-Forster Oracle N/A Unknown JDK-8276185 AArch64: Remove the r18 dependency on Windows AArch64
237 Christoph Langer SAP Prasanta Sadhukhan Oracle JDK-8276770 [TESTBUG] HTMLEditorKit test bug5043626.java is failing on macos
237 Jie Fu Tencent Jie Fu Tencent JDK-8276692 Fix the implementation of loop unrolling heuristic with LoopPercentProfileLimit
237 Jie Fu Tencent Jie Fu Tencent JDK-8276691 Reset LoopPercentProfileLimit for x86 due to suboptimal performance
237 Christoph Langer SAP Prasanta Sadhukhan Oracle JDK-8276690 [TESTBUG] JPopupMenu tests fail on MacOS
237 Christoph Langer SAP Sergey Bylokhov Amazon JDK-8276689 [macosx] Test javax/swing/SpringLayout/4726194/bug4726194.java fails on MacOSX
238 Jie Fu Tencent Patric Hedlin Oracle JDK-8276676 Change (count) suffix _ct into _cnt.
238 Aleksey Shipilev Red Hat Aleksey Shipilev Red Hat JDK-8276627 Bump global JTReg memory limit to 768m
239 Martin Doerr SAP Mandy Chung Oracle JDK-8276557 java/lang/invoke/VarHandles/VarHandleTestByteArrayAsInt.java fails due to timeout with fastdebug bits
243 Christoph Langer SAP Tejpal Rebari Oracle JDK-8276203 [TEST_BUG] [macosx] The test javax/swing/JPopupMenu/4966112/bug4966112.java not for mac
244 Christoph Langer SAP Pankaj Bansal Oracle JDK-8276196 [TESTBUG] ProgressMonitorEscapeKeyPress.java fails on macos
244 Christoph Langer SAP Philip Race Oracle JDK-8276178 javax/swing/text/Utilities/8142966/SwingFontMetricsTest.java fails on windows
244 Christoph Langer SAP Erik Joelsson Oracle JDK-8276165 Change to Xcode 11.3.1 for building on Macos at Oracle
244 Martin Doerr SAP Christoph Langer SAP JDK-8276155 Some tweaks for jarsigner tests PosixPermissionsTest and SymLinkTest
244 Christoph Langer SAP Erik Joelsson Oracle JDK-8276153 Change to Xcode 10.1 for building on Macosx at Oracle
245 Severin Gehwolf Red Hat Severin Gehwolf Red Hat JDK-8275713 TestDockerMemoryMetrics test fails on recent runc
245 Goetz Lindenmaier SAP Arno Zeller SAP JDK-8276090 (fs) FileStore.supportsFileAttributeView might return false negative in case of ext3
245 Goetz Lindenmaier SAP Evan Whelan Oracle JDK-8276089 HttpURLConnection: HttpClient and HttpsClient incorrectly check request method when set to POST
245 Alexey Pavlyutkin Azul Jaikiran Pai Oracle JDK-8276087 (zipfs): Accessing a large entry (> 2^31 bytes) leads to a negative initial size for ByteArrayOutputStream
246 Goetz Lindenmaier SAP Tejpal Rebari Oracle JDK-8276041 Test java/awt/Choice/PopupPosTest/PopupPosTest.java fails on Windows
247 Christoph Langer SAP Pankaj Bansal Oracle JDK-8275995 java/awt/KeyboardFocusmanager/TypeAhead/EnqueueWithDialogButtonTest/EnqueueWithDialogButtonTest.java fails on mac
247 Christoph Langer SAP N/A Unknown JDK-8275989 Incorrect copyright header in TimeZoneDatePermissionCheck.sh
247 Christoph Langer SAP Daniil Titov Oracle JDK-8275973 java/lang/management/ThreadMXBean/AllThreadIds.java still fails intermittently
247 Martin Doerr SAP Naoto Sato Oracle JDK-8275902 TimeZoneTest.java fails with tzdata2021b
247 Martin Doerr SAP Naoto Sato Oracle JDK-8275901 TestZoneInfo310.java fails with tzdata2021b
247 Martin Doerr SAP Naoto Sato Oracle JDK-8275900 (tz) Update Timezone Data to 2021c
248 Christoph Langer SAP Daniel Fuchs Oracle JDK-8275870 Replace wildcard address with loopback or local host in tests - part 17
248 Martin Doerr SAP Prasanta Sadhukhan Oracle JDK-8275861 [TESTBUG] FocusSubRequestTest.java fails on macos
248 Martin Doerr SAP Prasanta Sadhukhan Oracle JDK-8275860 [TESTBUG] JRadioButton tests failing on MacoS
248 Martin Doerr SAP Rajat Mahajan Oracle JDK-8275859 Expand ButtonGroupLayoutTraversalTest.java to run in all LaFs, including Aqua on macOS
248 Christoph Langer SAP Jiangli Zhou Google JDK-8275853 Correctly format test URI's that contain a retrieved IPv6 address
252 Qi Ao Loongson Tobias Hartmann Oracle JDK-8275693 [TESTBUG] compiler/c1/TestPrintIRDuringConstruction.java failed when C1 is disabled
252 Vladimir Kempik JetBrains Anton Kozlov Azul JDK-8275692 Rename safefetch.hpp to safefetch.inline.hpp
253 Zhengyu Gu Red Hat Zhengyu Gu Red Hat JDK-8275637 Shenandoah: Correct ordering of requested gc cause and gc request flag
253 Martin Doerr SAP Prasanta Sadhukhan Oracle JDK-8275603 Test java/awt/Focus/NonFocusableWindowTest/NoEventsTest.java fails on Windows
253 Martin Doerr SAP Prasanta Sadhukhan Oracle JDK-8275602 java/awt/Focus/FocusTraversalPolicy/ButtonGroupLayoutTraversal/ButtonGroupLayoutTraversalTest.java fails on mac
253 Martin Doerr SAP Prasanta Sadhukhan Oracle JDK-8275601 javax/swing/JMenu/4692443/bug4692443.java fails on Windows
253 Martin Doerr SAP Sergey Bylokhov Amazon JDK-8275600 java/awt/FullScreen/FullscreenWindowProps/FullscreenWindowProps.java failed
253 Martin Doerr SAP Lance Andersen Oracle JDK-8275599 Update test/jdk/java/lang/ProcessHandle/PermissionTest.java & test/jdk/java/sql/testng/util/TestPolicy.java
253 Martin Doerr SAP Thejasvi Voniadka Oracle JDK-8275598 [Test]: Cleanup: test/jdk/security/infra/java/security/cert/CertPathValidator/certification/BuypassCA.java no longer needs ocspEnabled
253 Martin Doerr SAP Xuelei Fan Tencent JDK-8275597 typo in IllegalHandshakeMessage
253 Martin Doerr SAP Lance Andersen Oracle JDK-8275596 TestZipFile failed with java.lang.AssertionError exception
253 Vladimir Kempik JetBrains Anton Kozlov Azul JDK-8275581 Create stubRoutines.inline.hpp with SafeFetch implementation
253 Qi Ao Loongson Qi Ao Loongson JDK-8275578 Add Zero support for LoongArch
253 Christoph Langer SAP Ambarish Rapte Oracle JDK-8275577 [TESTBUG] TestNimbusOverride.java is failing on macos
253 joshcao Amazon Mikael Vidstedt Oracle JDK-8275576 Make mlvmJvmtiUtils strncpy uses GCC 10.x friendly
254 Jonathan Dowland Red Hat Dmitry Batrak JetBrains JDK-8275492 Exceptions after a touchpad gesture on macOS
254 Martin Doerr SAP Rajan Halade Oracle JDK-8275491 security/infra/java/security/cert/CertPathValidator/certification/LetsEncryptCA.java OCSP response error
254 Peng Xie Tencent Peng Xie Tencent JDK-8275455 Build failure on macOS with Xcode 13.0 as vfork is deprecated
254 Christoph Langer SAP Shashidhara Veerabhadraiah Oracle JDK-8233728 java/awt/KeyboardFocusmanager/TypeAhead/SubMenuShowTest/SubMenuShowTest.html fails on mac
254 Christoph Langer SAP Pankaj Bansal Oracle JDK-8275454 [TESTBUG] JTree tests fail regularly on MacOS
255 Christoph Langer SAP Ambarish Rapte Oracle JDK-8275425 The test OpenByUNCPathNameTest.java should be changed to be manual
255 Christoph Langer SAP Pankaj Bansal Oracle JDK-8275424 [TESTBUG] JColorChooser/Test8051548.java is failing on macos
255 Christoph Langer SAP Pankaj Bansal Oracle JDK-8275419 [TESTBUG] KeyboardFocusManager tests failing on MacoS
255 Christoph Langer SAP Pankaj Bansal Oracle JDK-8275418 [TESTBUG] JTable Test bug7068740.java fails on MacOS
255 Christoph Langer SAP Ambarish Rapte Oracle JDK-8275383 [TESTBUG] JSpinner test bug4973721.java fails on MacOS
255 Vladimir Kempik JetBrains Nils Eliasson Oracle JDK-8270526 c2 loop unrolling by 8 results in reading memory past array
258 Martin Doerr SAP Sergey Bylokhov Amazon JDK-8275325 Window positioning bugs due to overlapping GraphicsDevice bounds (Windows/HiDPI)
258 Martin Doerr SAP Prasanta Sadhukhan Oracle JDK-8275324 Tab Size does not work correctly in JTextArea with setLineWrap on
258 Yi Yang Alibaba Jaikiran Pai Oracle JDK-8275321 Potential cyclic dependencies between Gregorian and CalendarSystem
259 Martin Doerr SAP Matthias Baesken SAP JDK-8275292 Update OS detection code to recognize Windows 11
259 Jie Fu Tencent Jie Fu Tencent JDK-8275283 HostIdentifier fails to canonicalize hostnames starting with digits
259 Christoph Langer SAP Prasanta Sadhukhan Oracle JDK-8275281 [TESTBUG] Swing test ScreenMenuBarInputTwice.java fails on macos
259 Christoph Langer SAP Prasanta Sadhukhan Oracle JDK-8275280 [TESTBUG] JMenu test bug4515762.java fails on macos
259 Christoph Langer SAP Prasanta Sadhukhan Oracle JDK-8275279 [TESTBUG] JMenuBar test bug 4750590.java fails on macos
259 Christoph Langer SAP Prasanta Sadhukhan Oracle JDK-8275278 JComboBox/8057893: ComboBoxEdited event is not fired! on Windows
259 Martin Doerr SAP Wang Chao Tencent JDK-8275270 C2: assert(false) failed: Bad graph detected in build_loop_late
259 Vladimir Kempik JetBrains Anton Kozlov Azul JDK-8275261 AArch64: Refactor interpreter native wrappers
260 Qi Ao Loongson Mikhailo Seledtsov Oracle JDK-8275212 [TESTBUG] Several runtime/ErrorHandling tests may fail on some platforms
260 Qi Ao Loongson Guoxiong Li Independent JDK-8275211 nsk/jvmti/scenarios/general_functions/GF08/gf08t001/TestDriver.java fails
260 Goetz Lindenmaier SAP Thejasvi Voniadka Oracle JDK-8275200 The test test/langtools/tools/javac/versions/Versions.java has duplicate test cycles
260 Martin Doerr SAP Christian Hagedorn Oracle JDK-8275198 C2: Missing NegativeArraySizeException when creating StringBuilder with negative capacity
260 Goetz Lindenmaier SAP Prasanta Sadhukhan Oracle JDK-8275196 [TEST_BUG] javax/swing/plaf/basic/BasicHTML/4251579/bug4251579.java failure due to timing
261 Christoph Langer SAP Philip Race Oracle JDK-8275161 java/awt/FontMetrics/MaxAdvanceIsMax.java fails on MacOS + Solaris
261 Reka Kovacs Microsoft Patrick Zhang Ampere JDK-8275160 AArch64: Regression: JVM crashes if manually offline a core
261 Reka Kovacs Microsoft Anton Kozlov Azul JDK-8275159 Aarch64: Move linux code out from generic CPU feature detection
261 Goetz Lindenmaier SAP Sibabrata Sahoo Oracle JDK-8275102 Refactor javax/crypto shell tests to plain java tests
261 Goetz Lindenmaier SAP Thejasvi Voniadka Oracle JDK-8275100 Add openssl from path variable also in to Default System Openssl Path in OpensslArtifactFetcher
261 Jie Fu Tencent Jie Fu Tencent JDK-8275098 Fix non-portable HotSpot code in MethodMatcher::parse_method_pattern
261 Goetz Lindenmaier SAP Joe Darcy Oracle JDK-8275096 Refactor and improve utility of test/langtools/tools/javac/versions/Versions.java
262 Goetz Lindenmaier SAP Sean Coffey Oracle JDK-8275045 Correct Manifest file name and NPE checks
262 Goetz Lindenmaier SAP sunxu01 Loongson JDK-8275044 jdk/nio/zipfs/ZipFSTester.java fails if file path contains '+' character
262 Christoph Langer SAP Richard Reingruber SAP JDK-8275034 Incorrect copyright header in ContinuousCallSiteTargetChange.java
262 Christoph Langer SAP Sergey Bylokhov Amazon JDK-8275032 [TEST_BUG] [macosx] In test UIDefaults.toString() must be called with the invokeLater()
262 Christoph Langer SAP Mikael Vidstedt Oracle JDK-8275030 Fix copyright header formatting
262 Goetz Lindenmaier SAP Rajan Halade Oracle JDK-8275024 jtreg test security/infra/java/security/cert/CertPathValidator/certification/BuypassCA.java fails
262 Goetz Lindenmaier SAP Vicente Arturo Romero Zaldivar Oracle JDK-8275023 var in implicit lambdas shouldn't be accepted for source < 11
263 Jonathan Dowland Red Hat Prasanta Sadhukhan Oracle JDK-8275015 java/awt/Focus/6378278/InputVerifierTest.java fails on mac
265 Martin Doerr SAP Christoph Langer SAP JDK-8274957 jdk/jshell/CommandCompletionTest.java fails with NoSuchElementException after JDK-8271287
265 Martin Doerr SAP Jan Lahoda Oracle JDK-8274956 jdk/jshell/CommandCompletionTest.java fails with "lists don't have the same size expected"
265 Martin Doerr SAP Tobias Hartmann Oracle JDK-8274955 compiler/c2/Test7179138_1.java timed out
265 Martin Doerr SAP Matthias Baesken SAP JDK-8274954 Update OS detection code to recognize Windows Server 2022
266 Zhengyu Gu Red Hat Harold Seigel Oracle JDK-8274902 Null pointer dereference in classFileParser.cpp:2817
266 Martin Doerr SAP Roland Westrelin Red Hat JDK-8274887 Crash PhaseIdealLoop::clone_outer_loop
266 Martin Doerr SAP Roland Westrelin Red Hat JDK-8274886 Crash in PhaseIdealLoop::verify_strip_mined_scheduling
266 Martin Doerr SAP Roland Westrelin Red Hat JDK-8274885 Opcode() != Op_If && Opcode() != Op_RangeCheck) || outcnt() == 2 assert failure with Test7179138_1.java
266 Martin Doerr SAP Artem Semenov JetBrains JDK-8274884 missing CAccessibility definitions in JNI code
266 Aleksey Shipilev Red Hat Aleksey Shipilev Red Hat JDK-8274875 Update testing docs to mention tiered testing
266 Aleksey Shipilev Red Hat Aleksey Shipilev Red Hat JDK-8274874 Add tier4 test groups
266 Aleksey Shipilev Red Hat John Paul Adrian Glaubitz Debian JDK-8274873 Add RISC-V support to Zero
266 Jonathan Dowland Red Hat N/A Unknown JDK-8274872 Add correct licenses to jszip.md
266 Jonathan Dowland Red Hat N/A Unknown JDK-8274871 Upgrade JSZip from v3.6.0 to v3.7.1
266 Jonathan Dowland Red Hat Abdul Kolarkunnu Oracle JDK-8274870 sun/security/pkcs11/Provider/MultipleLogins.sh fails after JDK-8266182
267 Martin Doerr SAP Wang Chao Tencent JDK-8274832 C2: crash in PhaseCFG::global_code_motion
267 Martin Doerr SAP Naoto Sato Oracle JDK-8274831 ArrayIndexOutOfBoundsException thrown in java.util.JapaneseImperialCalendar.add()
267 Martin Doerr SAP Philip Race Oracle JDK-8274830 [macos] Ensure initialisation of sun/lwawt/macosx/CAccessibility in JavaComponentAccessibility.m
267 Goetz Lindenmaier SAP Daniel Fuchs Oracle JDK-8274823 ThrowingPushPromisesAsStringCustom.java fails in "try throwing in GET_BODY"
267 Goetz Lindenmaier SAP Evan Whelan Oracle JDK-8274822 sun/security/ssl/SSLLogger/LoggingFormatConsistency.java failed with "SocketException: Socket is closed"
267 Goetz Lindenmaier SAP Alexander Zvegintsev Oracle JDK-8274821 [TEST_BUG] Failure on solaris of java/awt/Window/MultiWindowApp/MultiWindowAppTest.java
267 Goetz Lindenmaier SAP Roger Riggs Oracle JDK-8274820 [test] divert spurious log output away from stream under test in ProcessBuilder Basic test
267 Goetz Lindenmaier SAP Vladimir Kozlov Oracle JDK-8274819 compiler/c2/aarch64/TestVolatilesSerial.java failed with "java.lang.RuntimeException: Wrong method"
267 Goetz Lindenmaier SAP 72060147+amresh-sahu Independent JDK-8274818 [TEST_BUG] The regression-swing case failed as it does not have the 'Open' button when select 'subdir' folder with NimbusLAF
267 Goetz Lindenmaier SAP Philip Race Oracle JDK-8274816 [TEST_BUG] closed/javax/swing/JPopupMenu/4760494/bug4760494.java leaves key pressed
267 Goetz Lindenmaier SAP Patric Hedlin Oracle JDK-8274815 Clean-up in 'ok_to_convert()'
267 Aleksey Shipilev Red Hat Aleksey Shipilev Red Hat JDK-8274814 Epsilon: Refactor tests to improve performance
267 Aleksey Shipilev Red Hat Aleksey Shipilev Red Hat JDK-8274813 Zero: SPARC64 build fails with si_band type mismatch
267 Aleksey Shipilev Red Hat Aleksey Shipilev Red Hat JDK-8274812 Create hotspot:tier2 and hotspot:tier3 test groups
267 Christoph Langer SAP Xuelei Fan Tencent JDK-8274808 AsyncSSLSocketClose.java has timing issue
268 Reka Kovacs Microsoft David Holmes Oracle JDK-8254639 Push missing parts of JDK-8248817
268 Christoph Langer SAP Erik Joelsson Oracle JDK-8274775 Add optional automatic retry when running jtreg tests
268 Christoph Langer SAP Weijun Wang Oracle JDK-8274774 Refactor sun/security/tools shell tests to plain java tests
268 Aleksey Shipilev Red Hat Jaikiran Pai Oracle JDK-8274764 ConcurrentModificationException raised every time ReferralsCache drops referral
268 Aleksey Shipilev Red Hat Aleksey Shipilev Red Hat JDK-8274763 Limit run time for java/lang/invoke/LFCaching tests
268 Aleksey Shipilev Red Hat Aleksey Shipilev Red Hat JDK-8274762 Zero: Cannot invoke JVM in primordial threads on Zero
269 Goetz Lindenmaier SAP Patric Hedlin Oracle JDK-8274749 Small clean-up in loop-tree support.
269 Zhengyu Gu Red Hat Naoto Sato Oracle JDK-8274748 ArrayIndexOutOfBoundsException in java.util.JapaneseImperialCalendar
269 Goetz Lindenmaier SAP Daniel Fuchs Oracle JDK-8274747 Update HttpClient tests that use ITestContext to jtreg 6+1
269 Aleksey Shipilev Red Hat Vladimir Ivanov Oracle JDK-8274713 C2: Missing interference with mismatched unsafe accesses
269 Jonathan Dowland Red Hat Abdul Kolarkunnu Oracle JDK-8274678 Automate manual steps listed in the test jdk/sun/security/pkcs12/ParamsTest.java
269 Goetz Lindenmaier SAP Patric Hedlin Oracle JDK-8274677 Rename mandatory policy-do routines.
269 Goetz Lindenmaier SAP Prasanta Sadhukhan Oracle JDK-8274676 [TESTBUG] javax/swing/plaf/basic/BasicGraphicsUtils/8132119/bug8132119.java fails with String is not properly drawn
269 Goetz Lindenmaier SAP Prasanta Sadhukhan Oracle JDK-8274675 [TEST_BUG] Test javax/swing/JColorChooser/Test6541987.java fails
269 Goetz Lindenmaier SAP Stuart Marks Oracle JDK-8274674 tests fail because of ambiguous method resolution
272 Goetz Lindenmaier SAP Igor Ignatyev Oracle JDK-8274653 move JarUtils to top-level testlibrary
272 Goetz Lindenmaier SAP N/A Unknown JDK-8274457 Upgrading JSZip from v3.2.2 to v3.6.0
272 Jonathan Dowland Red Hat Prasanta Sadhukhan Oracle JDK-8274649 [TESTBUG] JTextComponent test bug6361367.java fails on macos
272 Christoph Langer SAP Michael McMahon Oracle JDK-8274644 java/net/Socket/Timeouts.java testcase testTimedConnect2() fails on Windows 10
273 Goetz Lindenmaier SAP Prasanta Sadhukhan Oracle JDK-8274567 [TEST_BUG]: bug8132119.java inconsistently positions text
273 Goetz Lindenmaier SAP Patric Hedlin Oracle JDK-8274566 Rename predicate 'do_unroll_only()' to 'is_unroll_only()'.
273 Goetz Lindenmaier SAP Mandy Chung Oracle JDK-8274565 Rename test/jdk/java/lang/invoke/t8150782 to accessClassAndFindClass
273 Christoph Langer SAP Semyon Sadetsky Oracle JDK-8274556 javax/swing/JPopupMenu/6580930/bug6580930.java fails
273 Jonathan Dowland Red Hat Fernando Guallini Oracle JDK-8274555 Refactor sun/security/pkcs11 shell tests to plain java tests and fix failures
273 Jonathan Dowland Red Hat Rajat Mahajan Oracle JDK-8274553 [TEST_BUG] java/awt/print/PrinterJob/PageDialogMarginTest.java catches all exceptions
273 Jonathan Dowland Red Hat Aleksej Efimov Oracle JDK-8274552 Verify lack of @test tag in files in java/net test directory
273 Martin Doerr SAP Tobias Hartmann Oracle JDK-8274543 VM crash in MethodData::clean_extra_data(CleanExtraDataClosure*): fatal error: unexpected tag 99
273 Martin Doerr SAP Erik Österlund Oracle JDK-8274542 assert(!_unloading) failed: This oop is not available to unloading class loader data with ZGC
273 Goetz Lindenmaier SAP Weijun Wang Oracle JDK-8274540 Manual Testcase: "sun/security/krb5/config/native/TestDynamicStore.java" Fails with NPE
273 Goetz Lindenmaier SAP Mikael Vidstedt Oracle JDK-8274539 JFR Terminology Refresh
273 Goetz Lindenmaier SAP Sibabrata Sahoo Oracle JDK-8274538 Refactor javax/security shell tests to plain java tests
274 Martin Doerr SAP Artem Semenov JetBrains JDK-8274500 JavaAccessibilityUtilities leaks JNI objects
275 Zhengyu Gu Red Hat Zhengyu Gu Red Hat JDK-8274455 [TEST] vmTestbase/nsk/stress/except/except011.java failed due to wrong class name
275 Goetz Lindenmaier SAP Daniel Fuchs Oracle JDK-8274447 java/net/httpclient/FlowAdapterPublisherTest.java intermittently failing with TestServer: start exception: java.io.IOException: Invalid preface
275 Goetz Lindenmaier SAP Sergey Bylokhov Amazon JDK-8274445 Check possibility to disable OperationTimedOut on Unix
275 Goetz Lindenmaier SAP Daniel Daugherty Oracle JDK-8274444 ProblemList java/lang/management/ThreadMXBean/ThreadMXBeanStateTest.java
275 Goetz Lindenmaier SAP Sergey Bylokhov Amazon JDK-8274442 [TEST_BUG] java/awt/FullScreen/AltTabCrashTest/AltTabCrashTest.java fails with exception
275 Goetz Lindenmaier SAP Jayathirth D V Oracle JDK-8274428 java/awt/Window/TranslucentJAppletTest/TranslucentJAppletTest.java fails
275 Goetz Lindenmaier SAP Prasanta Sadhukhan Oracle JDK-8274427 [TESTBUG] MouseComboBoxTest.java is failing
275 Goetz Lindenmaier SAP Fernando Guallini Oracle JDK-8274426 Two tests sun/security/krb5/auto/ReplayCacheTestProc.java and ReplayCacheTestProcWithMD5.java failed on OL8.3
275 Goetz Lindenmaier SAP Lance Andersen Oracle JDK-8274424 Update tests for additional TestNG test permissions
275 Goetz Lindenmaier SAP Jamil Nimeh Oracle JDK-8274423 Security Libs Terminology Refresh
275 Goetz Lindenmaier SAP Brent Christian Oracle JDK-8274422 Core Libs Terminology Refresh
275 Goetz Lindenmaier SAP Daniil Titov Oracle JDK-8274420 [TESTBUG] java/lang/management/ThreadMXBean/ThreadMXBeanStateTest.java timed out intermittently
275 Goetz Lindenmaier SAP Michael McMahon Oracle JDK-8274419 cleanup of IPv6 scope-id handling
275 Goetz Lindenmaier SAP Tobias Hartmann Oracle JDK-8274418 [REDO] compiler/types/correctness/* tests fail with "assert(recv == __null || recv->is_klass()) failed: wrong type"
275 Goetz Lindenmaier SAP Alan Bateman Oracle JDK-8274417 Headful clients failing with --illegal-access=deny
275 Christoph Langer SAP Joe Wang Oracle JDK-8274411 Performance regression of XML.validation in 13-b19
276 Goetz Lindenmaier SAP Alexander Zvegintsev Oracle JDK-8274358 [TEST_BUG]: There is not a minimal security level in Java Preferences and the TestApplet.html is blocked.
276 Goetz Lindenmaier SAP Conor Cleary Oracle JDK-8274357 java/net/Inet6Address/B6206527.java doesn't close ServerSocket properly
276 Goetz Lindenmaier SAP Xuelei Fan Tencent JDK-8274356 Improve test template SSLEngineTemplate with SSLContextTemplate
276 Goetz Lindenmaier SAP Sergey Bylokhov Amazon JDK-8274355 Create a new test for rotated blit
276 Goetz Lindenmaier SAP Weijun Wang Oracle JDK-8274353 Test WeakAlg.java should only make sure no warning for weak signature algorithms by keytool on root CA
276 Goetz Lindenmaier SAP Prasanta Sadhukhan Oracle JDK-8274352 JFileChooser/8021253: java.lang.RuntimeException: Default button is not pressed
278 Goetz Lindenmaier SAP Jayathirth D V Oracle JDK-8274316 Update bug id for javax/swing/text/StyledEditorKit/4506788/bug4506788.java in ProblemList
279 Martin Doerr SAP N/A Unknown JDK-8274275 Reenable German localization for builds at Oracle
279 Goetz Lindenmaier SAP John Jiang Tencent JDK-8274263 java/net/httpclient/ssltest/CertificateTest.java should not specify TLS version
279 Christoph Langer SAP Weijun Wang Oracle JDK-8274260 Refactor sun/security/krb5/ shell tests to plain java tests
280 Christoph Langer SAP Magnus Ihse Bursie Oracle JDK-8274213 Native C++ tests are not using CXXFLAGS
280 Goetz Lindenmaier SAP Prasanta Sadhukhan Oracle JDK-8274204 PIT: javax/swing/JRadioButton/FocusTraversal/FocusTraversal.java fails on ubuntu
280 Goetz Lindenmaier SAP Prasanta Sadhukhan Oracle JDK-8274203 [TESTBUG] JInternalFrame test bug8020708.java is failing on macos
280 Goetz Lindenmaier SAP Prasanta Sadhukhan Oracle JDK-8274202 PIT: javax/swing/JInternalFrame/8020708/bug8020708.java fails in mach5 ubuntu system
280 Goetz Lindenmaier SAP Ambarish Rapte Oracle JDK-8274200 [TESTBUG] Test Right Mouse Button Drag Gesture Recognition in all the platforms
280 Goetz Lindenmaier SAP Chris Hegarty Independent JDK-8274199 Add basic HTTP/1.1 support to the HTTP/2 Test Server
280 Goetz Lindenmaier SAP Prasanta Sadhukhan Oracle JDK-8274198 PIT: javax/swing/RepaintManager/IconifyTest/IconifyTest.java fails on ubuntu18.04
280 Goetz Lindenmaier SAP Jini George Oracle JDK-8274187 Refactor SA clhsdb tests to use ClhsdbLauncher
280 Goetz Lindenmaier SAP Sergey Bylokhov Amazon JDK-8274186 [macos] PIT: java/awt/Choice/ChoiceKeyEventReaction/ChoiceKeyEventReaction.java fails
281 Martin Doerr SAP Coleen Phillimore Oracle JDK-8274158 assert(C->env()->system_dictionary_modification_counter_changed()) failed: Must invalidate if TypeFuncs differ
281 Goetz Lindenmaier SAP Prasanta Sadhukhan Oracle JDK-8274142 [TESTBUG] Swing text test bug4278839.java fails on macos
281 Goetz Lindenmaier SAP Aleksej Efimov Oracle JDK-8274140 [TESTBUG] java/net/httpclient/SmokeTest.java fails on Windows7
281 Goetz Lindenmaier SAP Daniel Fuchs Oracle JDK-8274128 Improve verbosity of some httpclient tests
281 Goetz Lindenmaier SAP Abdul Kolarkunnu Oracle JDK-8274127 [TEST_BUG] The reg case:javax/swing/plaf/metal/MetalIcons/MetalHiDPIIconsTest.java failed as No Metal Look and Feel
281 Christoph Langer SAP Alan Bateman Oracle JDK-8274125 New tests for java.net.Socket to exercise long standing behavior
281 Christoph Langer SAP Goetz Lindenmaier SAP JDK-8274124 Adapt tools//launcher/Test7029048.java for AIX
281 Christoph Langer SAP Roger Riggs Oracle JDK-8274123 java/lang/ProcessBuilder/DestroyTest.java fails with "RuntimeException: Process terminated prematurely"
282 Thomas Stuefe SAP Thomas Stuefe SAP JDK-8274049 NMT: Final report should use scale 1
282 Goetz Lindenmaier SAP Daniel Fuchs Oracle JDK-8274046 java/net/httpclient/MaxStreams.java failed once
282 Goetz Lindenmaier SAP Daniel Fuchs Oracle JDK-8274045 java/net/httpclient/Response204.java fails with 404
282 Goetz Lindenmaier SAP Abdul Kolarkunnu Oracle JDK-8274044 javax/swing/JPopupMenu/6583251/bug6583251.java failed with UnsupportedOperation exception
282 Richard Reingruber SAP Richard Reingruber SAP JDK-8274042 C2: Avoid redundant uncommon traps in GraphKit::builtin_throw() for JVMTI exception events
282 Aleksey Shipilev Red Hat Aleksey Shipilev Red Hat JDK-8274041 Drop zapping values in the Zap* option descriptions
282 Aleksey Shipilev Red Hat Ralf Schmelter SAP JDK-8274040 Improve performance of HeapDumpAllTest
283 Christoph Langer SAP Tobias Hartmann Oracle JDK-8274020 Regression test for JDK-8214994
283 Christoph Langer SAP Amy Lu Oracle JDK-8274019 java/net/Socket/asyncClose/AsyncClose.java fails intermittently
283 Christoph Langer SAP Michael McMahon Oracle JDK-8274018 Make restricted headers in HTTP Client configurable and remove Date by default
283 Martin Doerr SAP Mandy Chung Oracle JDK-8274006 Tests use deprecated TestNG API that is no longer available in new versions
283 Martin Doerr SAP Sergey Bylokhov Amazon JDK-8274005 The usage of Disposer in the java.awt.Robot can be deleted
283 Goetz Lindenmaier SAP Pankaj Bansal Oracle JDK-8273992 test javax/swing/JTree/8003400/Test8003400.java fails
283 Martin Doerr SAP Fernando Guallini Oracle JDK-8273991 sun/security/ssl/DHKeyExchange/LegacyDHEKeyExchange.java still fails due to "An established connection was aborted by the software in your host machine"
283 Martin Doerr SAP Sean Coffey Oracle JDK-8273990 Session resumption errors
283 Martin Doerr SAP Pankaj Bansal Oracle JDK-8273989 Demo selection changes with left/right arrow key. No need to press space for selection.
283 Martin Doerr SAP Xuelei Fan Tencent JDK-8273988 Configurable extensions with system properties
283 Goetz Lindenmaier SAP Sergey Bylokhov Amazon JDK-8273987 The AppletInitialFocusTest1.java is unstable
285 Jonathan Dowland Red Hat Shashidhara Veerabhadraiah Oracle JDK-8273966 java/awt/Choice/ChoiceKeyEventReaction/ChoiceKeyEventReaction.html fails
286 Goetz Lindenmaier SAP Sergey Bylokhov Amazon JDK-8273942 Remove the use of applets in automatic tests
286 Martin Doerr SAP Sean Coffey Oracle JDK-8273932 AccessControlException for SunPKCS11 daemon threads
286 Martin Doerr SAP Sean Coffey Oracle JDK-8273931 Better resource cleaning for SunPKCS11 Provider
286 Martin Doerr SAP Patric Hedlin Oracle JDK-8273930 assert(Compile::current()->live_nodes() < Compile::current()->max_node_limit()) failed: Live Node limit exceeded limit
286 Aleksey Shipilev Red Hat Gerard Ziemski Oracle JDK-8273926 assert(status == 0) failed: error ETIMEDOUT(60), cond_wait
287 Jonathan Dowland Red Hat Daniel Fuchs Oracle JDK-8273900 java/net/MulticastSocket/Promiscuous.java fails after 8241072 (multi-homed systems)
287 Aleksey Shipilev Red Hat Aleksey Shipilev Red Hat JDK-8273795 Zero SPARC64 debug builds fail due to missing interpreter fields
287 Martin Doerr SAP heinz Independent JDK-8273893 Cleaner Thread creates with normal priority instead of MAX_PRIORITY - 2
287 Martin Doerr SAP Claes Redestad Oracle JDK-8273892 Reduce classes loaded by CleanerFactory initialization
287 Martin Doerr SAP Philip Race Oracle JDK-8273891 [macOS] "Apple AWT Internal Exception" when input method is changed
287 Martin Doerr SAP Alexander Zuev Oracle JDK-8273890 [macos] Focus not painted in JButton when setBorderPainted(false) is invoked
287 Martin Doerr SAP Philip Race Oracle JDK-8273889 macOS Monterey does not have the font Times needed by Serif
287 Christoph Langer SAP David Holmes Oracle JDK-8273883 Crash in "assert(_daemon_threads_count->get_value() > daemon_count) failed: thread count mismatch 5 : 5"
287 Christoph Langer SAP Naoto Sato Oracle JDK-8273879 Fix legal headers in i18n tests
287 Thomas Stuefe SAP Thomas Stuefe SAP JDK-8273867 Add PrintMetaspaceStatistics to print metaspace statistics upon VM exit
288 Zhengyu Gu Red Hat Prasanta Sadhukhan Oracle JDK-8273820 javax/swing/JTable/6263446/bug6263446.java: Table should be editing
288 Lucy Schmidt SAP Lucy Schmidt SAP JDK-8273812 [ppc] [s390]: Crash in JavaThread::pd_get_top_frame_for_profiling
288 Martin Doerr SAP Vladimir Ivanov Oracle JDK-8273799 Native memory leak in ciMethodData ctor
288 Martin Doerr SAP Roland Westrelin Red Hat JDK-8273796 C2: assert(!loop->is_member(u_loop)) failed: can be in outer loop or out of both loops only
288 Martin Doerr SAP Christian Hagedorn Oracle JDK-8273793 C2: assert(no_dead_loop) failed: dead loop detected
288 Martin Doerr SAP Roland Westrelin Red Hat JDK-8273791 C2 compilation fails with assert(found_sfpt) failed: no node in loop that's not input to safepoint
289 Vladimir Kempik JetBrains Vladimir Kempik JetBrains JDK-8273771 Backport of 8260616 misses one JNF header inclusion removal
289 Christoph Langer SAP Daniel Fuchs Oracle JDK-8273766 Fix legal headers in jdk logging tests
289 Christoph Langer SAP Lance Andersen Oracle JDK-8273765 Update test copyrights in test/java/util/zip and test/jdk/tools
289 Christoph Langer SAP Brian Burkhalter Oracle JDK-8273764 Fix legal headers in test/java/nio
289 Christoph Langer SAP Brian Burkhalter Oracle JDK-8273763 Fix legal headers in test/java/math
289 Christoph Langer SAP Chris Hegarty Independent JDK-8273762 Fix legal headers in test/jdk/java/net
289 Martin Doerr SAP Evan Whelan Oracle JDK-8273731 Inconsistent TLS protocol version in debug output
289 Martin Doerr SAP Fernando Guallini Oracle JDK-8273716 DHKeyExchange/LegacyDHEKeyExchange.java failed due to "SSLException: An established connection was aborted by the software in your host machine"
289 Aleksey Shipilev Red Hat Yasumasa Suenaga NTT DATA JDK-8273705 Build error with GCC 10 in NetworkInterface.c and k_standard.c
290 Bin Liao Tencent Ralf Schmelter SAP JDK-8273668 Add option to jcmd to write a gzipped heap dump
292 Christoph Langer SAP Rajan Halade Oracle JDK-8273631 Remove Google certificate that is expiring in December 2021
292 Christoph Langer SAP Jonathan Gibbons Oracle JDK-8273630 fix legal headers in test/langtools
292 Christoph Langer SAP Amy Lu Oracle JDK-8273628 Move java/util/Arrays/TimSortStackSize2.java back to tier1
292 Christoph Langer SAP Alex Menkov Oracle JDK-8273627 BasicJDWPConnectionTest.java: 'App exited unexpectedly with 2'
293 Sergey Bylokhov Amazon Sergey Bylokhov Amazon JDK-8272966 test/jdk/java/awt/Robot/FlushCurrentEvent.java fails by timeout
293 Severin Gehwolf Red Hat Severin Gehwolf Red Hat JDK-8273547 [11u] [JVMCI] Partial module-info.java backport of JDK-8223332
293 Martin Doerr SAP Jan Lahoda Oracle JDK-8273589 JShell: No custom input (e.g. from GUI) possible with JavaShellToolBuilder
293 Martin Doerr SAP 70650887+skodanda Independent JDK-8273588 JConsole User Guide Link from the Help menu is not accessible by keyboard
293 Martin Doerr SAP Philip Race Oracle JDK-8273587 [macos] Unexpected symbol was displayed on JTextField with Monospaced font
293 Christoph Langer SAP Weijun Wang Oracle JDK-8273580 Add doc to SecurityTools.java
294 Vladimir Kempik JetBrains Vladimir Kempik JetBrains JDK-8273574 AArch64: Native types mismatch in hotspot
294 Christoph Langer SAP Joe Darcy Oracle JDK-8273572 Refactor langtools/tools/javac/versions/Versions.java
294 Clive Verghese Amazon Clive Verghese Amazon JDK-8273568 Large Allocation in CipherSuite
295 Aleksey Shipilev Red Hat Rajan Halade Oracle JDK-8273500 security/infra/java/security/cert/CertPathValidator/certification/QuoVadisCA.java fails, Certificate has been revoked
295 Bin Liao Tencent Stefan Karlsson Oracle JDK-8266354 JDK-8215624 causes assert(worker_id < _n_workers) failed: Invalid worker_id
295 Bin Liao Tencent Per Liden @malloc.se JDK-8273470 ParallelObjectIterator should have virtual destructor
295 Bin Liao Tencent Paul Hohensee Amazon JDK-8266352 Add parallel heap iteration for jmap –histo
296 Christoph Langer SAP Thejasvi Voniadka Oracle JDK-8273434 [Test]: java/net/httpclient/DigestEchoClientSSL.java contains redundant @run tags
296 Martin Doerr SAP Alexander Zuev Oracle JDK-8273415 [macos] JTabbedPane title looks like disabled
297 Matthias Baesken SAP Matthias Baesken SAP JDK-8272316 Wrong Boot JDK help message in 11
299 Martin Doerr SAP Anton Litvinov Oracle JDK-8273354 [macOS] Exception from "Printable.print" is swallowed during "PrinterJob.print"
300 Sergey Nazarkin Azul Nick Gasson ARM JDK-8273313 C2: ClhsdbJstackXcompStress test fails when StressGCM is enabled
300 Vladimir Kempik JetBrains Philip Race Oracle JDK-8273305 [macOS] Update named used for Java run loop mode
301 Martin Doerr SAP Prasanta Sadhukhan Oracle JDK-8273287 [macos11] JTabbedPane selected tab text is barely legible
301 Martin Doerr SAP Philip Race Oracle JDK-8273286 [macosx] Print-to-file doesn't work: printing to the default printer instead
302 Matthias Baesken SAP Matthias Baesken SAP JDK-8273226 Avoid division by 0 in java/awt/font/TextJustifier.java justify
303 Goetz Lindenmaier SAP Goetz Lindenmaier SAP JDK-8272902 Bump update version for OpenJDK: jdk-11.0.14
1078 Martin Balao Red Hat Weijun Wang Oracle JDK-8280177 jarsigner breaks old signature with long lines in manifest

No changesets log

Committer push log

54955201+macarte, Independent

Bug Summary
JDK-8277876 Configure initial RTO to use minimal retry for loopback connections on Windows
JDK-8277959 Extend minimal retry for loopback connections on Windows to PlainSocketImpl
JDK-8277953 Support for identifying the full range of IPv4 localhost addresses on Windows

Ilarion Nakonechnyy, Azul

Bug Summary
JDK-8277568 Slow LoginContext.login() on multi threading application

Adam Farley, Red Hat

Bug Summary
JDK-8277644 tools/launcher/HelpFlagsTest.java Fails on Windows 32bit

Alex Kasko, Red Hat

Bug Summary
JDK-8277898 NTLM authentication fails if HEAD request is used

Andrew Hughes, Red Hat

Bug Summary
JDK-8277035 HttpClient leaves HTTP/2 sockets in CLOSE_WAIT, when using proxy tunnel

Qi Ao, Loongson

Bug Summary
JDK-8275693 [TESTBUG] compiler/c1/TestPrintIRDuringConstruction.java failed when C1 is disabled
JDK-8275212 [TESTBUG] Several runtime/ErrorHandling tests may fail on some platforms
JDK-8275578 Add Zero support for LoongArch
JDK-8275211 nsk/jvmti/scenarios/general_functions/GF08/gf08t001/TestDriver.java fails

Alexey Pavlyutkin, Azul

Bug Summary
JDK-8276087 (zipfs): Accessing a large entry (> 2^31 bytes) leads to a negative initial size for ByteArrayOutputStream
JDK-8276888 AArch64: size_fits_all_mem_uses should return false if its output is a CAS

Andrew Haley, Red Hat

Bug Summary
JDK-8277800 AArch64: AES Galois CounterMode (GCM) interleaved implementation using vector instructions

Peng Xie, Tencent

Bug Summary
JDK-8275455 Build failure on macOS with Xcode 13.0 as vfork is deprecated

Bin Liao, Tencent

Bug Summary
JDK-8273668 Add option to jcmd to write a gzipped heap dump
JDK-8266352 Add parallel heap iteration for jmap –histo
JDK-8266354 JDK-8215624 causes assert(worker_id < _n_workers) failed: Invalid worker_id
JDK-8273470 ParallelObjectIterator should have virtual destructor

Bernhard Urban-Forster, Oracle

Bug Summary
JDK-8276185 AArch64: Remove the r18 dependency on Windows AArch64

Christoph Langer, SAP

Bug Summary
JDK-8276689 [macosx] Test javax/swing/SpringLayout/4726194/bug4726194.java fails on MacOSX
JDK-8276973 [macosx]Test java/awt/Focus/8073453/AWTFocusTransitionTest.java fails on MacOSX
JDK-8273434 [Test]: java/net/httpclient/DigestEchoClientSSL.java contains redundant @run tags
JDK-8276924 [TEST_BUG] [macos] javax/swing/JPopupMenu/7156657/bug7156657.java fails on OS X
JDK-8275032 [TEST_BUG] [macosx] In test UIDefaults.toString() must be called with the invokeLater()
JDK-8276203 [TEST_BUG] [macosx] The test javax/swing/JPopupMenu/4966112/bug4966112.java not for mac
JDK-8276770 [TESTBUG] HTMLEditorKit test bug5043626.java is failing on macos
JDK-8275424 [TESTBUG] JColorChooser/Test8051548.java is failing on macos
JDK-8275280 [TESTBUG] JMenu test bug4515762.java fails on macos
JDK-8275279 [TESTBUG] JMenuBar test bug 4750590.java fails on macos
JDK-8276777 [TESTBUG] JMenuItem test bug4171437.java fails on macos
JDK-8276690 [TESTBUG] JPopupMenu tests fail on MacOS
JDK-8275383 [TESTBUG] JSpinner test bug4973721.java fails on MacOS
JDK-8275418 [TESTBUG] JTable Test bug7068740.java fails on MacOS
JDK-8275454 [TESTBUG] JTree tests fail regularly on MacOS
JDK-8275419 [TESTBUG] KeyboardFocusManager tests failing on MacoS
JDK-8276196 [TESTBUG] ProgressMonitorEscapeKeyPress.java fails on macos
JDK-8276778 [TESTBUG] Swing ActionListenerCalledTwiceTest.java fails on macos
JDK-8276923 [TESTBUG] Swing StyledEditorKit test bug4506788.java fails on MacOS
JDK-8275281 [TESTBUG] Swing test ScreenMenuBarInputTwice.java fails on macos
JDK-8276840 [TESTBUG] Swing text test bug8014863.java fails on macos
JDK-8275577 [TESTBUG] TestNimbusOverride.java is failing on macos
JDK-8276776 [TESTBUG] ToolTipManager/Test6256140.java is failing on macos
JDK-8274124 Adapt tools//launcher/Test7029048.java for AIX
JDK-8273580 Add doc to SecurityTools.java
JDK-8274775 Add optional automatic retry when running jtreg tests
JDK-8274808 AsyncSSLSocketClose.java has timing issue
JDK-8273627 BasicJDWPConnectionTest.java: 'App exited unexpectedly with 2'
JDK-8276153 Change to Xcode 10.1 for building on Macosx at Oracle
JDK-8276165 Change to Xcode 11.3.1 for building on Macos at Oracle
JDK-8275853 Correctly format test URI's that contain a retrieved IPv6 address
JDK-8273883 Crash in "assert(_daemon_threads_count->get_value() > daemon_count) failed: thread count mismatch 5 : 5"
JDK-8275030 Fix copyright header formatting
JDK-8273879 Fix legal headers in i18n tests
JDK-8273766 Fix legal headers in jdk logging tests
JDK-8273763 Fix legal headers in test/java/math
JDK-8273764 Fix legal headers in test/java/nio
JDK-8273762 Fix legal headers in test/jdk/java/net
JDK-8273630 fix legal headers in test/langtools
JDK-8277815 Fix mistakes in legal header backports
JDK-8275034 Incorrect copyright header in ContinuousCallSiteTargetChange.java
JDK-8275989 Incorrect copyright header in TimeZoneDatePermissionCheck.sh
JDK-8276974 java/awt/Focus/6382144/EndlessLoopTest.java fails on mac
JDK-8275161 java/awt/FontMetrics/MaxAdvanceIsMax.java fails on MacOS + Solaris
JDK-8275995 java/awt/KeyboardFocusmanager/TypeAhead/EnqueueWithDialogButtonTest/EnqueueWithDialogButtonTest.java fails on mac
JDK-8233728 java/awt/KeyboardFocusmanager/TypeAhead/SubMenuShowTest/SubMenuShowTest.html fails on mac
JDK-8275973 java/lang/management/ThreadMXBean/AllThreadIds.java still fails intermittently
JDK-8274123 java/lang/ProcessBuilder/DestroyTest.java fails with "RuntimeException: Process terminated prematurely"
JDK-8274019 java/net/Socket/asyncClose/AsyncClose.java fails intermittently
JDK-8274644 java/net/Socket/Timeouts.java testcase testTimedConnect2() fails on Windows 10
JDK-8274556 javax/swing/JPopupMenu/6580930/bug6580930.java fails
JDK-8276178 javax/swing/text/Utilities/8142966/SwingFontMetricsTest.java fails on windows
JDK-8275278 JComboBox/8057893: ComboBoxEdited event is not fired! on Windows
JDK-8274018 Make restricted headers in HTTP Client configurable and remove Date by default
JDK-8273628 Move java/util/Arrays/TimSortStackSize2.java back to tier1
JDK-8274213 Native C++ tests are not using CXXFLAGS
JDK-8274125 New tests for java.net.Socket to exercise long standing behavior
JDK-8274411 Performance regression of XML.validation in 13-b19
JDK-8273572 Refactor langtools/tools/javac/versions/Versions.java
JDK-8274260 Refactor sun/security/krb5/ shell tests to plain java tests
JDK-8274774 Refactor sun/security/tools shell tests to plain java tests
JDK-8274020 Regression test for JDK-8214994
JDK-8273631 Remove Google certificate that is expiring in December 2021
JDK-8275870 Replace wildcard address with loopback or local host in tests - part 17
JDK-8277143 testlibrary_tests/ctw/JarDirTest.java fails with InvalidPathException on windows
JDK-8275425 The test OpenByUNCPathNameTest.java should be changed to be manual
JDK-8273765 Update test copyrights in test/java/util/zip and test/jdk/tools

Clive Verghese, Amazon

Bug Summary
JDK-8273568 Large Allocation in CipherSuite

Goetz Lindenmaier, SAP

Bug Summary
JDK-8276090 (fs) FileStore.supportsFileAttributeView might return false negative in case of ext3
JDK-8277034 [Graal] fromTonga/nsk/jvmti/unit/FollowReferences/followref003/TestDescription.java fails with "Location mismatch" errors
JDK-8274186 [macos] PIT: java/awt/Choice/ChoiceKeyEventReaction/ChoiceKeyEventReaction.java fails
JDK-8274418 [REDO] compiler/types/correctness/* tests fail with "assert(recv == __null || recv->is_klass()) failed: wrong type"
JDK-8277910 [REDO] Handle JNIGlobalRefLocker.cpp
JDK-8274820 [test] divert spurious log output away from stream under test in ProcessBuilder Basic test
JDK-8274816 [TEST_BUG] closed/javax/swing/JPopupMenu/4760494/bug4760494.java leaves key pressed
JDK-8274821 [TEST_BUG] Failure on solaris of java/awt/Window/MultiWindowApp/MultiWindowAppTest.java
JDK-8274442 [TEST_BUG] java/awt/FullScreen/AltTabCrashTest/AltTabCrashTest.java fails with exception
JDK-8275196 [TEST_BUG] javax/swing/plaf/basic/BasicHTML/4251579/bug4251579.java failure due to timing
JDK-8274675 [TEST_BUG] Test javax/swing/JColorChooser/Test6541987.java fails
JDK-8274127 [TEST_BUG] The reg case:javax/swing/plaf/metal/MetalIcons/MetalHiDPIIconsTest.java failed as No Metal Look and Feel
JDK-8274818 [TEST_BUG] The regression-swing case failed as it does not have the 'Open' button when select 'subdir' folder with NimbusLAF
JDK-8274567 [TEST_BUG]: bug8132119.java inconsistently positions text
JDK-8274358 [TEST_BUG]: There is not a minimal security level in Java Preferences and the TestApplet.html is blocked.
JDK-8277114 [TESTBUG] auto failed with the "Applet thread threw exception: java.lang.UnsupportedOperationException" exception
JDK-8277835 [TESTBUG] hs203t003 fails with "# ERROR: hs203t003.cpp, 218: NSK_CPP_STUB2 ( ResumeThread, jvmti, thread)"
JDK-8274420 [TESTBUG] java/lang/management/ThreadMXBean/ThreadMXBeanStateTest.java timed out intermittently
JDK-8274140 [TESTBUG] java/net/httpclient/SmokeTest.java fails on Windows7
JDK-8274676 [TESTBUG] javax/swing/plaf/basic/BasicGraphicsUtils/8132119/bug8132119.java fails with String is not properly drawn
JDK-8274203 [TESTBUG] JInternalFrame test bug8020708.java is failing on macos
JDK-8274427 [TESTBUG] MouseComboBoxTest.java is failing
JDK-8274142 [TESTBUG] Swing text test bug4278839.java fails on macos
JDK-8274200 [TESTBUG] Test Right Mouse Button Drag Gesture Recognition in all the platforms
JDK-8274199 Add basic HTTP/1.1 support to the HTTP/2 Test Server
JDK-8275100 Add openssl from path variable also in to Default System Openssl Path in OpensslArtifactFetcher
JDK-8272902 Bump update version for OpenJDK: jdk-11.0.14
JDK-8274445 Check possibility to disable OperationTimedOut on Unix
JDK-8277745 Clean up JNI_ENV_ARG and factorize the macros for vmTestbase/jvmti/unit tests
JDK-8277826 Clean up JNI_ENV_ARG and factorize the macros for vmTestbase/jvmti[A-N] tests
JDK-8277742 Clean up JNI_ENV_ARG and factorize the macros for vmTestbase/jvmti[N-R] tests
JDK-8277743 Clean up JNI_ENV_ARG and factorize the macros for vmTestbase/jvmti[R-U] tests
JDK-8277565 Clean up JNI_ENV_ARG for vmTestbase/jvmti/Get[A-F] tests
JDK-8277741 Clean up JNI_ENV_ARG for vmTestbase/jvmti/Get[G-Z] tests
JDK-8274815 Clean-up in 'ok_to_convert()'
JDK-8274419 cleanup of IPv6 scope-id handling
JDK-8277506 compile error in libfollowref003.cpp with XCode 10.2 on macosx
JDK-8274819 compiler/c2/aarch64/TestVolatilesSerial.java failed with "java.lang.RuntimeException: Wrong method"
JDK-8274422 Core Libs Terminology Refresh
JDK-8275045 Correct Manifest file name and NPE checks
JDK-8274355 Create a new test for rotated blit
JDK-8277827 Fix up a few minor nits forgotten by JDK-8210665
JDK-8277913 Handle remaining gc/lock native code and fix two strings
JDK-8274417 Headful clients failing with --illegal-access=deny
JDK-8276089 HttpURLConnection: HttpClient and HttpsClient incorrectly check request method when set to POST
JDK-8274356 Improve test template SSLEngineTemplate with SSLContextTemplate
JDK-8274128 Improve verbosity of some httpclient tests
JDK-8274428 java/awt/Window/TranslucentJAppletTest/TranslucentJAppletTest.java fails
JDK-8274447 java/net/httpclient/FlowAdapterPublisherTest.java intermittently failing with TestServer: start exception: java.io.IOException: Invalid preface
JDK-8274046 java/net/httpclient/MaxStreams.java failed once
JDK-8274045 java/net/httpclient/Response204.java fails with 404
JDK-8274263 java/net/httpclient/ssltest/CertificateTest.java should not specify TLS version
JDK-8274357 java/net/Inet6Address/B6206527.java doesn't close ServerSocket properly
JDK-8277115 java/nio/file/WatchService/LotsOfEvents.java fails intermittently
JDK-8274044 javax/swing/JPopupMenu/6583251/bug6583251.java failed with UnsupportedOperation exception
JDK-8275044 jdk/nio/zipfs/ZipFSTester.java fails if file path contains '+' character
JDK-8274352 JFileChooser/8021253: java.lang.RuntimeException: Default button is not pressed
JDK-8274539 JFR Terminology Refresh
JDK-8275024 jtreg test security/infra/java/security/cert/CertPathValidator/certification/BuypassCA.java fails
JDK-8277118 Make string buffer size dynamic in mlvmJvmtiUtils.c
JDK-8274540 Manual Testcase: "sun/security/krb5/config/native/TestDynamicStore.java" Fails with NPE
JDK-8274653 move JarUtils to top-level testlibrary
JDK-8277181 nsk.nsk/jvmti/ThreadStart/threadstart003 Wrong number of thread end events
JDK-8274202 PIT: javax/swing/JInternalFrame/8020708/bug8020708.java fails in mach5 ubuntu system
JDK-8274204 PIT: javax/swing/JRadioButton/FocusTraversal/FocusTraversal.java fails on ubuntu
JDK-8274198 PIT: javax/swing/RepaintManager/IconifyTest/IconifyTest.java fails on ubuntu18.04
JDK-8274444 ProblemList java/lang/management/ThreadMXBean/ThreadMXBeanStateTest.java
JDK-8275096 Refactor and improve utility of test/langtools/tools/javac/versions/Versions.java
JDK-8275102 Refactor javax/crypto shell tests to plain java tests
JDK-8274538 Refactor javax/security shell tests to plain java tests
JDK-8274187 Refactor SA clhsdb tests to use ClhsdbLauncher
JDK-8277744 Remove #ifdef cplusplus from vmTestbase
JDK-8277509 Remove macros for C compilation from vmTestBase but non jvmti
JDK-8277838 Remove multiple casts for EM06 file
JDK-8277943 Remove remaining NSK_CPP_STUBs
JDK-8277834 Remove the multi-line old C style for string literals
JDK-8277911 Remove the NSK_CPP_STUB macros for remaining vmTestbase/jvmti/[sS]*
JDK-8277836 Remove the NSK_CPP_STUB macros from vmTestbase for jvmti/[A-G]*
JDK-8277837 Remove the NSK_CPP_STUB macros from vmTestbase for jvmti/[G-I]*
JDK-8277889 Remove the NSK_CPP_STUB macros from vmTestbase for jvmti/[I-S]*
JDK-8277839 Remove the NSK_CPP_STUB macros from vmTestbase for jvmti/scenarios/[A-E]
JDK-8277914 Remove the NSK_CPP_STUB macros from vmTestbase for jvmti/scenarios/[E-M]
JDK-8277888 Remove the NSK_STUB macros from vmTestbase for non jvmti
JDK-8273942 Remove the use of applets in automatic tests
JDK-8274677 Rename mandatory policy-do routines.
JDK-8274566 Rename predicate 'do_unroll_only()' to 'is_unroll_only()'.
JDK-8274565 Rename test/jdk/java/lang/invoke/t8150782 to accessClassAndFindClass
JDK-8274423 Security Libs Terminology Refresh
JDK-8274749 Small clean-up in loop-tree support.
JDK-8274822 sun/security/ssl/SSLLogger/LoggingFormatConsistency.java failed with "SocketException: Socket is closed"
JDK-8276041 Test java/awt/Choice/PopupPosTest/PopupPosTest.java fails on Windows
JDK-8273992 test javax/swing/JTree/8003400/Test8003400.java fails
JDK-8274353 Test WeakAlg.java should only make sure no warning for weak signature algorithms by keytool on root CA
JDK-8274674 tests fail because of ambiguous method resolution
JDK-8273987 The AppletInitialFocusTest1.java is unstable
JDK-8277320 The javax/swing/JPopupMenu/7154841/bug7154841.java fail on big screens
JDK-8275200 The test test/langtools/tools/javac/versions/Versions.java has duplicate test cycles
JDK-8274823 ThrowingPushPromisesAsStringCustom.java fails in "try throwing in GET_BODY"
JDK-8274426 Two tests sun/security/krb5/auto/ReplayCacheTestProc.java and ReplayCacheTestProcWithMD5.java failed on OL8.3
JDK-8274316 Update bug id for javax/swing/text/StyledEditorKit/4506788/bug4506788.java in ProblemList
JDK-8274747 Update HttpClient tests that use ITestContext to jtreg 6+1
JDK-8274424 Update tests for additional TestNG test permissions
JDK-8274457 Upgrading JSZip from v3.2.2 to v3.6.0
JDK-8277505 use C++ compiler for hotspot tests
JDK-8275023 var in implicit lambdas shouldn't be accepted for source < 11

Jonathan Dowland, Red Hat

Bug Summary
JDK-8274553 [TEST_BUG] java/awt/print/PrinterJob/PageDialogMarginTest.java catches all exceptions
JDK-8274649 [TESTBUG] JTextComponent test bug6361367.java fails on macos
JDK-8274872 Add correct licenses to jszip.md
JDK-8274678 Automate manual steps listed in the test jdk/sun/security/pkcs12/ParamsTest.java
JDK-8275492 Exceptions after a touchpad gesture on macOS
JDK-8273966 java/awt/Choice/ChoiceKeyEventReaction/ChoiceKeyEventReaction.html fails
JDK-8275015 java/awt/Focus/6378278/InputVerifierTest.java fails on mac
JDK-8273900 java/net/MulticastSocket/Promiscuous.java fails after 8241072 (multi-homed systems)
JDK-8274555 Refactor sun/security/pkcs11 shell tests to plain java tests and fix failures
JDK-8274870 sun/security/pkcs11/Provider/MultipleLogins.sh fails after JDK-8266182
JDK-8274871 Upgrade JSZip from v3.6.0 to v3.7.1
JDK-8274552 Verify lack of @test tag in files in java/net test directory

Jie Fu, Tencent

Bug Summary
JDK-8276911 -XX:MaxRAMPercentage=0 is unreasonable for jtreg tests on many-core machines
JDK-8276676 Change (count) suffix _ct into _cnt.
JDK-8275098 Fix non-portable HotSpot code in MethodMatcher::parse_method_pattern
JDK-8276692 Fix the implementation of loop unrolling heuristic with LoopPercentProfileLimit
JDK-8275283 HostIdentifier fails to canonicalize hostnames starting with digits
JDK-8276912 javax/swing/text/html/parser/Parser/8078268/bug8078268.java timeout
JDK-8277364 RegisterImpl::max_slots_per_register is incorrect on AMD64
JDK-8276834 Remove src/hotspot/share/adlc/Test/i486.ad
JDK-8276691 Reset LoopPercentProfileLimit for x86 due to suboptimal performance
JDK-8277747 TestJpsHostName.java not reliable, better to expand HostIdentifierCreate.java test

joshcao, Amazon

Bug Summary
JDK-8274860 gcc 10.2.1 produces an uninitialized warning in sharedRuntimeTrig.cpp
JDK-8275576 Make mlvmJvmtiUtils strncpy uses GCC 10.x friendly

Lucy Schmidt, SAP

Bug Summary
JDK-8273812 [ppc] [s390]: Crash in JavaThread::pd_get_top_frame_for_profiling

Matthias Baesken, SAP

Bug Summary
JDK-8273226 Avoid division by 0 in java/awt/font/TextJustifier.java justify
JDK-8272316 Wrong Boot JDK help message in 11

Martin Balao, Red Hat

Bug Summary
JDK-8280177 jarsigner breaks old signature with long lines in manifest

Martin Doerr, SAP

Bug Summary
JDK-8275900 (tz) Update Timezone Data to 2021c
JDK-8277376 (tz) Update Timezone Data to 2021e
JDK-8278333 (zipfs) Files.walkFileTree walks infinitely if zip has dir named "." inside
JDK-8273287 [macos11] JTabbedPane selected tab text is barely legible
JDK-8273891 [macOS] "Apple AWT Internal Exception" when input method is changed
JDK-8274830 [macos] Ensure initialisation of sun/lwawt/macosx/CAccessibility in JavaComponentAccessibility.m
JDK-8273354 [macOS] Exception from "Printable.print" is swallowed during "PrinterJob.print"
JDK-8273890 [macos] Focus not painted in JButton when setBorderPainted(false) is invoked
JDK-8273415 [macos] JTabbedPane title looks like disabled
JDK-8273587 [macos] Unexpected symbol was displayed on JTextField with Monospaced font
JDK-8273286 [macosx] Print-to-file doesn't work: printing to the default printer instead
JDK-8275598 [Test]: Cleanup: test/jdk/security/infra/java/security/cert/CertPathValidator/certification/BuypassCA.java no longer needs ocspEnabled
JDK-8275861 [TESTBUG] FocusSubRequestTest.java fails on macos
JDK-8275860 [TESTBUG] JRadioButton tests failing on MacoS
JDK-8277841 [TESTBUG] UnsafeIntrinsicsTest intermittently fails on weak memory model platform
JDK-8273932 AccessControlException for SunPKCS11 daemon threads
JDK-8274831 ArrayIndexOutOfBoundsException thrown in java.util.JapaneseImperialCalendar.add()
JDK-8274542 assert(!_unloading) failed: This oop is not available to unloading class loader data with ZGC
JDK-8274158 assert(C->env()->system_dictionary_modification_counter_changed()) failed: Must invalidate if TypeFuncs differ
JDK-8273930 assert(Compile::current()->live_nodes() < Compile::current()->max_node_limit()) failed: Live Node limit exceeded limit
JDK-8273931 Better resource cleaning for SunPKCS11 Provider
JDK-8273791 C2 compilation fails with assert(found_sfpt) failed: no node in loop that's not input to safepoint
JDK-8273796 C2: assert(!loop->is_member(u_loop)) failed: can be in outer loop or out of both loops only
JDK-8275270 C2: assert(false) failed: Bad graph detected in build_loop_late
JDK-8273793 C2: assert(no_dead_loop) failed: dead loop detected
JDK-8274832 C2: crash in PhaseCFG::global_code_motion
JDK-8275198 C2: Missing NegativeArraySizeException when creating StringBuilder with negative capacity
JDK-8273893 Cleaner Thread creates with normal priority instead of MAX_PRIORITY - 2
JDK-8274955 compiler/c2/Test7179138_1.java timed out
JDK-8273988 Configurable extensions with system properties
JDK-8278155 Cookie stored in CookieHandler not sent if user headers contain cookie
JDK-8274886 Crash in PhaseIdealLoop::verify_strip_mined_scheduling
JDK-8274887 Crash PhaseIdealLoop::clone_outer_loop
JDK-8273989 Demo selection changes with left/right arrow key. No need to press space for selection.
JDK-8273716 DHKeyExchange/LegacyDHEKeyExchange.java failed due to "SSLException: An established connection was aborted by the software in your host machine"
JDK-8275859 Expand ButtonGroupLayoutTraversalTest.java to run in all LaFs, including Aqua on macOS
JDK-8273731 Inconsistent TLS protocol version in debug output
JDK-8275602 java/awt/Focus/FocusTraversalPolicy/ButtonGroupLayoutTraversal/ButtonGroupLayoutTraversalTest.java fails on mac
JDK-8275600 java/awt/FullScreen/FullscreenWindowProps/FullscreenWindowProps.java failed
JDK-8276557 java/lang/invoke/VarHandles/VarHandleTestByteArrayAsInt.java fails due to timeout with fastdebug bits
JDK-8274500 JavaAccessibilityUtilities leaks JNI objects
JDK-8275601 javax/swing/JMenu/4692443/bug4692443.java fails on Windows
JDK-8273588 JConsole User Guide Link from the Help menu is not accessible by keyboard
JDK-8274956 jdk/jshell/CommandCompletionTest.java fails with "lists don't have the same size expected"
JDK-8274957 jdk/jshell/CommandCompletionTest.java fails with NoSuchElementException after JDK-8271287
JDK-8273589 JShell: No custom input (e.g. from GUI) possible with JavaShellToolBuilder
JDK-8273889 macOS Monterey does not have the font Times needed by Serif
JDK-8274884 missing CAccessibility definitions in JNI code
JDK-8273799 Native memory leak in ciMethodData ctor
JDK-8274885 Opcode() != Op_If && Opcode() != Op_RangeCheck) || outcnt() == 2 assert failure with Test7179138_1.java
JDK-8273892 Reduce classes loaded by CleanerFactory initialization
JDK-8274275 Reenable German localization for builds at Oracle
JDK-8275491 security/infra/java/security/cert/CertPathValidator/certification/LetsEncryptCA.java OCSP response error
JDK-8273990 Session resumption errors
JDK-8278498 SIGSEGV in C2 CompilerThread Node::rematerialize() compiling Packet::readUnsignedTrint
JDK-8276155 Some tweaks for jarsigner tests PosixPermissionsTest and SymLinkTest
JDK-8277840 sun.security.pkcs.PKCS9Attributes.toString() throws NPE
JDK-8273991 sun/security/ssl/DHKeyExchange/LegacyDHEKeyExchange.java still fails due to "An established connection was aborted by the software in your host machine"
JDK-8275324 Tab Size does not work correctly in JTextArea with setLineWrap on
JDK-8275603 Test java/awt/Focus/NonFocusableWindowTest/NoEventsTest.java fails on Windows
JDK-8274006 Tests use deprecated TestNG API that is no longer available in new versions
JDK-8275596 TestZipFile failed with java.lang.AssertionError exception
JDK-8275901 TestZoneInfo310.java fails with tzdata2021b
JDK-8277377 TestZoneInfo310.java fails with tzdata2021e
JDK-8274005 The usage of Disposer in the java.awt.Robot can be deleted
JDK-8275902 TimeZoneTest.java fails with tzdata2021b
JDK-8275597 typo in IllegalHandshakeMessage
JDK-8275292 Update OS detection code to recognize Windows 11
JDK-8274954 Update OS detection code to recognize Windows Server 2022
JDK-8275599 Update test/jdk/java/lang/ProcessHandle/PermissionTest.java & test/jdk/java/sql/testng/util/TestPolicy.java
JDK-8277378 Update TimeZoneNames files to follow the changes made by JDK-8275766
JDK-8274543 VM crash in MethodData::clean_extra_data(CleanExtraDataClosure*): fatal error: unexpected tag 99
JDK-8275325 Window positioning bugs due to overlapping GraphicsDevice bounds (Windows/HiDPI)

pmikova, Red Hat

Bug Summary
JDK-8277109 Add @requires to vmTestbase/gc/g1 tests

Reka Kovacs, Microsoft

Bug Summary
JDK-8275159 Aarch64: Move linux code out from generic CPU feature detection
JDK-8275160 AArch64: Regression: JVM crashes if manually offline a core
JDK-8254639 Push missing parts of JDK-8248817

Reka Kovacs, Microsoft

Bug Summary
JDK-8277875 Implementation: JEP 388: Windows AArch64 Support
JDK-8264183 Windows-AArch64: Enable and test ZGC and ShenandoahGC
JDK-8272181 Windows-AArch64:Backport fix of `Backtracing broken on PAC enabled systems`

Richard Reingruber, SAP

Bug Summary
JDK-8274042 C2: Avoid redundant uncommon traps in GraphKit::builtin_throw() for JVMTI exception events

Sergey Bylokhov, Amazon

Bug Summary
JDK-8272966 test/jdk/java/awt/Robot/FlushCurrentEvent.java fails by timeout

Severin Gehwolf, Red Hat

Bug Summary
JDK-8273547 [11u] [JVMCI] Partial module-info.java backport of JDK-8223332
JDK-8275713 TestDockerMemoryMetrics test fails on recent runc

Aleksey Shipilev, Red Hat

Bug Summary
JDK-8274873 Add RISC-V support to Zero
JDK-8274874 Add tier4 test groups
JDK-8273926 assert(status == 0) failed: error ETIMEDOUT(60), cond_wait
JDK-8273705 Build error with GCC 10 in NetworkInterface.c and k_standard.c
JDK-8276627 Bump global JTReg memory limit to 768m
JDK-8277341 C2: Compiler stack overflow during escape analysis on Linux x86_32
JDK-8274713 C2: Missing interference with mismatched unsafe accesses
JDK-8274764 ConcurrentModificationException raised every time ReferralsCache drops referral
JDK-8274812 Create hotspot:tier2 and hotspot:tier3 test groups
JDK-8274041 Drop zapping values in the Zap* option descriptions
JDK-8274814 Epsilon: Refactor tests to improve performance
JDK-8274040 Improve performance of HeapDumpAllTest
JDK-8276938 java/lang/management/ManagementFactory/MXBeanException.java test fails with Shenandoah
JDK-8274763 Limit run time for java/lang/invoke/LFCaching tests
JDK-8277327 security/infra/java/security/cert/CertPathValidator/certification/ComodoCA.java fails due to revoked cert
JDK-8273500 security/infra/java/security/cert/CertPathValidator/certification/QuoVadisCA.java fails, Certificate has been revoked
JDK-8276802 Update qemu-debootstrap cross-compilation recipe
JDK-8274875 Update testing docs to mention tiered testing
JDK-8277037 Use SHA256 hash in build.tools.depend.Depend
JDK-8276984 Windows GHA builds fail due to broken Cygwin
JDK-8273795 Zero SPARC64 debug builds fail due to missing interpreter fields
JDK-8274762 Zero: Cannot invoke JVM in primordial threads on Zero
JDK-8274813 Zero: SPARC64 build fails with si_band type mismatch

Sergey Nazarkin, Azul

Bug Summary
JDK-8273313 C2: ClhsdbJstackXcompStress test fails when StressGCM is enabled

Thomas Stuefe, SAP

Bug Summary
JDK-8273867 Add PrintMetaspaceStatistics to print metaspace statistics upon VM exit
JDK-8277903 gc/stress/TestReclaimStringsLeaksMemory.java fails because Reserved memory size is too big
JDK-8277098 gtest/GTestWrapper.java vmErrorTest.unimplemented1_vm_assert failed
JDK-8277482 JMM GetDiagnosticXXXInfo APIs should verify output array sizes
JDK-8274049 NMT: Final report should use scale 1

Tyler Steele, IBM

Bug Summary
JDK-8279284 build fails on AIX in hotspot cpp tests (for example getstacktr001.cpp)

Vladimir Kempik, JetBrains

Bug Summary
JDK-8273305 [macOS] Update named used for Java run loop mode
JDK-8273574 AArch64: Native types mismatch in hotspot
JDK-8275261 AArch64: Refactor interpreter native wrappers
JDK-8273771 Backport of 8260616 misses one JNF header inclusion removal
JDK-8270526 c2 loop unrolling by 8 results in reading memory past array
JDK-8275581 Create stubRoutines.inline.hpp with SafeFetch implementation
JDK-8275692 Rename safefetch.hpp to safefetch.inline.hpp

Yi Yang, Alibaba

Bug Summary
JDK-8275321 Potential cyclic dependencies between Gregorian and CalendarSystem

Zhengyu Gu, Red Hat

Bug Summary
JDK-8274455 [TEST] vmTestbase/nsk/stress/except/except011.java failed due to wrong class name
JDK-8277939 [TESTBUG] serviceability/sa/ClhsdbCDSCore.java fails with -Xcomp -XX:TieredStopAtLevel=1
JDK-8277680 [TESTBUG] vmTestbase/nsk/stress/jni/jnistress001.java crashes with EXCEPTION_ACCESS_VIOLATION on windows-x86
JDK-8274748 ArrayIndexOutOfBoundsException in java.util.JapaneseImperialCalendar
JDK-8276943 Backout JDK-8274338 11u backport
JDK-8276785 com/sun/jdi/RedefineCrossEvent.java failed "assert(m != __null) failed: NULL mirror"
JDK-8273820 javax/swing/JTable/6263446/bug6263446.java: Table should be editing
JDK-8274902 Null pointer dereference in classFileParser.cpp:2817
JDK-8277937 Replace some enums with static const members in hotspot/runtime
JDK-8275637 Shenandoah: Correct ordering of requested gc cause and gc request flag
JDK-8277226 Shenandoah: Race results degenerated GC to enter wrong entry point