PUSHES REPORT: 11.0.16

This report shows who pushed the backports to the given release. This usually shows who did the backporting, testing, and review work.

Report generated: Sat Oct 01 01:36:42 CEST 2022

Distribution by priority

Count Priority
19 P2
98 P3
146 P4
3 P5

Distribution by components

Count Component
266 100% Total
118 44.4% hotspot
42 15.8% hotspot/compiler
41 15.4% hotspot/runtime
17 6.4% hotspot/gc
5 1.9% hotspot/test
4 1.5% hotspot/svc-agent
4 1.5% hotspot/jfr
3 1.1% hotspot/jvmti
2 0.8% hotspot/svc
40 15.0% core-libs
11 4.1% core-libs/java.net
9 3.4% core-libs/java.nio
5 1.9% core-libs
4 1.5% core-libs/java.io:serialization
2 0.8% core-libs/java.lang.module
2 0.8% core-libs/java.io
2 0.8% core-libs/java.util:i18n
2 0.8% core-libs/java.lang
2 0.8% core-libs/java.util.jar
1 0.4% core-libs/java.time
32 12.0% client-libs
10 3.8% client-libs/2d
5 1.9% client-libs/java.awt
4 1.5% client-libs/javax.accessibility
3 1.1% client-libs
3 1.1% client-libs/javax.swing
2 0.8% client-libs/java.beans
2 0.8% client-libs/java.awt:i18n
2 0.8% client-libs/javax.imageio
1 0.4% client-libs/javax.sound
22 8.3% infrastructure
20 7.5% infrastructure/build
2 0.8% infrastructure
19 7.1% security-libs
12 4.5% security-libs/java.security
4 1.5% security-libs/javax.xml.crypto
1 0.4% security-libs/javax.net.ssl
1 0.4% security-libs/org.ietf.jgss
1 0.4% security-libs/javax.crypto
14 5.3% core-svc
8 3.0% core-svc/debugger
4 1.5% core-svc
1 0.4% core-svc/tools
1 0.4% core-svc/javax.management
9 3.4% tools
4 1.5% tools/javac
2 0.8% tools/launcher
2 0.8% tools
1 0.4% tools/jlink
7 2.6% xml
5 1.9% xml/jaxp
1 0.4% xml/javax.xml.parsers
1 0.4% xml/javax.xml.xpath
5 1.9% other-libs
5 1.9% other-libs/other

Distribution by affiliation

This Release Pushes

Original Pushes

Count Committer
266 100% Total
158 59.4% SAP
104 39.1% Goetz Lindenmaier
20 7.5% Martin Doerr
17 6.4% Christoph Langer
13 4.9% Matthias Baesken
4 1.5% Thomas Stuefe
37 13.9% Red Hat
9 3.4% Andrew Hughes
9 3.4% Severin Gehwolf
7 2.6% Jonathan Dowland
4 1.5% Aleksey Shipilev
4 1.5% Roland Westrelin
2 0.8% Elliott Baron
1 0.4% Simon Tooke
1 0.4% Zdenek Zambersky
21 7.9% Independent
17 6.4% Zhengyu Gu
3 1.1% Vladimir Kempik
1 0.4% kanstantsin.sha
10 3.8% BellSoft
8 3.0% Aleksei Voitylov
2 0.8% Alexandr Scherbatiy
10 3.8% IBM
6 2.3% Tyler Steele
4 1.5% Ichiroh Takiguchi
7 2.6% Tencent
7 2.6% Jie Fu
6 2.3% Amazon
5 1.9% Sergey Bylokhov
1 0.4% joshcao
5 1.9% Azul
2 0.8% Olga Mikhaltcova
1 0.4% Alexey Bakhtin
1 0.4% Anton Kozlov
1 0.4% Alexey Pavlyutkin
4 1.5% @amazon.de
4 1.5% Roman Kennke
4 1.5% @basilcrow.com
4 1.5% me
1 0.4% @andrewazor.es
1 0.4% me
1 0.4% @jp.fujitsu.com
1 0.4% Kimura Yukihiro
1 0.4% DataDog
1 0.4% Jaroslav Bachorík
1 0.4% Oracle
1 0.4% Bernhard Urban-Forster
Count Committer
265 100% Total
138 52.1% Oracle
18 6.8% Igor Ignatyev
9 3.4% Patric Hedlin
5 1.9% Weijun Wang
5 1.9% David Holmes
5 1.9% Fernando Guallini
5 1.9% Philip Race
4 1.5% Daniel Fuchs
4 1.5% Daniel Daugherty
4 1.5% Leonid Mesnik
3 1.1% Joe Wang
3 1.1% Roger Riggs
3 1.1% Tobias Hartmann
3 1.1% Alex Menkov
3 1.1% Thomas Schatzl
3 1.1% Conor Cleary
3 1.1% Mikhailo Seledtsov
3 1.1% Ioi Lam
2 0.8% Brian Burkhalter
2 0.8% Ravi Reddy
2 0.8% Bob Vandette
2 0.8% Kim Barrett
2 0.8% Jini George
2 0.8% Julia Boes
2 0.8% Rajan Halade
2 0.8% Alexey Ivanov
2 0.8% Naoto Sato
2 0.8% Mandy Chung
2 0.8% Christian Hagedorn
1 0.4% Sibabrata Sahoo
1 0.4% Sean Mullan
1 0.4% Alan Bateman
1 0.4% Michael McMahon
1 0.4% Yoshiki Sato
1 0.4% Jayathirth D V
1 0.4% Leo Korinth
1 0.4% Jim Laskey
1 0.4% Kevin Walls
1 0.4% Ivan Sipka
1 0.4% Dean Long
1 0.4% Fairoz Matte
1 0.4% Erik Joelsson
1 0.4% Rajat Mahajan
1 0.4% Gary Adams
1 0.4% Magnus Ihse Bursie
1 0.4% Jan Lahoda
1 0.4% Pankaj Bansal
1 0.4% Chris Plummer
1 0.4% Igor Veresov
1 0.4% Lance Andersen
1 0.4% Prasanta Sadhukhan
1 0.4% Coleen Phillimore
1 0.4% Harold Seigel
1 0.4% Dmitry Markov
1 0.4% Jaikiran Pai
1 0.4% Shashidhara Veerabhadraiah
1 0.4% Jamil Nimeh
1 0.4% Jonathan Gibbons
1 0.4% Anton Litvinov
1 0.4% Lois Foltan
1 0.4% Mikael Vidstedt
1 0.4% Serguei Spitsyn
42 15.8% Red Hat
19 7.2% Severin Gehwolf
12 4.5% Aleksey Shipilev
8 3.0% Roland Westrelin
2 0.8% Andrew Haley
1 0.4% Andrew Hughes
33 12.5% SAP
13 4.9% Matthias Baesken
12 4.5% Christoph Langer
5 1.9% Thomas Stuefe
3 1.1% Goetz Lindenmaier
11 4.2% Amazon
9 3.4% Sergey Bylokhov
1 0.4% Paul Hohensee
1 0.4% Volker Simonis
9 3.4% Independent
8 3.0% Zhengyu Gu
1 0.4% Krishna Addepalli
6 2.3% BellSoft
4 1.5% Alexandr Scherbatiy
2 0.8% Aleksei Voitylov
5 1.9% Tencent
4 1.5% Jie Fu
1 0.4% John Jiang
4 1.5% @amazon.de
4 1.5% Roman Kennke
4 1.5% IBM
2 0.8% Ichiroh Takiguchi
2 0.8% Toshio Nakamura
3 1.1% @malloc.se
3 1.1% Per Liden
3 1.1% Azul
2 0.8% Anton Kozlov
1 0.4% Alexey Bakhtin
2 0.8% NTT DATA
2 0.8% Yasumasa Suenaga
1 0.4% @global.tencent.com
1 0.4% Xuelei Fan
1 0.4% @iscas.ac.cn
1 0.4% Fei Yang
1 0.4% ARM
1 0.4% Pengfei Li
1 0.4% Alibaba
1 0.4% Yi Yang
1 0.4% Fujitsu
1 0.4% Takuya Kiriyama

Chronological push log:

Days Ago This Release Push By Original Push By Bug Summary
Name Affiliation Name Affiliation
109 Andrew Hughes Red Hat Matthias Baesken SAP JDK-8288306 java/nio/file/Files/probeContentType/Basic.java fails on Linux SLES15 machine
112 Goetz Lindenmaier SAP Jaikiran Pai Oracle JDK-8288242 (dc) DatagramChannel.disconnect fails with "Invalid argument" on macOS 12.4
114 Goetz Lindenmaier SAP Rajan Halade Oracle JDK-8288031 Distrust.java failed with CertificateExpiredException
115 Christoph Langer SAP Christoph Langer SAP JDK-8287929 javac error on invalid jar should only print filename
119 Christoph Langer SAP Christoph Langer SAP JDK-8287793 (zipfs) Mention paths with dot elements in ZipException and cleanups
119 Christoph Langer SAP Christoph Langer SAP JDK-8287790 javac errors after JDK-8251329 are not helpful enough to find root cause
119 Christoph Langer SAP Christoph Langer SAP JDK-8287787 GHA: Update cygwin to fix issues in langtools tests on Windows
119 Christoph Langer SAP Christoph Langer SAP JDK-8287739 [11u] ProblemList sun/security/ssl/SSLSessionImpl/NoInvalidateSocketException.java
120 Christoph Langer SAP Daniel Daugherty Oracle JDK-8287725 ProblemList com/sun/jdi/InvokeHangTest.java
121 Andrew Hughes Red Hat Julia Boes Oracle JDK-8287698 java/nio/file/Files/probeContentType/Basic.java failed on "Content type" mismatches
122 Andrew Hughes Red Hat Andrew Hughes Red Hat JDK-8285720 test/jdk/java/nio/file/Files/probeContentType/Basic.java fails to compile after backport of 8273655
122 Andrew Hughes Red Hat Roman Kennke @amazon.de JDK-8287538 Memory leak in invoker_completeInvokeRequest()
123 Ichiroh Takiguchi IBM Ichiroh Takiguchi IBM JDK-8287535 FieldAccessWatch testcase failed on AIX platform
123 Alexandr Scherbatiy BellSoft Philip Race Oracle JDK-8287528 JNI exception pending in CUPSfuncs.c:250
123 Alexandr Scherbatiy BellSoft Alexandr Scherbatiy BellSoft JDK-8287510 printing to CUPS fails on mac sandbox app
124 Ichiroh Takiguchi IBM Ichiroh Takiguchi IBM JDK-8287501 JTable.print() failed with UnsupportedCharsetException on AIX ko_KR locale
128 me @basilcrow.com Sergey Bylokhov Amazon JDK-8287343 File lock in Windows on a loaded jar due to a leak in Introspector::getBeanInfo
128 me @basilcrow.com Sergey Bylokhov Amazon JDK-8287331 java.beans.Introspector uses an obsolete methods cache
128 Matthias Baesken SAP Rajan Halade Oracle JDK-8287314 Add Distrust.java to ProblemList
130 Martin Doerr SAP Paul Hohensee Amazon JDK-8287176 Compiler Control: IGVPrintLevel directive should set PrintIdealGraph
131 Ichiroh Takiguchi IBM Toshio Nakamura IBM JDK-8287126 [macosx] JInternalFrame shadow is not properly drawn
133 Martin Doerr SAP Krishna Addepalli Independent JDK-8287088 [macosx] When in a tab group if you arrow between tabs there are no VoiceOver announcements.
133 Goetz Lindenmaier SAP Fernando Guallini Oracle JDK-8287086 Refactor jdk/security/JavaDotSecurity/ifdefs.sh to plain java test
133 Martin Doerr SAP Shashidhara Veerabhadraiah Oracle JDK-8287085 [macosx] VoiceOver reads percentages rather than the actual values for sliders.
133 Goetz Lindenmaier SAP Lois Foltan Oracle JDK-8287084 CondyRepeatFailedResolution asserts "Dynamic constant has no fixed basic type"
133 Martin Doerr SAP Sergey Bylokhov Amazon JDK-8287083 [macosx] Accessible JTables always reported as empty
133 Goetz Lindenmaier SAP Daniel Fuchs Oracle JDK-8287082 Tests ShortResponseBody and ShortResponseBodyWithRetry should use less resources
133 Sergey Bylokhov Amazon Sergey Bylokhov Amazon JDK-8287069 Improve test java/io/FileOutputStream/OpenNUL.java
134 Jaroslav Bachorík DataDog Takuya Kiriyama Fujitsu JDK-8286999 JfrRecorderService failes with guarantee(num_written > 0) when no space left on device.
135 Ichiroh Takiguchi IBM Toshio Nakamura IBM JDK-8286963 [macos] SwingSet2:TableDemo:Printed Japanese characters were garbled
135 Zhengyu Gu Independent Zhengyu Gu Independent JDK-8286959 Don't use memset to initialize members in FileMapInfo and fix memory leak
135 Goetz Lindenmaier SAP Prasanta Sadhukhan Oracle JDK-8286955 [TESTBUG] Fix G1 redefineClasses tests and a memory leak
135 Goetz Lindenmaier SAP Christian Hagedorn Oracle JDK-8286954 [TESTBUG] Some compiler tests fail when running without C2
135 Goetz Lindenmaier SAP Fernando Guallini Oracle JDK-8286953 Many long-running security libs tests
135 Goetz Lindenmaier SAP Leonid Mesnik Oracle JDK-8286952 runtime/logging/RedefineClasses.java fail with OOME with ZGC
135 Goetz Lindenmaier SAP Leonid Mesnik Oracle JDK-8286948 [TESTBUG] Add logging to verify JDK-8197901 to a different test
135 Goetz Lindenmaier SAP Philip Race Oracle JDK-8286946 Update FreeType to 2.12.0
135 Goetz Lindenmaier SAP Chris Plummer Oracle JDK-8286936 ClhsdbScanOops.java fails with sun.jvm.hotspot.types.WrongTypeException
137 Tyler Steele IBM Matthias Baesken SAP JDK-8286816 Remove unsupported xlc16 compile options on aix
137 Olga Mikhaltcova Azul Roger Riggs Oracle JDK-8286806 Incorrect handling of quoted arguments in ProcessBuilder
139 Christoph Langer SAP Christoph Langer SAP JDK-8286770 [11u, 17u] Unify fix for JDK-8284548 with version from head
139 Christoph Langer SAP Christoph Langer SAP JDK-8286769 [11u, 17u] Unify fix for JDK-8284920 with version from head
140 me @basilcrow.com David Holmes Oracle JDK-8286753 Improvements related to: Failed to start thread - pthread_create failed (EAGAIN)
140 Tyler Steele IBM Magnus Ihse Bursie Oracle JDK-8286751 libharfbuzz optimization level results in extreme build times
140 Matthias Baesken SAP Matthias Baesken SAP JDK-8286630 [11] avoid -std=c++11 CXX harfbuzz buildflag on Windows
141 Thomas Stuefe SAP Thomas Stuefe SAP JDK-8286655 [linux] Fix process-memory information
141 Jie Fu Tencent Jie Fu Tencent JDK-8286649 runtime/execstack/TestCheckJDK.java fails with zipped debug symbols
141 Martin Doerr SAP Sibabrata Sahoo Oracle JDK-8286648 Domain value for system property jdk.https.negotiate.cbt should be case-insensitive
143 Goetz Lindenmaier SAP Harold Seigel Oracle JDK-8286457 Tag container tests that use cGroups with cgroups keyword
144 Martin Doerr SAP Michael McMahon Oracle JDK-8286418 HTTPS Channel Binding support for Java GSS/Kerberos
144 Goetz Lindenmaier SAP Kevin Walls Oracle JDK-8286416 javax/management/remote/mandatory/connection/DefaultAgentFilterTest.java fails with Port already in use
144 Jie Fu Tencent Jie Fu Tencent JDK-8286405 Incorrect test configurations for compiler/stable/TestStableShort.java
148 Jie Fu Tencent David Holmes Oracle JDK-8286175 [TESTBUG] Tests fail to compile after JDK-8216265
149 Zhengyu Gu Independent Zhengyu Gu Independent JDK-8286132 JFR: FieldTable leaks FieldInfoTable member
149 Zhengyu Gu Independent Zhengyu Gu Independent JDK-8286128 CodeBuffer may leak _overflow_arena
150 Goetz Lindenmaier SAP Daniel Daugherty Oracle JDK-8286051 ProblemList sun/security/ssl/SSLSessionImpl/NoInvalidateSocketException.java
150 Goetz Lindenmaier SAP Daniel Daugherty Oracle JDK-8286050 ProblemList java/nio/channels/DatagramChannel/ManySourcesAndTargets.java on macosx-aarch64
150 Goetz Lindenmaier SAP Philip Race Oracle JDK-8286049 [Linux aarch64] : drawImage dithers TYPE_BYTE_INDEXED images incorrectly
150 Goetz Lindenmaier SAP Goetz Lindenmaier SAP JDK-8286048 [testbug] Introduce Platform.sharedLibraryPathVariableName() and adapt all tests.
151 Jonathan Dowland Red Hat Severin Gehwolf Red Hat JDK-8285998 Add regression test for JDK-8257746
151 Goetz Lindenmaier SAP Aleksey Shipilev Red Hat JDK-8285981 Update documentation for RETRY_COUNT and REPEAT_COUNT
154 Sergey Bylokhov Amazon Philip Race Oracle JDK-8285955 javax.imageio.IIOException: Unsupported Image Type while processing a valid JPEG image
154 Severin Gehwolf Red Hat Severin Gehwolf Red Hat JDK-8284102 [TESTBUG] [11u] Retroactively add regression test for JDK-8272124
154 me @andrewazor.es Severin Gehwolf Red Hat JDK-8285936 [Metrics] Enhance parsing of cgroup interface files for version detection
154 Zhengyu Gu Independent Zhengyu Gu Independent JDK-8285924 CodeHeapState::aggregate() leaks blob_name
154 Goetz Lindenmaier SAP Alexey Ivanov Oracle JDK-8285911 [TESTBUG] In DefaultButtonModelCrashTest.java, frame is accessed from main thread
154 Goetz Lindenmaier SAP Sergey Bylokhov Amazon JDK-8285909 AbsPathsInImage.java should skip *.dSYM directories
154 Goetz Lindenmaier SAP Daniel Fuchs Oracle JDK-8285908 [macos-aarch64] test compilation failed with "SocketException: No buffer space available"
154 Goetz Lindenmaier SAP Mikael Vidstedt Oracle JDK-8285907 Switch to macos prefix for macOS bundles
154 Goetz Lindenmaier SAP John Jiang Tencent JDK-8285906 java/security/SecureRandom/ThreadSafe.java failed on windows
154 Goetz Lindenmaier SAP Pankaj Bansal Oracle JDK-8285905 [TESTBUG] SelectEditTableCell.java fails on MacOS
154 Goetz Lindenmaier SAP Per Liden @malloc.se JDK-8285904 Test tools/javac/processing/model/testgetallmembers/Main.java using too small heap
154 Martin Doerr SAP Weijun Wang Oracle JDK-8285903 SPNEGO has not passed channel binding info into the underlying mechanism
154 Goetz Lindenmaier SAP Kim Barrett Oracle JDK-8285902 Lingering INCLUDE_ALL_GCS in test_oopStorage_parperf.cpp
154 kanstantsin.sha Independent Jayathirth D V Oracle JDK-8285899 ArrayIndexOutOfBoundsException in PNGImageReader after JDK-6788458
154 Goetz Lindenmaier SAP Thomas Schatzl Oracle JDK-8285898 Fix redundant @requires tags in tests
154 Roland Westrelin Red Hat Roland Westrelin Red Hat JDK-8285892 assert(_base == Tuple) failed: Not a Tuple after JDK-8280799
154 Roland Westrelin Red Hat Tobias Hartmann Oracle JDK-8285891 Unmappable character for US-ASCII encoding in TestPredicateInputBelowLoopPredicate
154 Roland Westrelin Red Hat Roland Westrelin Red Hat JDK-8285887 С2: assert(false) failed: cyclic dependency prevents range check elimination
155 Matthias Baesken SAP Matthias Baesken SAP JDK-8285591 [11] add signum checks in DSA.java engineVerify
156 Alexey Bakhtin Azul Alexey Bakhtin Azul JDK-8285714 Mutual TLS handshake fails signing client certificate with custom sensitive PKCS11 key
156 Matthias Baesken SAP Yasumasa Suenaga NTT DATA JDK-8285694 unused-result warning happens at os_linux.cpp
157 Sergey Bylokhov Amazon Brian Burkhalter Oracle JDK-8285682 cannot open file "NUL:"
157 Christoph Langer SAP Christoph Langer SAP JDK-8285653 Update versions of some Github Actions used in JDK workflow
158 Severin Gehwolf Red Hat Severin Gehwolf Red Hat JDK-8285395 [JVMCI] [11u] Partial backport of JDK-8220623: InstalledCode
158 Zhengyu Gu Independent Zhengyu Gu Independent JDK-8285585 Leak XVisualInfo in getAllConfigs in awt_GraphicsEnv.c
166 Andrew Hughes Red Hat Andrew Haley Red Hat JDK-8284934 x86-32: runtime call to SharedRuntime::ldiv corrupts registers
168 Anton Kozlov Azul Anton Kozlov Azul JDK-8285578 Incorrect Token type causes XPath expression to return incorrect results
169 Tyler Steele IBM Matthias Baesken SAP JDK-8284885 provide function names in native stack trace on aix with xlc16
169 Elliott Baron Red Hat Severin Gehwolf Red Hat JDK-8284868 [cgroups v2] Account for the fact that swap accounting is disabled on some systems
170 Severin Gehwolf Red Hat Severin Gehwolf Red Hat JDK-8284756 [11u] Remove unused isUseContainerSupport in CgroupV1Subsystem
170 Matthias Baesken SAP Matthias Baesken SAP JDK-8284818 deal with ActiveProcessorCount in os::Linux::print_container_info
171 Tyler Steele IBM Matthias Baesken SAP JDK-8284759 Update build settings for AIX/xlc
171 Goetz Lindenmaier SAP Igor Ignatyev Oracle JDK-8284745 [TESTBUG] rewrite MemOptions shell test in Java
171 Goetz Lindenmaier SAP Leonid Mesnik Oracle JDK-8284744 [TESTBUG] remove vmTestbase/vm/gc/kind/parOld test
171 Goetz Lindenmaier SAP Igor Ignatyev Oracle JDK-8284729 Test nsk/stress/jni/gclocker/gcl001 fails after co-location
171 Matthias Baesken SAP David Holmes Oracle JDK-8284727 Improve the readability of container information in the error log
172 Christoph Langer SAP Christoph Langer SAP JDK-8284685 GHA: Only check test results if testing was not skipped
172 Christoph Langer SAP Christoph Langer SAP JDK-8284604 [11u] Update Boot JDK used in GHA to 11.0.14.1
172 Christoph Langer SAP Christoph Langer SAP JDK-8284683 Improve stability of GHA Pre-submit testing by caching cygwin installer
172 Tyler Steele IBM Matthias Baesken SAP JDK-8284678 minor hotspot adjustments for xlclang++ from xlc16 on AIX
172 Kimura Yukihiro @jp.fujitsu.com Yasumasa Suenaga NTT DATA JDK-8284660 LoadObject with bad base address created for exec file on linux
172 Roland Westrelin Red Hat Roland Westrelin Red Hat JDK-8284651 C2: assert(n->is_Root() || n->is_Region() || n->is_Phi() || n->is_MachMerge() || def_block->dominates(block)) failed: uses must be dominated by definitions
173 Zhengyu Gu Independent Zhengyu Gu Independent JDK-8284628 Leak FcObjectSet in getFontConfigLocations() in fontpath.c
174 Goetz Lindenmaier SAP Tobias Hartmann Oracle JDK-8284625 TestFailedAllocationBadGraph fails with -XX:TieredStopAtLevel < 4
174 Goetz Lindenmaier SAP Goetz Lindenmaier SAP JDK-8284573 [11u] ProblemList TestBubbleUpRef.java and TestGCOldWithCMS.java because of 8272195
174 Goetz Lindenmaier SAP Aleksey Shipilev Red Hat JDK-8284624 Add JTREG_REPEAT_COUNT to repeat execution of a test
174 Goetz Lindenmaier SAP Igor Ignatyev Oracle JDK-8284623 use reproducible random in hotspot gc tests
175 Goetz Lindenmaier SAP Ioi Lam Oracle JDK-8284587 Large value for CompileThresholdScaling causes assert
175 Christoph Langer SAP Joe Wang Oracle JDK-8285577 Invalid XPath expression causes StringIndexOutOfBoundsException
175 Andrew Hughes Red Hat Matthias Baesken SAP JDK-8284559 Update Xalan serializer / SystemIDResolver to align with JDK-8270492
176 Goetz Lindenmaier SAP Pengfei Li ARM JDK-8284519 Fix a C2 crash when filling arrays with unsafe
176 Goetz Lindenmaier SAP Roland Westrelin Red Hat JDK-8284518 C2: assert(_base == Long) failed: Not a Long
176 Goetz Lindenmaier SAP Yi Yang Alibaba JDK-8284517 Suboptimal code generation around Preconditions.checkIndex intrinsic with AVX2
176 Goetz Lindenmaier SAP Jamil Nimeh Oracle JDK-8284514 Minor corrections to evbroadcasti32x4 intrinsic on x86
176 Goetz Lindenmaier SAP Aleksey Shipilev Red Hat JDK-8284512 CompileBroker::log_metaspace_failure is called from non-Java/compiler threads
176 Goetz Lindenmaier SAP Dean Long Oracle JDK-8284511 Crash during deoptimization with "assert(bb->is_reachable()) failed: getting result from unreachable basicblock" with -XX:+VerifyStack
176 Goetz Lindenmaier SAP Fernando Guallini Oracle JDK-8284510 javax/net/ssl/SSLSession/TestEnabledProtocols.java failed with "RuntimeException: java.net.SocketException: Connection reset"
176 Goetz Lindenmaier SAP Mikhailo Seledtsov Oracle JDK-8284509 [TESTBUG] Move gc stress tests from JFR directory tree to gc/stress
177 Andrew Hughes Red Hat Julia Boes Oracle JDK-8284456 content-types.properties files are missing some common types
177 Andrew Hughes Red Hat Yoshiki Sato Oracle JDK-8284455 (tz) Update Timezone Data to 2022a
178 Tyler Steele IBM Matthias Baesken SAP JDK-8284360 aix: support xlclang++ in the compiler detection
178 Jonathan Dowland Red Hat Severin Gehwolf Red Hat JDK-8284354 [TESTBUG] Increase coverage of the cgroups detection code
178 Goetz Lindenmaier SAP Ravi Reddy Oracle JDK-8284351 Infinite loop in DeflaterOutputStream.finish()
178 Goetz Lindenmaier SAP Roland Westrelin Red Hat JDK-8284350 [REDO] C2 crash when allocating array of size too large
178 Severin Gehwolf Red Hat Severin Gehwolf Red Hat JDK-8284349 Cgroups: Incorrect detection logic on some systems (still reproducible)
178 Goetz Lindenmaier SAP Aleksey Shipilev Red Hat JDK-8284348 Cpuid1Ecx feature parsing is incorrect for AMD CPUs
178 Goetz Lindenmaier SAP Igor Veresov Oracle JDK-8284347 C1: assert(false) failed: live_in set of first block must be empty
178 Goetz Lindenmaier SAP Roger Riggs Oracle JDK-8284346 Vector should throw ClassNotFoundException for a missing class of an element
178 Goetz Lindenmaier SAP Sergey Bylokhov Amazon JDK-8284345 Some tests may fail when executed with other locales than the US
178 Goetz Lindenmaier SAP Fernando Guallini Oracle JDK-8284344 Missing coverage for certain classes in com.sun.org.apache.xml.internal.security
178 Goetz Lindenmaier SAP Brian Burkhalter Oracle JDK-8284343 java/nio/file/Files/InterruptCopy.java fails with java.lang.RuntimeException: Copy was not interrupted
178 Goetz Lindenmaier SAP Daniel Fuchs Oracle JDK-8284342 Cleanup test/jdk/java/nio/channels/DatagramChannel/Connect.java
178 Goetz Lindenmaier SAP Roland Westrelin Red Hat JDK-8284341 C2: assert(cl->trip_count() > 0) failed: peeling a fully unrolled loop
178 Goetz Lindenmaier SAP Igor Ignatyev Oracle JDK-8284339 use reproducible random in :vmTestbase_nsk_stress
178 Goetz Lindenmaier SAP Roland Westrelin Red Hat JDK-8284338 C2: assert(found_sfpt) failed: no node in loop that's not input to safepoint
178 Goetz Lindenmaier SAP Leonid Mesnik Oracle JDK-8284335 update hotspot tier1_gc tests depending on GC to use @requires vm.gc.X
178 Thomas Stuefe SAP Thomas Stuefe SAP JDK-8284322 Report glibc malloc tunables in error reports
179 Jonathan Dowland Red Hat Volker Simonis Amazon JDK-8284304 Cgroup: 'stomping of _mount_path' crash if manually mounted cpusets exist
179 Jonathan Dowland Red Hat Bob Vandette Oracle JDK-8284284 HotSpot Not Identifying it is Running in a Container
180 Zhengyu Gu Independent Zhengyu Gu Independent JDK-8284235 Potential memory leak in sun.util.locale.provider.HostLocaleProviderAdapterImpl.getNumberPattern() on Windows
182 Jonathan Dowland Red Hat Ioi Lam Oracle JDK-8284177 containers/cgroup/PlainRead.java fails on Ubuntu 21.10
182 Thomas Stuefe SAP Thomas Stuefe SAP JDK-8284175 [windows] print TMP and TEMP in hs_err and VM.info
182 Goetz Lindenmaier SAP Weijun Wang Oracle JDK-8284163 ShortECDSA.java test is not complete
182 Goetz Lindenmaier SAP Conor Cleary Oracle JDK-8284162 java/nio/channels/DatagramChannel/Connect.java fails with java.net.BindException: Cannot assign requested address: connect
182 Goetz Lindenmaier SAP Conor Cleary Oracle JDK-8284148 java/nio/channels/DatagramChannel/Connect.java timed out
182 Goetz Lindenmaier SAP Igor Ignatyev Oracle JDK-8284143 ArgumentHandler must use the same delimiters as in jvmti_tools.cpp
182 Goetz Lindenmaier SAP Alex Menkov Oracle JDK-8284142 com/sun/jdi/BadHandshakeTest.java failed with "ConnectException: Connection refused: connect"
182 Goetz Lindenmaier SAP Alex Menkov Oracle JDK-8284141 com/sun/jdi/BadHandshakeTest.java fails with java.net.ConnectException
182 Goetz Lindenmaier SAP Leo Korinth Oracle JDK-8284140 Add package declaration to each JTREG test case in the gc folder
182 Alexey Pavlyutkin Azul Andrew Haley Red Hat JDK-8284135 Crash on aarch64 JDK due to long offset
182 Roman Kennke @amazon.de Roman Kennke @amazon.de JDK-8284133 Refactor subclassAudits to use ClassValue
182 Roman Kennke @amazon.de Aleksey Shipilev Red Hat JDK-8284131 Retry loop issues in java.io.ClassCache
182 Roman Kennke @amazon.de Roman Kennke @amazon.de JDK-8284129 ObjectStreamClass caches keep ClassLoaders alive
182 Goetz Lindenmaier SAP Rajat Mahajan Oracle JDK-8284122 Robot.mouseMove moves cursor to incorrect location when display scale varies and Java runs in DPI Unaware mode
183 Simon Tooke Red Hat Severin Gehwolf Red Hat JDK-8284107 Cgroups: Incorrect detection logic on some systems
183 Aleksei Voitylov BellSoft Aleksey Shipilev Red Hat JDK-8284089 Provide configure hints for Alpine/apk package managers
184 Goetz Lindenmaier SAP Anton Litvinov Oracle JDK-8284008 Unable to click JCheckBox in JTable through Java Access Bridge
184 Goetz Lindenmaier SAP Weijun Wang Oracle JDK-8284007 Update Public Suffix List to 3c213aa
184 Goetz Lindenmaier SAP Naoto Sato Oracle JDK-8284006 Update IANA Language Subtag Registry to Version 2021-05-11
184 Aleksei Voitylov BellSoft Aleksei Voitylov BellSoft JDK-8284005 Implementation of Alpine Linux/x64 Port
184 Aleksei Voitylov BellSoft Aleksei Voitylov BellSoft JDK-8284003 Document Alpine Linux build steps in OpenJDK build guide
184 Goetz Lindenmaier SAP Igor Ignatyev Oracle JDK-8284002 remove jdk.testlibrary.Utils
185 Severin Gehwolf Red Hat Severin Gehwolf Red Hat JDK-8283860 [TESTBUG] Some cgroup tests are failing after JDK-8231111
185 Goetz Lindenmaier SAP Xuelei Fan @global.tencent.com JDK-8283855 Incorrect test path in test cases
185 Goetz Lindenmaier SAP Igor Ignatyev Oracle JDK-8283854 remove jdk.testlibrary.JDKToolFinder and JDKToolLauncher
185 Goetz Lindenmaier SAP Igor Ignatyev Oracle JDK-8283843 remove jdk.testlibrary.ProcessTools
185 Matthias Baesken SAP Matthias Baesken SAP JDK-8283837 handle latest VS2019 in abstract_vm_version
186 Christoph Langer SAP Joe Wang Oracle JDK-8283808 XSLT compiler tries to define a class with empty name
186 Elliott Baron Red Hat Severin Gehwolf Red Hat JDK-8283792 jtreg test error in test/hotspot/jtreg/containers/docker/TestMemoryAwareness.java
186 Severin Gehwolf Red Hat Mandy Chung Oracle JDK-8283783 Replace use of reflection in jdk.internal.platform.Metrics
186 Severin Gehwolf Red Hat Severin Gehwolf Red Hat JDK-8283764 Wrong comment in CgroupV1Subsystem::cpu_quota
186 Severin Gehwolf Red Hat Aleksey Shipilev Red Hat JDK-8283763 Remove unimplemented OSContainer::read_memory_limit_in_bytes
186 Jonathan Dowland Red Hat Severin Gehwolf Red Hat JDK-8283759 Cgroups: Incorrect detection logic on old systems in hotspot
186 Matthias Baesken SAP Fairoz Matte Oracle JDK-8283754 handle VC++:1927 VS2019 in abstract_vm_version
187 Sergey Bylokhov Amazon Dmitry Markov Oracle JDK-8283734 Drag And Drop hangs on Windows
187 Sergey Bylokhov Amazon Sergey Bylokhov Amazon JDK-8283731 ProfileDeferralMgr throwing ConcurrentModificationException
190 Goetz Lindenmaier SAP Joe Wang Oracle JDK-8283638 Update BCEL md to include the copyright notice
190 Goetz Lindenmaier SAP David Holmes Oracle JDK-8283636 Upgrading from 8 to 11 no longer accepts '/' as filepath separator in gc paths
190 Goetz Lindenmaier SAP Alexey Ivanov Oracle JDK-8283634 Invalid value set to CANDIDATEFORM structure
190 Goetz Lindenmaier SAP Igor Ignatyev Oracle JDK-8283633 use reproducible random in hotspot runtime tests
190 Goetz Lindenmaier SAP Igor Ignatyev Oracle JDK-8283632 use reproducible random in hotspot svc tests
190 Goetz Lindenmaier SAP Igor Ignatyev Oracle JDK-8283631 use reproducible random in hotspot compiler tests
190 Matthias Baesken SAP Matthias Baesken SAP JDK-8283614 [11] Repair compiler versions handling after backport of 8233787
191 Severin Gehwolf Red Hat Severin Gehwolf Red Hat JDK-8283570 [cgroups v2] Memory and swap limits reported incorrectly
191 Zhengyu Gu Independent Severin Gehwolf Red Hat JDK-8283568 8230305 causes slowdebug build failure
191 Zhengyu Gu Independent Severin Gehwolf Red Hat JDK-8283567 [cgroups v2] Soft memory limit incorrectly using memory.high
191 Zhengyu Gu Independent Severin Gehwolf Red Hat JDK-8283563 Cgroups v2: Rework Metrics in java.base so as to recognize unified hierarchy
191 Zhengyu Gu Independent Severin Gehwolf Red Hat JDK-8283561 Add rationale to PER_CPU_SHARES define
191 Zhengyu Gu Independent Bob Vandette Oracle JDK-8283560 Docker reporting causes secondary crashes in error handling
191 Zhengyu Gu Independent Severin Gehwolf Red Hat JDK-8283559 Cgroups v2: Container awareness
191 Matthias Baesken SAP Thomas Stuefe SAP JDK-8283557 8261169 broke Harfbuzz build with gcc 7 and 8
191 Matthias Baesken SAP Philip Race Oracle JDK-8283550 Upgrade HarfBuzz to the latest 2.8.0
192 Jonathan Dowland Red Hat Ravi Reddy Oracle JDK-8283329 Infinite loop in ZipOutputStream.close()
192 Goetz Lindenmaier SAP Sean Mullan Oracle JDK-8283506 Correct signer logic for jars signed with multiple digest algorithms
192 Jie Fu Tencent Aleksey Shipilev Red Hat JDK-8283500 Shenandoah build fails with --with-jvm-features=-compiler1
192 Christoph Langer SAP Alan Bateman Oracle JDK-8283498 ModuleHashes attribute generated for JMOD and JAR files depends on timestamps
193 Zhengyu Gu Independent Brian Burkhalter Oracle JDK-8283481 java/nio/file/Files/InterruptCopy.java fails with java.lang.RuntimeException: Copy was not interrupted
193 Zdenek Zambersky Red Hat Gary Adams Oracle JDK-8283479 Revisit com/sun/jdi/RedefineCrossEvent.java
193 Christoph Langer SAP Christoph Langer SAP JDK-8283420 [AOT] Exclude TrackedFlagTest/NotTrackedFlagTest in 11u because of intermittent java.lang.AssertionError: duplicate classes for name Ljava/lang/Boolean;
193 Jie Fu Tencent Per Liden @malloc.se JDK-8283461 ZGC: Compile without C1 broken
193 Jie Fu Tencent Jie Fu Tencent JDK-8283424 compiler/loopopts/LoopUnswitchingBadNodeBudget.java fails with release VMs due to lack of -XX:+UnlockDiagnosticVMOptions
194 Goetz Lindenmaier SAP Ivan Sipka Oracle JDK-8283432 sun/net/www/http/KeepAliveStream/KeepAliveStreamCloseWithWrongContentLength.java wedged in getInputStream
194 Goetz Lindenmaier SAP Igor Ignatyev Oracle JDK-8283430 introduce vm.flagless at-requires property
195 Jie Fu Tencent Igor Ignatyev Oracle JDK-8283423 sun/tools/jstatd test build failures after JDK-8210022
195 me @basilcrow.com Jan Lahoda Oracle JDK-8283419 AssertionError @ jdk.compiler/com.sun.tools.javac.comp.Modules.enter(Modules.java:244)
195 Christoph Langer SAP Fei Yang @iscas.ac.cn JDK-8283418 ModuleHashes attribute not reproducible between builds
196 Zhengyu Gu Independent Mikhailo Seledtsov Oracle JDK-8283381 [TESTBUG] jdk/jfr/event/io/EvilInstrument.java fails at-run shell MakeJAR.sh target
196 Goetz Lindenmaier SAP Jini George Oracle JDK-8283376 SA: Tests using ClhsdbLauncher fail on SAP docker containers
196 Goetz Lindenmaier SAP Jini George Oracle JDK-8283375 SA: Modify ClhsdbLauncher to add sudo privileges to enable MacOS tests on Mach5
196 Goetz Lindenmaier SAP Weijun Wang Oracle JDK-8283374 org.jcp.xml.dsig.internal.dom.Utils.parseIdFromSameDocumentURI throws StringIndexOutOfBoundsException when calling substring method
196 Goetz Lindenmaier SAP Jonathan Gibbons Oracle JDK-8283373 Minor cleanup for ToolBox
196 Goetz Lindenmaier SAP Fernando Guallini Oracle JDK-8283372 test/jdk/javax/net/ssl/compatibility/JdkInfo incorrect verification of protocol and cipher support
196 Goetz Lindenmaier SAP Per Liden @malloc.se JDK-8283371 GC watermark_0_1 failed due to "metaspace.gc.Fault: GC has happened too rare"
196 Goetz Lindenmaier SAP Daniel Fuchs Oracle JDK-8283370 Replace wildcard address with loopback or local host in tests - part 21
196 Goetz Lindenmaier SAP Lance Andersen Oracle JDK-8283358 tools/jar/JarEntryTime.java fails with modified time mismatch
196 Goetz Lindenmaier SAP Igor Ignatyev Oracle JDK-8283357 introduce randomness k/w to hotspot test suite
197 Vladimir Kempik Independent Daniel Daugherty Oracle JDK-8283341 [macOS] : hotspot arm64 bug exposed by latest clang
197 Andrew Hughes Red Hat Jie Fu Tencent JDK-8283338 Zero: assert(istate->_stack_limit == istate->_thread->last_Java_sp() + 1) failed: wrong on Linux/x86_32
197 Zhengyu Gu Independent Mikhailo Seledtsov Oracle JDK-8283334 [TESTBUG] several jfr tests do not clean up files created in /tmp
197 Aleksei Voitylov BellSoft Mandy Chung Oracle JDK-8283317 refactor test/jdk/tools/launcher/Test7029048.java
197 Olga Mikhaltcova Azul Jim Laskey Oracle JDK-8283314 javac crashed: [jimage.dll+0x1942] ImageStrings::find+0x28
197 Martin Doerr SAP Tobias Hartmann Oracle JDK-8283313 Method linking fails with guarantee(mh->adapter() != NULL) failed: Adapter blob must already exist!
197 Goetz Lindenmaier SAP David Holmes Oracle JDK-8283311 [TESTBUG] runtime/Thread/ThreadPriorities.java fails with "expected 0 to equal 10"
197 Goetz Lindenmaier SAP Serguei Spitsyn Oracle JDK-8283310 nsk/jvmti/ResourceExhausted/resexhausted003 fails to start
198 Aleksey Shipilev Red Hat Aleksey Shipilev Red Hat JDK-8283258 Update Debian-based cross-compilation recipes
199 Zhengyu Gu Independent Zhengyu Gu Independent JDK-8283206 Deadlock caused by jdwp agent
199 Martin Doerr SAP Igor Ignatyev Oracle JDK-8283170 compiler.inlining.InlineAccessors shouldn't do testing in driver VM
199 Martin Doerr SAP Patric Hedlin Oracle JDK-8283169 More node budget asserts in fuzzed tests
199 Martin Doerr SAP Patric Hedlin Oracle JDK-8283162 Node budget assert in fuzzed test
199 Martin Doerr SAP Patric Hedlin Oracle JDK-8283161 C2 failed "assert(C->live_nodes() - live_at_begin <= 2 * _nodes_required) failed: Bad node estimate: actual = 208 >> request = 101"
200 Goetz Lindenmaier SAP Conor Cleary Oracle JDK-8283106 NetworkInterface/UniqueMacAddressesTest: mac address uniqueness test failed
200 Goetz Lindenmaier SAP Sergey Bylokhov Amazon JDK-8283105 [macos] Test java/awt/MenuBar/8007006/bug8007006.java fails on MacOS
200 Goetz Lindenmaier SAP Sergey Bylokhov Amazon JDK-8283104 Some tests fail after JDK-8210039
200 Martin Doerr SAP Roland Westrelin Red Hat JDK-8283099 Shenandoah optimizations fail with assert(!phase->exceeding_node_budget())
200 Martin Doerr SAP Patric Hedlin Oracle JDK-8283098 Node budget asserts on x86_32/64
200 Aleksey Shipilev Red Hat Aleksey Shipilev Red Hat JDK-8283018 11u GHA: Update GCC 9 minor versions
200 Goetz Lindenmaier SAP Igor Ignatyev Oracle JDK-8283089 move OSInfo to top level testlibrary
203 Martin Doerr SAP Patric Hedlin Oracle JDK-8283048 assert(!exceeding_node_budget()) failed: Too many NODES required! failure with ctw
203 Martin Doerr SAP Patric Hedlin Oracle JDK-8283047 Node estimate for loop unswitching is not correct: assert(delta <= 2 * required) failed: Bad node estimate
203 Martin Doerr SAP Patric Hedlin Oracle JDK-8283046 Bad node estimate assertion failure
203 Aleksey Shipilev Red Hat Aleksey Shipilev Red Hat JDK-8283039 x86: AVX2 versions of vpxor should be asserted
203 Goetz Lindenmaier SAP Igor Ignatyev Oracle JDK-8283029 move jdk.testlibrary.JcmdBase closer to tests
203 Goetz Lindenmaier SAP Igor Ignatyev Oracle JDK-8283028 remove jdk.testlibrary.ProcessThread, TestThread and XRun
203 Goetz Lindenmaier SAP Ioi Lam Oracle JDK-8283026 Do not store original classfiles inside the CDS archive
203 Thomas Stuefe SAP Thomas Stuefe SAP JDK-8282589 runtime/ErrorHandling/ErrorHandler.java fails on macOS AArch64 in JDK 11
204 Goetz Lindenmaier SAP Coleen Phillimore Oracle JDK-8282975 vmTestbase/metaspace/stressHierarchy/stressHierarchy012/TestDescription.java fails with OutOfMemoryError: Metaspace
204 Goetz Lindenmaier SAP Alex Menkov Oracle JDK-8282974 jdi/ExclusiveBind.java times out due to "bind failed: Address already in use" on Solaris-X64
204 Martin Doerr SAP Patric Hedlin Oracle JDK-8282968 assert(Compile::current()->live_nodes() < Compile::current()->max_node_limit()) failed: Live Node limit exceeded limit
204 Aleksey Shipilev Red Hat Aleksey Shipilev Red Hat JDK-8282959 GHA: Allow one concurrent run per PR only
204 Aleksei Voitylov BellSoft Roger Riggs Oracle JDK-8282945 Compilation failed: tools/launcher/Test7029048.java
204 Aleksei Voitylov BellSoft Alexandr Scherbatiy BellSoft JDK-8282941 Remove unused print_stack(void) method from XToolkit.c
204 Aleksei Voitylov BellSoft Alexandr Scherbatiy BellSoft JDK-8282940 __SIGRTMAX is not declared in musl libc
204 Aleksei Voitylov BellSoft Alexandr Scherbatiy BellSoft JDK-8282939 isnanf is obsolete
205 joshcao Amazon Naoto Sato Oracle JDK-8282892 Memory Leak in StringCoding on ThreadLocal resultCached StringCoding.Result
205 Bernhard Urban-Forster Oracle Kim Barrett Oracle JDK-8282882 Implicit narrowing in MacOSX java.desktop jsound
205 Martin Doerr SAP Patric Hedlin Oracle JDK-8282870 Restructure/clean-up for 'loopexit_or_null()'.
205 Goetz Lindenmaier SAP Thomas Schatzl Oracle JDK-8282869 TriggerUnloadingByFillingMetaspace generates garbage class names
205 Martin Doerr SAP Christian Hagedorn Oracle JDK-8282868 C2: assert(is_Loop()) failed: invalid node class: Region
205 Goetz Lindenmaier SAP Thomas Schatzl Oracle JDK-8282867 flags duplications in vmTestbase_vm_g1classunloading tests
205 Matthias Baesken SAP Weijun Wang Oracle JDK-8282861 Update XML Security for Java to 2.3.0
206 Roman Kennke @amazon.de Roman Kennke @amazon.de JDK-8282807 Memory leak in invoker.c fillInvokeRequest() during JDI operations
207 Matthias Baesken SAP Matthias Baesken SAP JDK-8282588 [11] set harfbuzz compilation flag to -std=c++11
211 Vladimir Kempik Independent Anton Kozlov Azul JDK-8282591 Github Actions for macos/aarch64 cross-build
212 Vladimir Kempik Independent Erik Joelsson Oracle JDK-8282558 Change default -mmacosx-version-min to 10.12
212 Goetz Lindenmaier SAP Goetz Lindenmaier SAP JDK-8282501 Bump update version for OpenJDK: jdk-11.0.16

No changesets log

Committer push log

Alexey Bakhtin, Azul

Bug Summary
JDK-8285714 Mutual TLS handshake fails signing client certificate with custom sensitive PKCS11 key

Anton Kozlov, Azul

Bug Summary
JDK-8285578 Incorrect Token type causes XPath expression to return incorrect results

Alexandr Scherbatiy, BellSoft

Bug Summary
JDK-8287528 JNI exception pending in CUPSfuncs.c:250
JDK-8287510 printing to CUPS fails on mac sandbox app

Andrew Hughes, Red Hat

Bug Summary
JDK-8284455 (tz) Update Timezone Data to 2022a
JDK-8284456 content-types.properties files are missing some common types
JDK-8287698 java/nio/file/Files/probeContentType/Basic.java failed on "Content type" mismatches
JDK-8288306 java/nio/file/Files/probeContentType/Basic.java fails on Linux SLES15 machine
JDK-8287538 Memory leak in invoker_completeInvokeRequest()
JDK-8285720 test/jdk/java/nio/file/Files/probeContentType/Basic.java fails to compile after backport of 8273655
JDK-8284559 Update Xalan serializer / SystemIDResolver to align with JDK-8270492
JDK-8284934 x86-32: runtime call to SharedRuntime::ldiv corrupts registers
JDK-8283338 Zero: assert(istate->_stack_limit == istate->_thread->last_Java_sp() + 1) failed: wrong on Linux/x86_32

Alexey Pavlyutkin, Azul

Bug Summary
JDK-8284135 Crash on aarch64 JDK due to long offset

Aleksei Voitylov, BellSoft

Bug Summary
JDK-8282940 __SIGRTMAX is not declared in musl libc
JDK-8282945 Compilation failed: tools/launcher/Test7029048.java
JDK-8284003 Document Alpine Linux build steps in OpenJDK build guide
JDK-8284005 Implementation of Alpine Linux/x64 Port
JDK-8282939 isnanf is obsolete
JDK-8284089 Provide configure hints for Alpine/apk package managers
JDK-8283317 refactor test/jdk/tools/launcher/Test7029048.java
JDK-8282941 Remove unused print_stack(void) method from XToolkit.c

Bernhard Urban-Forster, Oracle

Bug Summary
JDK-8282882 Implicit narrowing in MacOSX java.desktop jsound

Christoph Langer, SAP

Bug Summary
JDK-8287793 (zipfs) Mention paths with dot elements in ZipException and cleanups
JDK-8286770 [11u, 17u] Unify fix for JDK-8284548 with version from head
JDK-8286769 [11u, 17u] Unify fix for JDK-8284920 with version from head
JDK-8287739 [11u] ProblemList sun/security/ssl/SSLSessionImpl/NoInvalidateSocketException.java
JDK-8284604 [11u] Update Boot JDK used in GHA to 11.0.14.1
JDK-8283420 [AOT] Exclude TrackedFlagTest/NotTrackedFlagTest in 11u because of intermittent java.lang.AssertionError: duplicate classes for name Ljava/lang/Boolean;
JDK-8284685 GHA: Only check test results if testing was not skipped
JDK-8287787 GHA: Update cygwin to fix issues in langtools tests on Windows
JDK-8284683 Improve stability of GHA Pre-submit testing by caching cygwin installer
JDK-8285577 Invalid XPath expression causes StringIndexOutOfBoundsException
JDK-8287929 javac error on invalid jar should only print filename
JDK-8287790 javac errors after JDK-8251329 are not helpful enough to find root cause
JDK-8283498 ModuleHashes attribute generated for JMOD and JAR files depends on timestamps
JDK-8283418 ModuleHashes attribute not reproducible between builds
JDK-8287725 ProblemList com/sun/jdi/InvokeHangTest.java
JDK-8285653 Update versions of some Github Actions used in JDK workflow
JDK-8283808 XSLT compiler tries to define a class with empty name

Elliott Baron, Red Hat

Bug Summary
JDK-8284868 [cgroups v2] Account for the fact that swap accounting is disabled on some systems
JDK-8283792 jtreg test error in test/hotspot/jtreg/containers/docker/TestMemoryAwareness.java

Goetz Lindenmaier, SAP

Bug Summary
JDK-8288242 (dc) DatagramChannel.disconnect fails with "Invalid argument" on macOS 12.4
JDK-8284573 [11u] ProblemList TestBubbleUpRef.java and TestGCOldWithCMS.java because of 8272195
JDK-8286049 [Linux aarch64] : drawImage dithers TYPE_BYTE_INDEXED images incorrectly
JDK-8285908 [macos-aarch64] test compilation failed with "SocketException: No buffer space available"
JDK-8283105 [macos] Test java/awt/MenuBar/8007006/bug8007006.java fails on MacOS
JDK-8284350 [REDO] C2 crash when allocating array of size too large
JDK-8286948 [TESTBUG] Add logging to verify JDK-8197901 to a different test
JDK-8286955 [TESTBUG] Fix G1 redefineClasses tests and a memory leak
JDK-8285911 [TESTBUG] In DefaultButtonModelCrashTest.java, frame is accessed from main thread
JDK-8286048 [testbug] Introduce Platform.sharedLibraryPathVariableName() and adapt all tests.
JDK-8284509 [TESTBUG] Move gc stress tests from JFR directory tree to gc/stress
JDK-8284744 [TESTBUG] remove vmTestbase/vm/gc/kind/parOld test
JDK-8284745 [TESTBUG] rewrite MemOptions shell test in Java
JDK-8283311 [TESTBUG] runtime/Thread/ThreadPriorities.java fails with "expected 0 to equal 10"
JDK-8285905 [TESTBUG] SelectEditTableCell.java fails on MacOS
JDK-8286954 [TESTBUG] Some compiler tests fail when running without C2
JDK-8285909 AbsPathsInImage.java should skip *.dSYM directories
JDK-8284624 Add JTREG_REPEAT_COUNT to repeat execution of a test
JDK-8284140 Add package declaration to each JTREG test case in the gc folder
JDK-8284143 ArgumentHandler must use the same delimiters as in jvmti_tools.cpp
JDK-8282501 Bump update version for OpenJDK: jdk-11.0.16
JDK-8284347 C1: assert(false) failed: live_in set of first block must be empty
JDK-8284518 C2: assert(_base == Long) failed: Not a Long
JDK-8284341 C2: assert(cl->trip_count() > 0) failed: peeling a fully unrolled loop
JDK-8284338 C2: assert(found_sfpt) failed: no node in loop that's not input to safepoint
JDK-8284342 Cleanup test/jdk/java/nio/channels/DatagramChannel/Connect.java
JDK-8286936 ClhsdbScanOops.java fails with sun.jvm.hotspot.types.WrongTypeException
JDK-8284142 com/sun/jdi/BadHandshakeTest.java failed with "ConnectException: Connection refused: connect"
JDK-8284141 com/sun/jdi/BadHandshakeTest.java fails with java.net.ConnectException
JDK-8284512 CompileBroker::log_metaspace_failure is called from non-Java/compiler threads
JDK-8287084 CondyRepeatFailedResolution asserts "Dynamic constant has no fixed basic type"
JDK-8283506 Correct signer logic for jars signed with multiple digest algorithms
JDK-8284348 Cpuid1Ecx feature parsing is incorrect for AMD CPUs
JDK-8284511 Crash during deoptimization with "assert(bb->is_reachable()) failed: getting result from unreachable basicblock" with -XX:+VerifyStack
JDK-8288031 Distrust.java failed with CertificateExpiredException
JDK-8283026 Do not store original classfiles inside the CDS archive
JDK-8284519 Fix a C2 crash when filling arrays with unsafe
JDK-8285898 Fix redundant @requires tags in tests
JDK-8282867 flags duplications in vmTestbase_vm_g1classunloading tests
JDK-8283371 GC watermark_0_1 failed due to "metaspace.gc.Fault: GC has happened too rare"
JDK-8283855 Incorrect test path in test cases
JDK-8284351 Infinite loop in DeflaterOutputStream.finish()
JDK-8283357 introduce randomness k/w to hotspot test suite
JDK-8283430 introduce vm.flagless at-requires property
JDK-8283634 Invalid value set to CANDIDATEFORM structure
JDK-8284162 java/nio/channels/DatagramChannel/Connect.java fails with java.net.BindException: Cannot assign requested address: connect
JDK-8284148 java/nio/channels/DatagramChannel/Connect.java timed out
JDK-8284343 java/nio/file/Files/InterruptCopy.java fails with java.lang.RuntimeException: Copy was not interrupted
JDK-8285906 java/security/SecureRandom/ThreadSafe.java failed on windows
JDK-8286416 javax/management/remote/mandatory/connection/DefaultAgentFilterTest.java fails with Port already in use
JDK-8284510 javax/net/ssl/SSLSession/TestEnabledProtocols.java failed with "RuntimeException: java.net.SocketException: Connection reset"
JDK-8282974 jdi/ExclusiveBind.java times out due to "bind failed: Address already in use" on Solaris-X64
JDK-8284587 Large value for CompileThresholdScaling causes assert
JDK-8285902 Lingering INCLUDE_ALL_GCS in test_oopStorage_parperf.cpp
JDK-8286953 Many long-running security libs tests
JDK-8283373 Minor cleanup for ToolBox
JDK-8284514 Minor corrections to evbroadcasti32x4 intrinsic on x86
JDK-8284344 Missing coverage for certain classes in com.sun.org.apache.xml.internal.security
JDK-8283029 move jdk.testlibrary.JcmdBase closer to tests
JDK-8283089 move OSInfo to top level testlibrary
JDK-8283106 NetworkInterface/UniqueMacAddressesTest: mac address uniqueness test failed
JDK-8283310 nsk/jvmti/ResourceExhausted/resexhausted003 fails to start
JDK-8283374 org.jcp.xml.dsig.internal.dom.Utils.parseIdFromSameDocumentURI throws StringIndexOutOfBoundsException when calling substring method
JDK-8286050 ProblemList java/nio/channels/DatagramChannel/ManySourcesAndTargets.java on macosx-aarch64
JDK-8286051 ProblemList sun/security/ssl/SSLSessionImpl/NoInvalidateSocketException.java
JDK-8287086 Refactor jdk/security/JavaDotSecurity/ifdefs.sh to plain java test
JDK-8283854 remove jdk.testlibrary.JDKToolFinder and JDKToolLauncher
JDK-8283028 remove jdk.testlibrary.ProcessThread, TestThread and XRun
JDK-8283843 remove jdk.testlibrary.ProcessTools
JDK-8284002 remove jdk.testlibrary.Utils
JDK-8283370 Replace wildcard address with loopback or local host in tests - part 21
JDK-8284122 Robot.mouseMove moves cursor to incorrect location when display scale varies and Java runs in DPI Unaware mode
JDK-8286952 runtime/logging/RedefineClasses.java fail with OOME with ZGC
JDK-8283375 SA: Modify ClhsdbLauncher to add sudo privileges to enable MacOS tests on Mach5
JDK-8283376 SA: Tests using ClhsdbLauncher fail on SAP docker containers
JDK-8284163 ShortECDSA.java test is not complete
JDK-8283104 Some tests fail after JDK-8210039
JDK-8284345 Some tests may fail when executed with other locales than the US
JDK-8284517 Suboptimal code generation around Preconditions.checkIndex intrinsic with AVX2
JDK-8283432 sun/net/www/http/KeepAliveStream/KeepAliveStreamCloseWithWrongContentLength.java wedged in getInputStream
JDK-8285907 Switch to macos prefix for macOS bundles
JDK-8286457 Tag container tests that use cGroups with cgroups keyword
JDK-8284729 Test nsk/stress/jni/gclocker/gcl001 fails after co-location
JDK-8285904 Test tools/javac/processing/model/testgetallmembers/Main.java using too small heap
JDK-8283372 test/jdk/javax/net/ssl/compatibility/JdkInfo incorrect verification of protocol and cipher support
JDK-8284625 TestFailedAllocationBadGraph fails with -XX:TieredStopAtLevel < 4
JDK-8287082 Tests ShortResponseBody and ShortResponseBodyWithRetry should use less resources
JDK-8283358 tools/jar/JarEntryTime.java fails with modified time mismatch
JDK-8282869 TriggerUnloadingByFillingMetaspace generates garbage class names
JDK-8284008 Unable to click JCheckBox in JTable through Java Access Bridge
JDK-8283638 Update BCEL md to include the copyright notice
JDK-8285981 Update documentation for RETRY_COUNT and REPEAT_COUNT
JDK-8286946 Update FreeType to 2.12.0
JDK-8284335 update hotspot tier1_gc tests depending on GC to use @requires vm.gc.X
JDK-8284006 Update IANA Language Subtag Registry to Version 2021-05-11
JDK-8284007 Update Public Suffix List to 3c213aa
JDK-8283636 Upgrading from 8 to 11 no longer accepts '/' as filepath separator in gc paths
JDK-8284339 use reproducible random in :vmTestbase_nsk_stress
JDK-8283631 use reproducible random in hotspot compiler tests
JDK-8284623 use reproducible random in hotspot gc tests
JDK-8283633 use reproducible random in hotspot runtime tests
JDK-8283632 use reproducible random in hotspot svc tests
JDK-8284346 Vector should throw ClassNotFoundException for a missing class of an element
JDK-8282975 vmTestbase/metaspace/stressHierarchy/stressHierarchy012/TestDescription.java fails with OutOfMemoryError: Metaspace

Ichiroh Takiguchi, IBM

Bug Summary
JDK-8286963 [macos] SwingSet2:TableDemo:Printed Japanese characters were garbled
JDK-8287126 [macosx] JInternalFrame shadow is not properly drawn
JDK-8287535 FieldAccessWatch testcase failed on AIX platform
JDK-8287501 JTable.print() failed with UnsupportedCharsetException on AIX ko_KR locale

Jaroslav Bachorík, DataDog

Bug Summary
JDK-8286999 JfrRecorderService failes with guarantee(num_written > 0) when no space left on device.

Jonathan Dowland, Red Hat

Bug Summary
JDK-8284354 [TESTBUG] Increase coverage of the cgroups detection code
JDK-8285998 Add regression test for JDK-8257746
JDK-8284304 Cgroup: 'stomping of _mount_path' crash if manually mounted cpusets exist
JDK-8283759 Cgroups: Incorrect detection logic on old systems in hotspot
JDK-8284177 containers/cgroup/PlainRead.java fails on Ubuntu 21.10
JDK-8284284 HotSpot Not Identifying it is Running in a Container
JDK-8283329 Infinite loop in ZipOutputStream.close()

Jie Fu, Tencent

Bug Summary
JDK-8286175 [TESTBUG] Tests fail to compile after JDK-8216265
JDK-8283424 compiler/loopopts/LoopUnswitchingBadNodeBudget.java fails with release VMs due to lack of -XX:+UnlockDiagnosticVMOptions
JDK-8286405 Incorrect test configurations for compiler/stable/TestStableShort.java
JDK-8286649 runtime/execstack/TestCheckJDK.java fails with zipped debug symbols
JDK-8283500 Shenandoah build fails with --with-jvm-features=-compiler1
JDK-8283423 sun/tools/jstatd test build failures after JDK-8210022
JDK-8283461 ZGC: Compile without C1 broken

joshcao, Amazon

Bug Summary
JDK-8282892 Memory Leak in StringCoding on ThreadLocal resultCached StringCoding.Result

kanstantsin.sha, Independent

Bug Summary
JDK-8285899 ArrayIndexOutOfBoundsException in PNGImageReader after JDK-6788458

Kimura Yukihiro, @jp.fujitsu.com

Bug Summary
JDK-8284660 LoadObject with bad base address created for exec file on linux

Matthias Baesken, SAP

Bug Summary
JDK-8283557 8261169 broke Harfbuzz build with gcc 7 and 8
JDK-8285591 [11] add signum checks in DSA.java engineVerify
JDK-8286630 [11] avoid -std=c++11 CXX harfbuzz buildflag on Windows
JDK-8283614 [11] Repair compiler versions handling after backport of 8233787
JDK-8282588 [11] set harfbuzz compilation flag to -std=c++11
JDK-8287314 Add Distrust.java to ProblemList
JDK-8284818 deal with ActiveProcessorCount in os::Linux::print_container_info
JDK-8283837 handle latest VS2019 in abstract_vm_version
JDK-8283754 handle VC++:1927 VS2019 in abstract_vm_version
JDK-8284727 Improve the readability of container information in the error log
JDK-8285694 unused-result warning happens at os_linux.cpp
JDK-8282861 Update XML Security for Java to 2.3.0
JDK-8283550 Upgrade HarfBuzz to the latest 2.8.0

Martin Doerr, SAP

Bug Summary
JDK-8287083 [macosx] Accessible JTables always reported as empty
JDK-8287085 [macosx] VoiceOver reads percentages rather than the actual values for sliders.
JDK-8287088 [macosx] When in a tab group if you arrow between tabs there are no VoiceOver announcements.
JDK-8283048 assert(!exceeding_node_budget()) failed: Too many NODES required! failure with ctw
JDK-8282968 assert(Compile::current()->live_nodes() < Compile::current()->max_node_limit()) failed: Live Node limit exceeded limit
JDK-8283046 Bad node estimate assertion failure
JDK-8283161 C2 failed "assert(C->live_nodes() - live_at_begin <= 2 * _nodes_required) failed: Bad node estimate: actual = 208 >> request = 101"
JDK-8282868 C2: assert(is_Loop()) failed: invalid node class: Region
JDK-8287176 Compiler Control: IGVPrintLevel directive should set PrintIdealGraph
JDK-8283170 compiler.inlining.InlineAccessors shouldn't do testing in driver VM
JDK-8286648 Domain value for system property jdk.https.negotiate.cbt should be case-insensitive
JDK-8286418 HTTPS Channel Binding support for Java GSS/Kerberos
JDK-8283313 Method linking fails with guarantee(mh->adapter() != NULL) failed: Adapter blob must already exist!
JDK-8283169 More node budget asserts in fuzzed tests
JDK-8283162 Node budget assert in fuzzed test
JDK-8283098 Node budget asserts on x86_32/64
JDK-8283047 Node estimate for loop unswitching is not correct: assert(delta <= 2 * required) failed: Bad node estimate
JDK-8282870 Restructure/clean-up for 'loopexit_or_null()'.
JDK-8283099 Shenandoah optimizations fail with assert(!phase->exceeding_node_budget())
JDK-8285903 SPNEGO has not passed channel binding info into the underlying mechanism

me, @andrewazor.es

Bug Summary
JDK-8285936 [Metrics] Enhance parsing of cgroup interface files for version detection

me, @basilcrow.com

Bug Summary
JDK-8283419 AssertionError @ jdk.compiler/com.sun.tools.javac.comp.Modules.enter(Modules.java:244)
JDK-8287343 File lock in Windows on a loaded jar due to a leak in Introspector::getBeanInfo
JDK-8286753 Improvements related to: Failed to start thread - pthread_create failed (EAGAIN)
JDK-8287331 java.beans.Introspector uses an obsolete methods cache

Olga Mikhaltcova, Azul

Bug Summary
JDK-8286806 Incorrect handling of quoted arguments in ProcessBuilder
JDK-8283314 javac crashed: [jimage.dll+0x1942] ImageStrings::find+0x28

Roman Kennke, @amazon.de

Bug Summary
JDK-8282807 Memory leak in invoker.c fillInvokeRequest() during JDI operations
JDK-8284129 ObjectStreamClass caches keep ClassLoaders alive
JDK-8284133 Refactor subclassAudits to use ClassValue
JDK-8284131 Retry loop issues in java.io.ClassCache

Roland Westrelin, Red Hat

Bug Summary
JDK-8285892 assert(_base == Tuple) failed: Not a Tuple after JDK-8280799
JDK-8284651 C2: assert(n->is_Root() || n->is_Region() || n->is_Phi() || n->is_MachMerge() || def_block->dominates(block)) failed: uses must be dominated by definitions
JDK-8285891 Unmappable character for US-ASCII encoding in TestPredicateInputBelowLoopPredicate
JDK-8285887 С2: assert(false) failed: cyclic dependency prevents range check elimination

Sergey Bylokhov, Amazon

Bug Summary
JDK-8285682 cannot open file "NUL:"
JDK-8283734 Drag And Drop hangs on Windows
JDK-8287069 Improve test java/io/FileOutputStream/OpenNUL.java
JDK-8285955 javax.imageio.IIOException: Unsupported Image Type while processing a valid JPEG image
JDK-8283731 ProfileDeferralMgr throwing ConcurrentModificationException

Severin Gehwolf, Red Hat

Bug Summary
JDK-8284756 [11u] Remove unused isUseContainerSupport in CgroupV1Subsystem
JDK-8283570 [cgroups v2] Memory and swap limits reported incorrectly
JDK-8285395 [JVMCI] [11u] Partial backport of JDK-8220623: InstalledCode
JDK-8284102 [TESTBUG] [11u] Retroactively add regression test for JDK-8272124
JDK-8283860 [TESTBUG] Some cgroup tests are failing after JDK-8231111
JDK-8284349 Cgroups: Incorrect detection logic on some systems (still reproducible)
JDK-8283763 Remove unimplemented OSContainer::read_memory_limit_in_bytes
JDK-8283783 Replace use of reflection in jdk.internal.platform.Metrics
JDK-8283764 Wrong comment in CgroupV1Subsystem::cpu_quota

Aleksey Shipilev, Red Hat

Bug Summary
JDK-8283018 11u GHA: Update GCC 9 minor versions
JDK-8282959 GHA: Allow one concurrent run per PR only
JDK-8283258 Update Debian-based cross-compilation recipes
JDK-8283039 x86: AVX2 versions of vpxor should be asserted

Simon Tooke, Red Hat

Bug Summary
JDK-8284107 Cgroups: Incorrect detection logic on some systems

Thomas Stuefe, SAP

Bug Summary
JDK-8286655 [linux] Fix process-memory information
JDK-8284175 [windows] print TMP and TEMP in hs_err and VM.info
JDK-8284322 Report glibc malloc tunables in error reports
JDK-8282589 runtime/ErrorHandling/ErrorHandler.java fails on macOS AArch64 in JDK 11

Tyler Steele, IBM

Bug Summary
JDK-8286751 libharfbuzz optimization level results in extreme build times
JDK-8286816 Remove unsupported xlc16 compile options on aix

Tyler Steele, IBM

Bug Summary
JDK-8284360 aix: support xlclang++ in the compiler detection
JDK-8284678 minor hotspot adjustments for xlclang++ from xlc16 on AIX
JDK-8284885 provide function names in native stack trace on aix with xlc16
JDK-8284759 Update build settings for AIX/xlc

Vladimir Kempik, Independent

Bug Summary
JDK-8283341 [macOS] : hotspot arm64 bug exposed by latest clang
JDK-8282558 Change default -mmacosx-version-min to 10.12
JDK-8282591 Github Actions for macos/aarch64 cross-build

Zhengyu Gu, Independent

Bug Summary
JDK-8283568 8230305 causes slowdebug build failure
JDK-8283567 [cgroups v2] Soft memory limit incorrectly using memory.high
JDK-8283381 [TESTBUG] jdk/jfr/event/io/EvilInstrument.java fails at-run shell MakeJAR.sh target
JDK-8283334 [TESTBUG] several jfr tests do not clean up files created in /tmp
JDK-8283561 Add rationale to PER_CPU_SHARES define
JDK-8283559 Cgroups v2: Container awareness
JDK-8283563 Cgroups v2: Rework Metrics in java.base so as to recognize unified hierarchy
JDK-8286128 CodeBuffer may leak _overflow_arena
JDK-8285924 CodeHeapState::aggregate() leaks blob_name
JDK-8283206 Deadlock caused by jdwp agent
JDK-8283560 Docker reporting causes secondary crashes in error handling
JDK-8286959 Don't use memset to initialize members in FileMapInfo and fix memory leak
JDK-8283481 java/nio/file/Files/InterruptCopy.java fails with java.lang.RuntimeException: Copy was not interrupted
JDK-8286132 JFR: FieldTable leaks FieldInfoTable member
JDK-8284628 Leak FcObjectSet in getFontConfigLocations() in fontpath.c
JDK-8285585 Leak XVisualInfo in getAllConfigs in awt_GraphicsEnv.c
JDK-8284235 Potential memory leak in sun.util.locale.provider.HostLocaleProviderAdapterImpl.getNumberPattern() on Windows

Zdenek Zambersky, Red Hat

Bug Summary
JDK-8283479 Revisit com/sun/jdi/RedefineCrossEvent.java