PUSHES REPORT: 11.0.18

This report shows who pushed the backports to the given release. This usually shows who did the backporting, testing, and review work.

Report generated: Mon Dec 05 01:30:09 CET 2022

Distribution by priority

Count Priority
17 P2
69 P3
122 P4
1 P5

Distribution by components

Count Component
209 100% Total
72 34.4% client-libs
22 10.5% client-libs/java.awt
17 8.1% client-libs/javax.swing
12 5.7% client-libs
11 5.3% client-libs/2d
8 3.8% client-libs/javax.accessibility
2 1.0% client-libs/javax.sound
61 29.2% hotspot
23 11.0% hotspot/compiler
16 7.7% hotspot/runtime
8 3.8% hotspot/gc
4 1.9% hotspot/jfr
4 1.9% hotspot/test
2 1.0% hotspot/svc-agent
2 1.0% hotspot
2 1.0% hotspot/svc
22 10.5% core-libs
7 3.3% core-libs/java.util:i18n
4 1.9% core-libs/java.util
4 1.9% core-libs/java.time
2 1.0% core-libs/java.lang
1 0.5% core-libs/java.net
1 0.5% core-libs
1 0.5% core-libs/java.lang:class_loading
1 0.5% core-libs/javax.naming
1 0.5% core-libs/java.nio
19 9.1% infrastructure
16 7.7% infrastructure/build
2 1.0% infrastructure
1 0.5% infrastructure/release_eng
18 8.6% security-libs
9 4.3% security-libs/java.security
4 1.9% security-libs/javax.net.ssl
2 1.0% security-libs/javax.crypto
1 0.5% security-libs/jdk.security
1 0.5% security-libs/javax.security
1 0.5% security-libs/javax.crypto:pkcs11
7 3.3% core-svc
3 1.4% core-svc/java.lang.management
2 1.0% core-svc
1 0.5% core-svc/java.lang.instrument
1 0.5% core-svc/debugger
7 3.3% tools
4 1.9% tools/javac
2 1.0% tools/javadoc(tool)
1 0.5% tools
3 1.4% xml
2 1.0% xml/jaxp
1 0.5% xml/org.w3c.dom

Distribution by affiliation

This Release Pushes

Original Pushes

Count Committer
209 100% Total
120 57.4% SAP
96 45.9% Goetz Lindenmaier
7 3.3% Christoph Langer
6 2.9% Matthias Baesken
5 2.4% Martin Doerr
5 2.4% Johannes Bechberger
1 0.5% Thomas Stuefe
43 20.6% Amazon
23 11.0% Victor Rudometov
6 2.9% Joshua Cao
5 2.4% Sergey Bylokhov
3 1.4% David Alvarez
2 1.0% Rui Li
2 1.0% William Kemper
1 0.5% autumncap
1 0.5% rcchagan
16 7.7% Red Hat
4 1.9% Jonathan Dowland
4 1.9% Zdenek Zambersky
3 1.4% Severin Gehwolf
2 1.0% Aleksey Shipilev
1 0.5% Andrew Haley
1 0.5% Andrew Hughes
1 0.5% Roland Westrelin
9 4.3% Microsoft
9 4.3% George Adams
8 3.8% Independent
7 3.3% georgeadams1995
1 0.5% 54955201+macarte
5 2.4% Azul
2 1.0% Alexey Pavlyutkin
1 0.5% Yuri Nesterenko
1 0.5% jkratochvil
1 0.5% Anton Kozlov
3 1.4% IBM
1 0.5% Ichiroh Takiguchi
1 0.5% gaurav.chaudhari
1 0.5% psoujany
1 0.5% @fcc-fac.ca
1 0.5% ryan.flegel
1 0.5% Google
1 0.5% Liam Miller-Cushon
1 0.5% Intel
1 0.5% Smita Kamath
1 0.5% JetBrains
1 0.5% Nikita Gubarkov
1 0.5% Tencent
1 0.5% Peng Xie
Count Committer
209 100% Total
133 63.6% Oracle
12 5.7% Manukumar V S
9 4.3% Magnus Ihse Bursie
9 4.3% Prasanta Sadhukhan
8 3.8% Srinivas Mandalika
6 2.9% Lawrence Andrews
6 2.9% Philip Race
5 2.4% Yoshiki Sato
5 2.4% Alexander Zuev
4 1.9% Alexander Zvegintsev
4 1.9% Daniel Jelinski
3 1.4% Weijun Wang
3 1.4% Joe Wang
3 1.4% Jayathirth D V
3 1.4% Erik Joelsson
3 1.4% Rajan Halade
3 1.4% Alexey Ivanov
3 1.4% Joe Darcy
3 1.4% Alisen Chung
2 1.0% Haimay Chao
2 1.0% Stefan Karlsson
2 1.0% Kevin Walls
2 1.0% Tobias Hartmann
2 1.0% Vicente Arturo Romero Zaldivar
2 1.0% Ioi Lam
2 1.0% Igor Ignatyev
2 1.0% Vladimir Ivanov
1 0.5% Harshitha Onkar
1 0.5% Brian Burkhalter
1 0.5% Sean Mullan
1 0.5% Roberto Castaneda Lozano
1 0.5% Patrick Concannon
1 0.5% Ravi Reddy
1 0.5% Leo Korinth
1 0.5% ravi.ra.gupta
1 0.5% Joel Borggrén-Franck
1 0.5% Dean Long
1 0.5% Fairoz Matte
1 0.5% Thomas Schatzl
1 0.5% Gary Adams
1 0.5% Hannes Wallnoefer
1 0.5% Jan Lahoda
1 0.5% Chris Plummer
1 0.5% Leonid Mesnik
1 0.5% Damon Nguyen
1 0.5% Priya Lakshmi Muthuswamy
1 0.5% Harold Seigel
1 0.5% Naoto Sato
1 0.5% Ramkumar Sunderbabu
1 0.5% Christian Hagedorn
1 0.5% Justin Lu
1 0.5% Bradford Wetmore
21 10.0% SAP
7 3.3% Matthias Baesken
4 1.9% Christoph Langer
4 1.9% Johannes Bechberger
3 1.4% Martin Doerr
2 1.0% Thomas Stuefe
1 0.5% Goetz Lindenmaier
19 9.1% Red Hat
5 2.4% Aleksey Shipilev
4 1.9% Roland Westrelin
3 1.4% Andrew Haley
2 1.0% Jonathan Dowland
2 1.0% Zdenek Zambersky
1 0.5% Martin Balao
1 0.5% Severin Gehwolf
1 0.5% Alex Kasko
7 3.3% Amazon
4 1.9% Sergey Bylokhov
1 0.5% David Alvarez
1 0.5% Joshua Cao
1 0.5% Paul Hohensee
7 3.3% Independent
1 0.5% mag
1 0.5% AJ-Ferguson
1 0.5% 54955201+macarte
1 0.5% deigue
1 0.5% liach
1 0.5% djelinski1
1 0.5% ganjianxuan
5 2.4% Unknown
5 2.4% N/A
3 1.4% Microdoc
3 1.4% Christoph Göttschkes
2 1.0% Azul
1 0.5% Yuri Nesterenko
1 0.5% Alexey Pavlyutkin
2 1.0% JetBrains
1 0.5% Artem Semenov
1 0.5% Nikita Gubarkov
2 1.0% NTT DATA
2 1.0% Yasumasa Suenaga
2 1.0% Tencent
1 0.5% Jie Fu
1 0.5% casparcwang
1 0.5% Alibaba
1 0.5% Xiaolin Zheng
1 0.5% Fujitsu
1 0.5% Masanori Yano
1 0.5% Huawei
1 0.5% Dongbo He
1 0.5% IBM
1 0.5% Ichiroh Takiguchi
1 0.5% Microsoft
1 0.5% George Adams
1 0.5% Twitter
1 0.5% Tony Printezis

Chronological push log:

Days Ago This Release Push By Original Push By Bug Summary
Name Affiliation Name Affiliation
2 Andrew Haley Red Hat Andrew Haley Red Hat JDK-8297656 AArch64: Enable AES/GCM Intrinsics
2 Matthias Baesken SAP Matthias Baesken SAP JDK-8298018 UnexpectedSourceImageSize test times out on slow machines when fastdebug is used
2 Matthias Baesken SAP Naoto Sato Oracle JDK-8298009 CLDR v42 update for tzdata 2022f
3 Victor Rudometov Amazon Srinivas Mandalika Oracle JDK-8297962 Create a regression test for JDK-4424517
3 Matthias Baesken SAP Matthias Baesken SAP JDK-8297954 EncodingSupport_md.c convertUtf8ToPlatformString wrong placing of free
3 Sergey Bylokhov Amazon Sergey Bylokhov Amazon JDK-8297937 One more cast in SAFE_SIZE_NEW_ARRAY2
4 Sergey Bylokhov Amazon Alexander Zuev Oracle JDK-8297895 Overzealous check in sizecalc.h prevents large memory allocation
4 Liam Miller-Cushon Google Hannes Wallnoefer Oracle JDK-8297889 Javadoc does not handle package annotations correctly on package-info.java
4 Johannes Bechberger SAP Johannes Bechberger SAP JDK-8297855 AsyncGetCallTrace might acquire a lock via JavaThread::thread_from_jni_environment
9 George Adams Microsoft mag Independent JDK-8297664 Update build README to reflect that MSYS2 is supported
9 Zdenek Zambersky Red Hat Zdenek Zambersky Red Hat JDK-8297649 Problemlist existing compiler/rtm tests also on x86
9 George Adams Microsoft Magnus Ihse Bursie Oracle JDK-8297635 Windows-Aarch64 build is failing in GitHub actions
9 George Adams Microsoft Magnus Ihse Bursie Oracle JDK-8297634 Fix various issues with msys2
9 Zdenek Zambersky Red Hat Yasumasa Suenaga NTT DATA JDK-8297633 win32: gc/metaspace/TestCapacityUntilGCWrapAround.java fails
9 George Adams Microsoft liach Independent JDK-8297619 Document need for short paths when building on Windows
9 George Adams Microsoft Dongbo He Huawei JDK-8297618 bash configure --prefix does not work after JDK-8257679
9 George Adams Microsoft Magnus Ihse Bursie Oracle JDK-8297617 Improved unix compatibility layer in Windows build (winenv)
10 Victor Rudometov Amazon Jayathirth D V Oracle JDK-8297598 sun/java2d/DirectX/OnScreenRenderingResizeTest/OnScreenRenderingResizeTest.java fails again
10 Victor Rudometov Amazon Jayathirth D V Oracle JDK-8297597 Update sun/java2d/DirectX/OnScreenRenderingResizeTest/OnScreenRenderingResizeTest.java
12 Victor Rudometov Amazon Jayathirth D V Oracle JDK-8297452 sun/java2d/DirectX/OnScreenRenderingResizeTest/OnScreenRenderingResizeTest.java fails
12 Victor Rudometov Amazon Philip Race Oracle JDK-8297443 closed sun/java2d/GdiRendering/ClipShapeRendering.java failed with "Incorrect color ffeeeeee instead of ff0000ff in pixel (100, 100)"
12 Victor Rudometov Amazon Alexander Zuev Oracle JDK-8297442 javax/sound/midi/Sequencer/MetaCallback.java failed with timeout
12 George Adams Microsoft Magnus Ihse Bursie Oracle JDK-8297420 PropertiesTest.sh fail on msys2
12 George Adams Microsoft Magnus Ihse Bursie Oracle JDK-8297419 Some langtools tests fail on msys2
12 georgeadams1995 Independent Magnus Ihse Bursie Oracle JDK-8297407 UnreadableRB case in MissingResourceCauseTest is not working reliably on Windows
12 Johannes Bechberger SAP Xiaolin Zheng Alibaba JDK-8297405 Remove unnecessary register push for MacroAssembler::check_klass_subtype_slow_path
13 Victor Rudometov Amazon Philip Race Oracle JDK-8297370 Regression Test CoordinateTruncationBug.java fails on OL8.3
13 Victor Rudometov Amazon ravi.ra.gupta Oracle JDK-8297366 Write a test to verify the content change of TextArea sends TextEvent
13 Aleksey Shipilev Red Hat Aleksey Shipilev Red Hat JDK-8297330 Linux os::cpu_microcode_revision() stalls cold startup
16 Severin Gehwolf Red Hat Ioi Lam Oracle JDK-8297262 Add cgroups keyword to TestDockerBasic.java
16 Severin Gehwolf Red Hat Severin Gehwolf Red Hat JDK-8297260 [Metrics] Incorrectly detected resource limits with additional cgroup fs mounts
16 Severin Gehwolf Red Hat casparcwang Tencent JDK-8297254 Incorrect container resource limit detection if manual cgroup fs mounts present
16 Goetz Lindenmaier SAP Vicente Arturo Romero Zaldivar Oracle JDK-8297248 Raw inner class constructor ref should not perform diamond inference
17 George Adams Microsoft George Adams Microsoft JDK-8296652 Restore windows aarch64 fixpath patch that was removed in 8239708
17 autumncap Amazon Alexander Zuev Oracle JDK-8297227 Create implementation for NSAccessibilityButton protocol
18 Matthias Baesken SAP Sergey Bylokhov Amazon JDK-8297136 Change implementation of safeAdd/safeMult in the LCMSImageLayout class
18 Roland Westrelin Red Hat N/A Unknown JDK-8297133 Shenandoah: SIGSEGV in vm maybe related to jit compiling xerces
19 Goetz Lindenmaier SAP Yoshiki Sato Oracle JDK-8297051 (tz) Update Timezone Data to 2022f
19 Goetz Lindenmaier SAP Justin Lu Oracle JDK-8297050 ISO 4217 Amendment 173 Update
19 Goetz Lindenmaier SAP Alexey Ivanov Oracle JDK-8297048 Refactor add/modify notification icon (TrayIcon)
19 Goetz Lindenmaier SAP Lawrence Andrews Oracle JDK-8297035 [macosx] test java/awt/Graphics/TextAAHintsTest.java fails
19 Goetz Lindenmaier SAP Lawrence Andrews Oracle JDK-8297008 Remove jtreg tag manual=yesno for java/awt/print/Dialog/DialogOrient.java
19 Goetz Lindenmaier SAP Lawrence Andrews Oracle JDK-8296994 Remove jtreg tag manual=yesno java/awt/print/PrinterJob/PageDialogTest.java
20 Zdenek Zambersky Red Hat Magnus Ihse Bursie Oracle JDK-8296941 GHA ::set-output is deprecated and will be removed
20 Martin Doerr SAP Martin Doerr SAP JDK-8296922 [PPC64] JfrGetCallTrace: Need pc == nullptr check before frame constructor
23 Goetz Lindenmaier SAP Rajan Halade Oracle JDK-8296869 java/security/cert/pkix/policyChanges/TestPolicy.java is failing
23 Goetz Lindenmaier SAP Harshitha Onkar Oracle JDK-8296862 System Tray icons get corrupted when Windows scaling changes
23 William Kemper Amazon Artem Semenov JetBrains JDK-8296849 Last column cell in the JTable row is read as empty cell
24 Johannes Bechberger SAP Johannes Bechberger SAP JDK-8296772 os::is_first_C_frame(frame*) crashes on invalid link access
25 Victor Rudometov Amazon Rajan Halade Oracle JDK-8296712 BuildEEBasicConstraints.java test fails with SunCertPathBuilderException
25 Christoph Langer SAP Rajan Halade Oracle JDK-8296668 Update test artifacts in QuoVadis CA interop tests
25 jkratochvil Azul ganjianxuan Independent JDK-8296644 Fix the infinite loop in next_line
26 Matthias Baesken SAP Matthias Baesken SAP JDK-8296539 Java_sun_awt_shell_Win32ShellFolder2_getLinkLocation check MultiByteToWideChar return value for failures
26 Goetz Lindenmaier SAP Lawrence Andrews Oracle JDK-8296538 Remove jtreg tag manual=yesno for java/awt/Graphics/LCDTextAndGraphicsState.java & show test instruction
27 Victor Rudometov Amazon Andrew Haley Red Hat JDK-8296488 Use memory_order_relaxed for os::random().
27 Christoph Langer SAP djelinski1 Independent JDK-8296475 Missing SessionID in TLS1.3 resumption in compatibility mode
27 Christoph Langer SAP Daniel Jelinski Oracle JDK-8296473 Test jdk/sun/security/ssl/SSLSessionImpl/NoInvalidateSocketException.java fails with "tag mismatch"
27 Goetz Lindenmaier SAP N/A Unknown JDK-8296468 Closed test fails after JDK-8276108 on aarch64
27 Goetz Lindenmaier SAP Haimay Chao Oracle JDK-8296466 keytool does not accurately warn about algorithms that are disabled but have additional constraints
30 Sergey Bylokhov Amazon Sergey Bylokhov Amazon JDK-8296371 Move the "sizecalc.h" to the correct location
30 Goetz Lindenmaier SAP Weijun Wang Oracle JDK-8296369 Code change of JDK-8282730 not updated to reflect CSR update
30 Goetz Lindenmaier SAP Weijun Wang Oracle JDK-8296367 LdapLoginModule throw NPE from logout method after login failure
30 Goetz Lindenmaier SAP Ravi Reddy Oracle JDK-8296366 java/util/zip/CloseInflaterDeflaterTest.java failed with "AssertionError: Expected IOException to be thrown, but nothing was thrown"
30 Goetz Lindenmaier SAP Haimay Chao Oracle JDK-8296365 Improve "keytool -printcert -jarfile" output
31 Goetz Lindenmaier SAP N/A Unknown JDK-8296317 Update harfbuzz md file
31 Goetz Lindenmaier SAP Joe Darcy Oracle JDK-8296316 RandomGenerator:NextDouble() default behavior partially fixed by JDK-8280950
31 Goetz Lindenmaier SAP Joe Darcy Oracle JDK-8296314 RandomGenerator:NextDouble() default behavior non conformant after JDK-8280550 fix
31 Goetz Lindenmaier SAP Joe Darcy Oracle JDK-8296306 SplittableRandom#nextDouble(double,double) can return result >= bound
32 Joshua Cao Amazon Ioi Lam Oracle JDK-8296242 [TESTBUG] sun.hotspot.WhiteBox$WhiteBoxPermission is not copied
33 Victor Rudometov Amazon Jie Fu Tencent JDK-8296184 javax/accessibility/4702233/AccessiblePropertiesTest.java fails to compile
33 Ichiroh Takiguchi IBM Ichiroh Takiguchi IBM JDK-8296160 CustomTzIDCheckDST.java testcase failed on AIX platform
34 Victor Rudometov Amazon Philip Race Oracle JDK-8296135 Problem list 4 jtreg tests which regularly fail on macos-aarch64
34 Victor Rudometov Amazon Srinivas Mandalika Oracle JDK-8296133 Create an automated test for JDK-4702233
35 Joshua Cao Amazon Prasanta Sadhukhan Oracle JDK-8296106 javax/swing/JMenu/4515762/bug4515762.java fails on macOS 12
35 Joshua Cao Amazon Joshua Cao Amazon JDK-8296104 Some vm_flags tests associate with a wrong BugID
36 Victor Rudometov Amazon Manukumar V S Oracle JDK-8296099 Write a regression test for JDK-4659800
36 Victor Rudometov Amazon Manukumar V S Oracle JDK-8296098 Create a regression test for JDK-4666101
36 Victor Rudometov Amazon Alexander Zvegintsev Oracle JDK-8296097 [TESTBUG] DefaultMenuBarTest.java failing on macos
36 Christoph Langer SAP Christoph Langer SAP JDK-8280158 New test from JDK-8274736 failed with/without patch in JDK11u
37 Anton Kozlov Azul Vicente Arturo Romero Zaldivar Oracle JDK-8296027 preflow visitor is not visiting lambda expressions
40 Goetz Lindenmaier SAP Philip Race Oracle JDK-8295913 Update or Problem List tests which may fail with uiScale=2 on macOS
40 Goetz Lindenmaier SAP Roberto Castaneda Lozano Oracle JDK-8295912 IGV: enhance default filters
40 Goetz Lindenmaier SAP Aleksey Shipilev Red Hat JDK-8295910 [TESTBUG] gc/metaspace/TestSizeTransitions.java fails on 32-bit platforms
40 Alexey Pavlyutkin Azul Alexey Pavlyutkin Azul JDK-8295322 Tests for JDK-8271459 were not backported to 11u
40 Goetz Lindenmaier SAP Tony Printezis Twitter JDK-8295873 Test for new gc+metaspace=info output format
41 Sergey Bylokhov Amazon Alexander Zuev Oracle JDK-8295853 [macos] VoiceOver : Getting java.lang.IllegalArgumentException: Invalid location on Editable JComboBox
44 Aleksey Shipilev Red Hat Aleksey Shipilev Red Hat JDK-8295771 S390X: Optimized builds are broken
45 William Kemper Amazon Dean Long Oracle JDK-8295741 AArch64: C2 compilation fails with guarantee(!true || (true && (shift != 0))) failed: impossible encoding
46 Goetz Lindenmaier SAP Goetz Lindenmaier SAP JDK-8295647 Fix DEFAULT_PROMOTED_VERSION_PRE=ea for -dev
47 Andrew Hughes Red Hat David Alvarez Amazon JDK-8295503 (tz) Update Timezone Data to 2022e
47 Goetz Lindenmaier SAP Manukumar V S Oracle JDK-8295471 java/awt/dnd/MissingDragExitEventTest/MissingDragExitEventTest.java fails
47 Goetz Lindenmaier SAP Kevin Walls Oracle JDK-8295463 debug.cpp utility find() should print Java Object fields.
48 Martin Doerr SAP N/A Unknown JDK-8295289 assert(false) failed: bad AD file
48 Martin Doerr SAP N/A Unknown JDK-8295174 C2: Vector constant materialization attempt
49 Goetz Lindenmaier SAP Damon Nguyen Oracle JDK-8295390 Update freetype md file
49 Goetz Lindenmaier SAP Roland Westrelin Red Hat JDK-8295389 C2: assert(BoolTest(btest).is_canonical()) failure
49 Goetz Lindenmaier SAP Daniel Jelinski Oracle JDK-8295388 javax/net/ssl/ServerName/SSLEngineExplorerMatchedSNI.java failed intermittently due to SSLException: Tag mismatch
49 Goetz Lindenmaier SAP Daniel Jelinski Oracle JDK-8295387 Tests fail with SSLProtocolException: Input record too big
51 Goetz Lindenmaier SAP Ramkumar Sunderbabu Oracle JDK-8295366 vmTestbase/gc/gctests/LoadUnloadGC2/LoadUnloadGC2.java fails intermittently with exit code 1
51 Goetz Lindenmaier SAP Alisen Chung Oracle JDK-8295365 [macosx] Aqua: java/awt/image/multiresolution/MultiresolutionIconTest.java
51 Goetz Lindenmaier SAP Tobias Hartmann Oracle JDK-8295364 Unreachable loop is not removed from C2 IR, leading to a broken graph
51 Goetz Lindenmaier SAP Manukumar V S Oracle JDK-8295363 java/awt/dnd/DropTargetInInternalFrameTest/DropTargetInInternalFrameTest.html times out and fails in Windows
51 Goetz Lindenmaier SAP Srinivas Mandalika Oracle JDK-8295362 Create an automated test for JDK-4495286
51 Goetz Lindenmaier SAP Lawrence Andrews Oracle JDK-8295361 Fix java/awt/print/PrinterJob/ImagePrinting/PrintARGBImage.java manual test
51 Goetz Lindenmaier SAP Bradford Wetmore Oracle JDK-8295360 sun.security.ssl.SSLEngineImpl.closeInbound also has similar error of JDK-8253368
51 Goetz Lindenmaier SAP Prasanta Sadhukhan Oracle JDK-8295359 Re-enable swing jtreg tests which were broken due to samevm mode
51 Goetz Lindenmaier SAP Prasanta Sadhukhan Oracle JDK-8295358 test/jdk/javax/swing/JTabbedPane/TestBackgroundScrollPolicy.java failed
51 Goetz Lindenmaier SAP Prasanta Sadhukhan Oracle JDK-8295356 When checking the default behaviour for a scroll tab layout and checking the 'opaque' checkbox, the area behind tabs is not red.
51 Nikita Gubarkov JetBrains Nikita Gubarkov JetBrains JDK-8295348 macOS: SIGSEGV at [CoreFoundation] CFArrayGetCount / sun.font.CFont.getTableBytesNative
51 Matthias Baesken SAP Matthias Baesken SAP JDK-8295326 serviceability/dcmd/jvmti/AttachFailed/AttachReturnError.java fails on Alpine
52 Smita Kamath Intel AJ-Ferguson Independent JDK-8295297 AES-CTR cipher state corruption with AVX-512
53 Goetz Lindenmaier SAP Leonid Mesnik Oracle JDK-8295209 com/sun/management/OperatingSystemMXBean/TestTotalSwap.java: Expected total swap size ... but getTotalSwapSpaceSize returned ...
53 Goetz Lindenmaier SAP Srinivas Mandalika Oracle JDK-8295208 Create a Regression test for JDK-4515031
53 Goetz Lindenmaier SAP Alexey Ivanov Oracle JDK-8295207 Resolve IDE warnings in WTrayIconPeer and SystemTray
53 Goetz Lindenmaier SAP Srinivas Mandalika Oracle JDK-8295206 Create a regression test for JDK-4699544
53 Goetz Lindenmaier SAP Andrew Haley Red Hat JDK-8295204 aarch64 : guarantee(val < (1ULL << nbits)) failed: Field too big for insn
53 Goetz Lindenmaier SAP Leo Korinth Oracle JDK-8295203 TestStressG1Humongous fails with guarantee(is_range_uncommitted)
53 Goetz Lindenmaier SAP Manukumar V S Oracle JDK-8295202 [TEST_BUG] [macosx] java/awt/dnd/DropTargetEnterExitTest/MissedDragExitTest.java failed
53 Goetz Lindenmaier SAP Manukumar V S Oracle JDK-8295201 Some of the dnd tests time out and fail intermittently
53 Johannes Bechberger SAP Johannes Bechberger SAP JDK-8295200 Zero does not build on Mac OS X due to missing os::current_thread_enable_wx implementation
53 Goetz Lindenmaier SAP Manukumar V S Oracle JDK-8295199 Write a regression test for JDK-4820080
53 Goetz Lindenmaier SAP Matthias Baesken SAP JDK-8295197 handle latest VS2022 in abstract_vm_version
53 Goetz Lindenmaier SAP Alisen Chung Oracle JDK-8295196 [TESTBUG] DoubleClickTitleBarTest.java fails on macOs
53 Goetz Lindenmaier SAP Stefan Karlsson Oracle JDK-8295195 Simplify usages of ProcessTools.createJavaProcessBuilder in our tests
54 Victor Rudometov Amazon Manukumar V S Oracle JDK-8295172 Create a regression test for JDK-4515999
54 David Alvarez Amazon Yoshiki Sato Oracle JDK-8295171 (tz) Update Timezone Data to 2022d
54 Joshua Cao Amazon Alisen Chung Oracle JDK-8295162 [TESTBUG] WindowOwnedByEmbeddedFrameTest.java fails on macos
54 Joshua Cao Amazon Alexander Zvegintsev Oracle JDK-8295161 [TEST_BUG] java/awt/Modal/ModalInternalFrameTest/ModalInternalFrameTest.java
54 Goetz Lindenmaier SAP Alexander Zvegintsev Oracle JDK-8295143 [TEST_BUG] Test java/awt/Robot/RobotWheelTest/RobotWheelTest.java fails
54 Goetz Lindenmaier SAP Manukumar V S Oracle JDK-8295142 Write an automated regression test for RFE 4371575
54 Goetz Lindenmaier SAP Alexey Ivanov Oracle JDK-8295141 Replace polling with waiting in javax/swing/text/html/parser/Parser/8078268/bug8078268.java
54 Johannes Bechberger SAP Johannes Bechberger SAP JDK-8295139 FFI_GO_CLOSURES macro not defined but required for zero build on Mac OS X
54 Goetz Lindenmaier SAP Srinivas Mandalika Oracle JDK-8295138 Create a test for JDK-4740761
54 Goetz Lindenmaier SAP Manukumar V S Oracle JDK-8295137 Create an automated regression test for RFE 4138746
54 Goetz Lindenmaier SAP Sergey Bylokhov Amazon JDK-8295136 Create a new test for JDK-8254790
54 Goetz Lindenmaier SAP Srinivas Mandalika Oracle JDK-8295135 Create a regression test for JDK-8000326
54 Goetz Lindenmaier SAP Manukumar V S Oracle JDK-8295134 Write a regression test for JDK-4615365
54 Goetz Lindenmaier SAP Masanori Yano Fujitsu JDK-8295133 java/awt/Graphics2D/CopyAreaOOB.java fails
54 Goetz Lindenmaier SAP Fairoz Matte Oracle JDK-8295132 [TESTBUG] modify compiler/loopopts/TestSkeletonPredicateNegation.java to run on C1 also
54 Goetz Lindenmaier SAP Prasanta Sadhukhan Oracle JDK-8295131 SwingSet2 JTable Demo throws NullPointerException
54 Goetz Lindenmaier SAP Kevin Walls Oracle JDK-8295130 debug.cpp utilities should be available in product builds.
54 Goetz Lindenmaier SAP Thomas Stuefe SAP JDK-8295129 On sem_destroy() failing we should assert
54 Goetz Lindenmaier SAP Christoph Göttschkes Microdoc JDK-8295128 [TESTBUG] gc/g1/TestGCLogMessages.java fails if ergonomics detect too small InitialHeapSize
54 Goetz Lindenmaier SAP Stefan Karlsson Oracle JDK-8295127 ZGC: JNIHandleBlock verification failure in stack watermark processing
55 Victor Rudometov Amazon Alexander Zuev Oracle JDK-8295079 Reg test: java/awt/Toolkit/ScreenInsetsTest/ScreenInsetsTest.java fails in Windows
55 Christoph Langer SAP Christoph Langer SAP JDK-8295644 [11u] Remove designator DEFAULT_PROMOTED_VERSION_PRE=ea for release 11.0.17
55 Victor Rudometov Amazon Roland Westrelin Red Hat JDK-8295075 assert(false) failed: infinite loop in PhaseIterGVN::optimize
55 Goetz Lindenmaier SAP Vladimir Ivanov Oracle JDK-8295055 CI: ciBytecodeStream::get_klass() is not consistent
55 Goetz Lindenmaier SAP Vladimir Ivanov Oracle JDK-8295054 C1: Missing access check on non-accessible class
55 Goetz Lindenmaier SAP Alex Kasko Red Hat JDK-8295052 Fix java/nio/file/FileStore/Basic.java test by ignoring /run/user/* mount points
55 Goetz Lindenmaier SAP Alexander Zvegintsev Oracle JDK-8295051 [TEST_BUG] Test java/awt/Frame/MiscUndecorated/RepaintTest.java fails
55 Goetz Lindenmaier SAP Lawrence Andrews Oracle JDK-8295050 Remove jtreg tag manual=yesno for java/awt/print/PrinterJob/ImagePrinting/ImageTypes.java & show test UI
55 Goetz Lindenmaier SAP Brian Burkhalter Oracle JDK-8295049 test/jdk/java/lang/Math/PowTests.java skips testing for non-corner-case values
55 Goetz Lindenmaier SAP Christoph Göttschkes Microdoc JDK-8295048 serviceability/sa/Clhsdb tests are using a C2 specific VMStruct field
55 Goetz Lindenmaier SAP Chris Plummer Oracle JDK-8295047 Remove ReceiverTypeData check from serviceability/sa/TestPrintMdo.java
55 Goetz Lindenmaier SAP Prasanta Sadhukhan Oracle JDK-8295046 Test java/awt/print/PrinterJob/TestPgfmtSetMPA.java may fail w/o printer
55 Goetz Lindenmaier SAP Thomas Schatzl Oracle JDK-8295043 gc/g1/TestGCLogMessages.java fails - missing "Evacuation failure" message
55 Goetz Lindenmaier SAP Prasanta Sadhukhan Oracle JDK-8295041 Regression automated Test '/open/test/jdk/javax/swing/JColorChooser/Test7194184.java' fails
55 Goetz Lindenmaier SAP Patrick Concannon Oracle JDK-8295040 java/lang/StringBuffer/HugeCapacity.java and j/l/StringBuilder/HugeCapacity.java tests shouldn't be @ignore-d
55 Goetz Lindenmaier SAP Igor Ignatyev Oracle JDK-8295039 some gc tests use 'test.java.opts' and not 'test.vm.opts'
55 Goetz Lindenmaier SAP Igor Ignatyev Oracle JDK-8295037 serviceability/logging/TestLogRotation.java uses 'test.java.opts' and not 'test.vm.opts'
55 Goetz Lindenmaier SAP Gary Adams Oracle JDK-8295036 jdb does not include jdk.* in the default class filter
58 Martin Doerr SAP Martin Doerr SAP JDK-8295002 [PPC64] JfrGetCallTrace: assert(_pc != nullptr) failed: must have PC
59 Joshua Cao Amazon Prasanta Sadhukhan Oracle JDK-8294928 [TESTBUG] NullModalityDialogTest.java fails on MacOS
59 Rui Li Amazon Srinivas Mandalika Oracle JDK-8294926 Create a regression test for JDK-4702690
60 Martin Doerr SAP Martin Doerr SAP JDK-8294846 [PPC64] C2: Missing is_oop information when using disjoint compressed oops mode
60 Goetz Lindenmaier SAP Roland Westrelin Red Hat JDK-8294825 Incorrect result when switching to C2 OSR compilation from C1
61 Goetz Lindenmaier SAP Harold Seigel Oracle JDK-8294805 JVM crash with GenerateOopMap::error_work(char const*, __va_list_tag*)
61 Goetz Lindenmaier SAP Tobias Hartmann Oracle JDK-8294802 StringConcat::validate_mem_flow asserts with "unexpected user: StoreI"
61 Rui Li Amazon Philip Race Oracle JDK-8294795 Problem list failing two Robot Screen Capture tests
61 Victor Rudometov Amazon Roland Westrelin Red Hat JDK-8294789 Segfault at PhaseIdealLoop::clone_loop_handle_data_uses
62 Zdenek Zambersky Red Hat Zdenek Zambersky Red Hat JDK-8294742 P11TlsKeyMaterialGenerator should work with ChaCha20-Poly1305
62 Victor Rudometov Amazon Jan Lahoda Oracle JDK-8294733 Duplicate ldc generated by javac
66 Victor Rudometov Amazon Joe Wang Oracle JDK-8294613 Document.normalizeDocument() produces different results
66 Jonathan Dowland Red Hat Matthias Baesken SAP JDK-8294575 MetricsTesterCgroupV2.getLongValueEntryFromFile fails when named value doesn't exist
66 Goetz Lindenmaier SAP Daniel Jelinski Oracle JDK-8294573 sun/net/www/http/KeepAliveCache/KeepAliveProperty.java failed with "RuntimeException: Failed in server"
67 Goetz Lindenmaier SAP Philip Race Oracle JDK-8294497 Some jtreg sound tests should be marked with sound keyword
67 Christoph Langer SAP Christoph Langer SAP JDK-8294138 [11u] Revert change from JDK-8210962 in basic.m4
70 David Alvarez Amazon Yoshiki Sato Oracle JDK-8294496 (tz) Update Timezone Data to 2022c
71 gaurav.chaudhari IBM deigue Independent JDK-8294319 [REDO] DST not applying properly with zone id offset set with TZ env variable
73 Victor Rudometov Amazon Paul Hohensee Amazon JDK-8294258 JFR: jfr/event/oldobject/TestClassLoaderLeak.java still fails when GC cycles are not happening
73 Goetz Lindenmaier SAP Manukumar V S Oracle JDK-8294210 Create a test to check the focus stealing of JPopupMenu from JComboBox
73 psoujany IBM Priya Lakshmi Muthuswamy Oracle JDK-8294208 some pages contain content outside of landmark region
73 Goetz Lindenmaier SAP Christian Hagedorn Oracle JDK-8294205 Remove failing assertion code when selecting first memory state in SuperWord::co_locate_pack
73 Goetz Lindenmaier SAP Prasanta Sadhukhan Oracle JDK-8294201 Regression automated test '/open/test/jdk/javax/swing/JFrame/8175301/ScaledFrameBackgroundTest.java' fails
74 Alexey Pavlyutkin Azul Joel Borggrén-Franck Oracle JDK-8294108 AssertionError in Annotate.fromAnnotations with -Xdoclint
75 David Alvarez Amazon Yoshiki Sato Oracle JDK-8294495 Add legacy tz tests to OpenJDK
76 Goetz Lindenmaier SAP Joe Wang Oracle JDK-8294024 jcup.md missing additional text
76 Goetz Lindenmaier SAP Weijun Wang Oracle JDK-8294016 entries.remove(entry) is useless in PKCS12KeyStore
76 Goetz Lindenmaier SAP Joe Wang Oracle JDK-8294015 Missing notice in dom.md
76 Goetz Lindenmaier SAP Sean Mullan Oracle JDK-8294106 jarsigner prints invalid digest/signature algorithm warnings if keysize is weak/disabled
79 Goetz Lindenmaier SAP Christoph Göttschkes Microdoc JDK-8293913 compiler/codegen/TestCharVect2.java fails for client VMs
81 rcchagan Amazon Aleksey Shipilev Red Hat JDK-8293820 jfr/event/oldobject/TestClassLoaderLeak.java fails when GC cycles are not happening
83 ryan.flegel @fcc-fac.ca Martin Balao Red Hat JDK-8293663 Retrying a failed authentication on multiple LDAP servers can lead to users blocked
83 Peng Xie Tencent Matthias Baesken SAP JDK-8293651 containers/docker/TestMemoryWithCgroupV1.java fails on linux ppc64le machine with missing Memory and Swap Limit output
88 Jonathan Dowland Red Hat Yoshiki Sato Oracle JDK-8293506 System.loadLibrary does not work on Big Sur if JDK is built with macOS SDK 10.15 and earlier
88 Thomas Stuefe SAP Thomas Stuefe SAP JDK-8293486 jcmd to trim the glibc heap
89 Sergey Bylokhov Amazon Yasumasa Suenaga NTT DATA JDK-8293458 Add support for Visual Studio 2022
89 Jonathan Dowland Red Hat Jonathan Dowland Red Hat JDK-8293446 [Metrics] Reported memory limit may exceed physical machine memory
89 54955201+macarte Independent 54955201+macarte Independent JDK-8293440 It is not possible to read local computer certificates with the SunMSCAPI provider
89 Yuri Nesterenko Azul Yuri Nesterenko Azul JDK-8295614 [11u] minor update in attribute style
93 georgeadams1995 Independent Aleksey Shipilev Red Hat JDK-8293309 vcruntime140_1.dll is not needed on 32-bit Windows
93 georgeadams1995 Independent Erik Joelsson Oracle JDK-8293308 VS2019 build missing vcruntime140_1.dll
93 georgeadams1995 Independent Erik Joelsson Oracle JDK-8293301 [windows] cannot pass relative path to --with-boot-jdk
93 georgeadams1995 Independent Magnus Ihse Bursie Oracle JDK-8293300 Configure cannot handle command overrides with arguments
93 georgeadams1995 Independent Magnus Ihse Bursie Oracle JDK-8293299 Split basics.m4 into basic.m4 and util.m4
93 georgeadams1995 Independent Erik Joelsson Oracle JDK-8293298 Check pandoc capabilities in configure
94 Jonathan Dowland Red Hat Jonathan Dowland Red Hat JDK-8293200 Detected container memory limit may exceed physical machine memory
94 Christoph Langer SAP Christoph Langer SAP JDK-8292887 Bump update version for OpenJDK: jdk-11.0.18

No changesets log

Committer push log

54955201+macarte, Independent

Bug Summary
JDK-8293440 It is not possible to read local computer certificates with the SunMSCAPI provider

Anton Kozlov, Azul

Bug Summary
JDK-8296027 preflow visitor is not visiting lambda expressions

David Alvarez, Amazon

Bug Summary
JDK-8294496 (tz) Update Timezone Data to 2022c
JDK-8295171 (tz) Update Timezone Data to 2022d
JDK-8294495 Add legacy tz tests to OpenJDK

Andrew Hughes, Red Hat

Bug Summary
JDK-8295503 (tz) Update Timezone Data to 2022e

Alexey Pavlyutkin, Azul

Bug Summary
JDK-8294108 AssertionError in Annotate.fromAnnotations with -Xdoclint
JDK-8295322 Tests for JDK-8271459 were not backported to 11u

Andrew Haley, Red Hat

Bug Summary
JDK-8297656 AArch64: Enable AES/GCM Intrinsics

autumncap, Amazon

Bug Summary
JDK-8297227 Create implementation for NSAccessibilityButton protocol

Peng Xie, Tencent

Bug Summary
JDK-8293651 containers/docker/TestMemoryWithCgroupV1.java fails on linux ppc64le machine with missing Memory and Swap Limit output

Christoph Langer, SAP

Bug Summary
JDK-8295644 [11u] Remove designator DEFAULT_PROMOTED_VERSION_PRE=ea for release 11.0.17

Christoph Langer, SAP

Bug Summary
JDK-8294138 [11u] Revert change from JDK-8210962 in basic.m4
JDK-8292887 Bump update version for OpenJDK: jdk-11.0.18
JDK-8296475 Missing SessionID in TLS1.3 resumption in compatibility mode
JDK-8280158 New test from JDK-8274736 failed with/without patch in JDK11u
JDK-8296473 Test jdk/sun/security/ssl/SSLSessionImpl/NoInvalidateSocketException.java fails with "tag mismatch"
JDK-8296668 Update test artifacts in QuoVadis CA interop tests

Liam Miller-Cushon, Google

Bug Summary
JDK-8297889 Javadoc does not handle package annotations correctly on package-info.java

gaurav.chaudhari, IBM

Bug Summary
JDK-8294319 [REDO] DST not applying properly with zone id offset set with TZ env variable

George Adams, Microsoft

Bug Summary
JDK-8297618 bash configure --prefix does not work after JDK-8257679
JDK-8297619 Document need for short paths when building on Windows
JDK-8297634 Fix various issues with msys2
JDK-8297617 Improved unix compatibility layer in Windows build (winenv)
JDK-8297420 PropertiesTest.sh fail on msys2
JDK-8297419 Some langtools tests fail on msys2
JDK-8297664 Update build README to reflect that MSYS2 is supported
JDK-8297635 Windows-Aarch64 build is failing in GitHub actions

George Adams, Microsoft

Bug Summary
JDK-8296652 Restore windows aarch64 fixpath patch that was removed in 8239708

georgeadams1995, Independent

Bug Summary
JDK-8293301 [windows] cannot pass relative path to --with-boot-jdk
JDK-8293298 Check pandoc capabilities in configure
JDK-8293300 Configure cannot handle command overrides with arguments
JDK-8293299 Split basics.m4 into basic.m4 and util.m4
JDK-8297407 UnreadableRB case in MissingResourceCauseTest is not working reliably on Windows
JDK-8293309 vcruntime140_1.dll is not needed on 32-bit Windows
JDK-8293308 VS2019 build missing vcruntime140_1.dll

Goetz Lindenmaier, SAP

Bug Summary
JDK-8297051 (tz) Update Timezone Data to 2022f
JDK-8295365 [macosx] Aqua: java/awt/image/multiresolution/MultiresolutionIconTest.java
JDK-8297035 [macosx] test java/awt/Graphics/TextAAHintsTest.java fails
JDK-8295202 [TEST_BUG] [macosx] java/awt/dnd/DropTargetEnterExitTest/MissedDragExitTest.java failed
JDK-8295051 [TEST_BUG] Test java/awt/Frame/MiscUndecorated/RepaintTest.java fails
JDK-8295143 [TEST_BUG] Test java/awt/Robot/RobotWheelTest/RobotWheelTest.java fails
JDK-8295196 [TESTBUG] DoubleClickTitleBarTest.java fails on macOs
JDK-8295128 [TESTBUG] gc/g1/TestGCLogMessages.java fails if ergonomics detect too small InitialHeapSize
JDK-8295910 [TESTBUG] gc/metaspace/TestSizeTransitions.java fails on 32-bit platforms
JDK-8295132 [TESTBUG] modify compiler/loopopts/TestSkeletonPredicateNegation.java to run on C1 also
JDK-8295204 aarch64 : guarantee(val < (1ULL << nbits)) failed: Field too big for insn
JDK-8295054 C1: Missing access check on non-accessible class
JDK-8295389 C2: assert(BoolTest(btest).is_canonical()) failure
JDK-8295055 CI: ciBytecodeStream::get_klass() is not consistent
JDK-8296468 Closed test fails after JDK-8276108 on aarch64
JDK-8296369 Code change of JDK-8282730 not updated to reflect CSR update
JDK-8295209 com/sun/management/OperatingSystemMXBean/TestTotalSwap.java: Expected total swap size ... but getTotalSwapSpaceSize returned ...
JDK-8293913 compiler/codegen/TestCharVect2.java fails for client VMs
JDK-8295136 Create a new test for JDK-8254790
JDK-8295208 Create a Regression test for JDK-4515031
JDK-8295206 Create a regression test for JDK-4699544
JDK-8295135 Create a regression test for JDK-8000326
JDK-8295138 Create a test for JDK-4740761
JDK-8294210 Create a test to check the focus stealing of JPopupMenu from JComboBox
JDK-8295137 Create an automated regression test for RFE 4138746
JDK-8295362 Create an automated test for JDK-4495286
JDK-8295130 debug.cpp utilities should be available in product builds.
JDK-8295463 debug.cpp utility find() should print Java Object fields.
JDK-8294016 entries.remove(entry) is useless in PKCS12KeyStore
JDK-8295647 Fix DEFAULT_PROMOTED_VERSION_PRE=ea for -dev
JDK-8295361 Fix java/awt/print/PrinterJob/ImagePrinting/PrintARGBImage.java manual test
JDK-8295052 Fix java/nio/file/FileStore/Basic.java test by ignoring /run/user/* mount points
JDK-8295043 gc/g1/TestGCLogMessages.java fails - missing "Evacuation failure" message
JDK-8295197 handle latest VS2022 in abstract_vm_version
JDK-8295912 IGV: enhance default filters
JDK-8296365 Improve "keytool -printcert -jarfile" output
JDK-8294825 Incorrect result when switching to C2 OSR compilation from C1
JDK-8297050 ISO 4217 Amendment 173 Update
JDK-8294106 jarsigner prints invalid digest/signature algorithm warnings if keysize is weak/disabled
JDK-8295363 java/awt/dnd/DropTargetInInternalFrameTest/DropTargetInInternalFrameTest.html times out and fails in Windows
JDK-8295471 java/awt/dnd/MissingDragExitEventTest/MissingDragExitEventTest.java fails
JDK-8295133 java/awt/Graphics2D/CopyAreaOOB.java fails
JDK-8295040 java/lang/StringBuffer/HugeCapacity.java and j/l/StringBuilder/HugeCapacity.java tests shouldn't be @ignore-d
JDK-8296869 java/security/cert/pkix/policyChanges/TestPolicy.java is failing
JDK-8296366 java/util/zip/CloseInflaterDeflaterTest.java failed with "AssertionError: Expected IOException to be thrown, but nothing was thrown"
JDK-8295388 javax/net/ssl/ServerName/SSLEngineExplorerMatchedSNI.java failed intermittently due to SSLException: Tag mismatch
JDK-8294024 jcup.md missing additional text
JDK-8295036 jdb does not include jdk.* in the default class filter
JDK-8294805 JVM crash with GenerateOopMap::error_work(char const*, __va_list_tag*)
JDK-8296466 keytool does not accurately warn about algorithms that are disabled but have additional constraints
JDK-8296367 LdapLoginModule throw NPE from logout method after login failure
JDK-8294015 Missing notice in dom.md
JDK-8295129 On sem_destroy() failing we should assert
JDK-8296314 RandomGenerator:NextDouble() default behavior non conformant after JDK-8280550 fix
JDK-8296316 RandomGenerator:NextDouble() default behavior partially fixed by JDK-8280950
JDK-8297248 Raw inner class constructor ref should not perform diamond inference
JDK-8295359 Re-enable swing jtreg tests which were broken due to samevm mode
JDK-8297048 Refactor add/modify notification icon (TrayIcon)
JDK-8295041 Regression automated Test '/open/test/jdk/javax/swing/JColorChooser/Test7194184.java' fails
JDK-8294201 Regression automated test '/open/test/jdk/javax/swing/JFrame/8175301/ScaledFrameBackgroundTest.java' fails
JDK-8294205 Remove failing assertion code when selecting first memory state in SuperWord::co_locate_pack
JDK-8296994 Remove jtreg tag manual=yesno java/awt/print/PrinterJob/PageDialogTest.java
JDK-8296538 Remove jtreg tag manual=yesno for java/awt/Graphics/LCDTextAndGraphicsState.java & show test instruction
JDK-8297008 Remove jtreg tag manual=yesno for java/awt/print/Dialog/DialogOrient.java
JDK-8295050 Remove jtreg tag manual=yesno for java/awt/print/PrinterJob/ImagePrinting/ImageTypes.java & show test UI
JDK-8295047 Remove ReceiverTypeData check from serviceability/sa/TestPrintMdo.java
JDK-8295141 Replace polling with waiting in javax/swing/text/html/parser/Parser/8078268/bug8078268.java
JDK-8295207 Resolve IDE warnings in WTrayIconPeer and SystemTray
JDK-8295037 serviceability/logging/TestLogRotation.java uses 'test.java.opts' and not 'test.vm.opts'
JDK-8295048 serviceability/sa/Clhsdb tests are using a C2 specific VMStruct field
JDK-8295195 Simplify usages of ProcessTools.createJavaProcessBuilder in our tests
JDK-8295039 some gc tests use 'test.java.opts' and not 'test.vm.opts'
JDK-8294497 Some jtreg sound tests should be marked with sound keyword
JDK-8295201 Some of the dnd tests time out and fail intermittently
JDK-8296306 SplittableRandom#nextDouble(double,double) can return result >= bound
JDK-8294802 StringConcat::validate_mem_flow asserts with "unexpected user: StoreI"
JDK-8295360 sun.security.ssl.SSLEngineImpl.closeInbound also has similar error of JDK-8253368
JDK-8294573 sun/net/www/http/KeepAliveCache/KeepAliveProperty.java failed with "RuntimeException: Failed in server"
JDK-8295131 SwingSet2 JTable Demo throws NullPointerException
JDK-8296862 System Tray icons get corrupted when Windows scaling changes
JDK-8295873 Test for new gc+metaspace=info output format
JDK-8295046 Test java/awt/print/PrinterJob/TestPgfmtSetMPA.java may fail w/o printer
JDK-8295049 test/jdk/java/lang/Math/PowTests.java skips testing for non-corner-case values
JDK-8295358 test/jdk/javax/swing/JTabbedPane/TestBackgroundScrollPolicy.java failed
JDK-8295387 Tests fail with SSLProtocolException: Input record too big
JDK-8295203 TestStressG1Humongous fails with guarantee(is_range_uncommitted)
JDK-8295364 Unreachable loop is not removed from C2 IR, leading to a broken graph
JDK-8295390 Update freetype md file
JDK-8296317 Update harfbuzz md file
JDK-8295913 Update or Problem List tests which may fail with uiScale=2 on macOS
JDK-8295366 vmTestbase/gc/gctests/LoadUnloadGC2/LoadUnloadGC2.java fails intermittently with exit code 1
JDK-8295356 When checking the default behaviour for a scroll tab layout and checking the 'opaque' checkbox, the area behind tabs is not red.
JDK-8295134 Write a regression test for JDK-4615365
JDK-8295199 Write a regression test for JDK-4820080
JDK-8295142 Write an automated regression test for RFE 4371575
JDK-8295127 ZGC: JNIHandleBlock verification failure in stack watermark processing

Ichiroh Takiguchi, IBM

Bug Summary
JDK-8296160 CustomTzIDCheckDST.java testcase failed on AIX platform

Jonathan Dowland, Red Hat

Bug Summary
JDK-8293446 [Metrics] Reported memory limit may exceed physical machine memory
JDK-8293200 Detected container memory limit may exceed physical machine memory
JDK-8294575 MetricsTesterCgroupV2.getLongValueEntryFromFile fails when named value doesn't exist
JDK-8293506 System.loadLibrary does not work on Big Sur if JDK is built with macOS SDK 10.15 and earlier

jkratochvil, Azul

Bug Summary
JDK-8296644 Fix the infinite loop in next_line

Johannes Bechberger, SAP

Bug Summary
JDK-8297855 AsyncGetCallTrace might acquire a lock via JavaThread::thread_from_jni_environment
JDK-8295139 FFI_GO_CLOSURES macro not defined but required for zero build on Mac OS X
JDK-8296772 os::is_first_C_frame(frame*) crashes on invalid link access
JDK-8297405 Remove unnecessary register push for MacroAssembler::check_klass_subtype_slow_path
JDK-8295200 Zero does not build on Mac OS X due to missing os::current_thread_enable_wx implementation

Joshua Cao, Amazon

Bug Summary
JDK-8295161 [TEST_BUG] java/awt/Modal/ModalInternalFrameTest/ModalInternalFrameTest.java
JDK-8294928 [TESTBUG] NullModalityDialogTest.java fails on MacOS
JDK-8296242 [TESTBUG] sun.hotspot.WhiteBox$WhiteBoxPermission is not copied
JDK-8295162 [TESTBUG] WindowOwnedByEmbeddedFrameTest.java fails on macos
JDK-8296106 javax/swing/JMenu/4515762/bug4515762.java fails on macOS 12
JDK-8296104 Some vm_flags tests associate with a wrong BugID

Matthias Baesken, SAP

Bug Summary
JDK-8297136 Change implementation of safeAdd/safeMult in the LCMSImageLayout class
JDK-8298009 CLDR v42 update for tzdata 2022f
JDK-8297954 EncodingSupport_md.c convertUtf8ToPlatformString wrong placing of free
JDK-8296539 Java_sun_awt_shell_Win32ShellFolder2_getLinkLocation check MultiByteToWideChar return value for failures
JDK-8295326 serviceability/dcmd/jvmti/AttachFailed/AttachReturnError.java fails on Alpine
JDK-8298018 UnexpectedSourceImageSize test times out on slow machines when fastdebug is used

Martin Doerr, SAP

Bug Summary
JDK-8294846 [PPC64] C2: Missing is_oop information when using disjoint compressed oops mode
JDK-8295002 [PPC64] JfrGetCallTrace: assert(_pc != nullptr) failed: must have PC
JDK-8296922 [PPC64] JfrGetCallTrace: Need pc == nullptr check before frame constructor
JDK-8295289 assert(false) failed: bad AD file
JDK-8295174 C2: Vector constant materialization attempt

Nikita Gubarkov, JetBrains

Bug Summary
JDK-8295348 macOS: SIGSEGV at [CoreFoundation] CFArrayGetCount / sun.font.CFont.getTableBytesNative

psoujany, IBM

Bug Summary
JDK-8294208 some pages contain content outside of landmark region

rcchagan, Amazon

Bug Summary
JDK-8293820 jfr/event/oldobject/TestClassLoaderLeak.java fails when GC cycles are not happening

Roland Westrelin, Red Hat

Bug Summary
JDK-8297133 Shenandoah: SIGSEGV in vm maybe related to jit compiling xerces

Rui Li, Amazon

Bug Summary
JDK-8294926 Create a regression test for JDK-4702690
JDK-8294795 Problem list failing two Robot Screen Capture tests

ryan.flegel, @fcc-fac.ca

Bug Summary
JDK-8293663 Retrying a failed authentication on multiple LDAP servers can lead to users blocked

Sergey Bylokhov, Amazon

Bug Summary
JDK-8295853 [macos] VoiceOver : Getting java.lang.IllegalArgumentException: Invalid location on Editable JComboBox
JDK-8293458 Add support for Visual Studio 2022
JDK-8296371 Move the "sizecalc.h" to the correct location
JDK-8297937 One more cast in SAFE_SIZE_NEW_ARRAY2
JDK-8297895 Overzealous check in sizecalc.h prevents large memory allocation

Severin Gehwolf, Red Hat

Bug Summary
JDK-8297260 [Metrics] Incorrectly detected resource limits with additional cgroup fs mounts
JDK-8297262 Add cgroups keyword to TestDockerBasic.java
JDK-8297254 Incorrect container resource limit detection if manual cgroup fs mounts present

Aleksey Shipilev, Red Hat

Bug Summary
JDK-8297330 Linux os::cpu_microcode_revision() stalls cold startup
JDK-8295771 S390X: Optimized builds are broken

Thomas Stuefe, SAP

Bug Summary
JDK-8293486 jcmd to trim the glibc heap

Smita Kamath, Intel

Bug Summary
JDK-8295297 AES-CTR cipher state corruption with AVX-512

Victor Rudometov, Amazon

Bug Summary
JDK-8296097 [TESTBUG] DefaultMenuBarTest.java failing on macos
JDK-8295075 assert(false) failed: infinite loop in PhaseIterGVN::optimize
JDK-8296712 BuildEEBasicConstraints.java test fails with SunCertPathBuilderException
JDK-8297443 closed sun/java2d/GdiRendering/ClipShapeRendering.java failed with "Incorrect color ffeeeeee instead of ff0000ff in pixel (100, 100)"
JDK-8297962 Create a regression test for JDK-4424517
JDK-8295172 Create a regression test for JDK-4515999
JDK-8296098 Create a regression test for JDK-4666101
JDK-8296133 Create an automated test for JDK-4702233
JDK-8294613 Document.normalizeDocument() produces different results
JDK-8294733 Duplicate ldc generated by javac
JDK-8296184 javax/accessibility/4702233/AccessiblePropertiesTest.java fails to compile
JDK-8297442 javax/sound/midi/Sequencer/MetaCallback.java failed with timeout
JDK-8294258 JFR: jfr/event/oldobject/TestClassLoaderLeak.java still fails when GC cycles are not happening
JDK-8296135 Problem list 4 jtreg tests which regularly fail on macos-aarch64
JDK-8295079 Reg test: java/awt/Toolkit/ScreenInsetsTest/ScreenInsetsTest.java fails in Windows
JDK-8297370 Regression Test CoordinateTruncationBug.java fails on OL8.3
JDK-8294789 Segfault at PhaseIdealLoop::clone_loop_handle_data_uses
JDK-8297452 sun/java2d/DirectX/OnScreenRenderingResizeTest/OnScreenRenderingResizeTest.java fails
JDK-8297598 sun/java2d/DirectX/OnScreenRenderingResizeTest/OnScreenRenderingResizeTest.java fails again
JDK-8297597 Update sun/java2d/DirectX/OnScreenRenderingResizeTest/OnScreenRenderingResizeTest.java
JDK-8296488 Use memory_order_relaxed for os::random().
JDK-8296099 Write a regression test for JDK-4659800
JDK-8297366 Write a test to verify the content change of TextArea sends TextEvent

William Kemper, Amazon

Bug Summary
JDK-8295741 AArch64: C2 compilation fails with guarantee(!true || (true && (shift != 0))) failed: impossible encoding
JDK-8296849 Last column cell in the JTable row is read as empty cell

Yuri Nesterenko, Azul

Bug Summary
JDK-8295614 [11u] minor update in attribute style

Zdenek Zambersky, Red Hat

Bug Summary
JDK-8296941 GHA ::set-output is deprecated and will be removed
JDK-8294742 P11TlsKeyMaterialGenerator should work with ChaCha20-Poly1305
JDK-8297649 Problemlist existing compiler/rtm tests also on x86
JDK-8297633 win32: gc/metaspace/TestCapacityUntilGCWrapAround.java fails