PUSHES REPORT: 11.0.19

This report shows who pushed the backports to the given release. This usually shows who did the backporting, testing, and review work.

Report generated: Fri Feb 02 13:55:14 CET 2024

Distribution by priority

Count Priority
1 P1
12 P2
64 P3
124 P4
6 P5

Distribution by components

Count Component
207 100% Total
54 26.1% core-libs
16 7.7% core-libs/java.net
5 2.4% core-libs/java.nio
5 2.4% core-libs/java.util:i18n
5 2.4% core-libs/java.lang
4 1.9% core-libs/java.util.concurrent
3 1.4% core-libs/java.util.logging
3 1.4% core-libs
2 1.0% core-libs/java.util.stream
2 1.0% core-libs/java.text
2 1.0% core-libs/java.util.jar
1 0.5% core-libs/java.sql
1 0.5% core-libs/java.util
1 0.5% core-libs/java.lang.invoke
1 0.5% core-libs/javax.lang.model
1 0.5% core-libs/java.math
1 0.5% core-libs/java.io
1 0.5% core-libs/java.time
52 25.1% hotspot
22 10.6% hotspot/compiler
11 5.3% hotspot/runtime
5 2.4% hotspot/jvmti
4 1.9% hotspot/svc-agent
3 1.4% hotspot/jfr
3 1.4% hotspot/gc
2 1.0% hotspot/test
1 0.5% hotspot/svc
1 0.5% hotspot/other
36 17.4% client-libs
13 6.3% client-libs/java.awt
10 4.8% client-libs/javax.swing
9 4.3% client-libs/2d
1 0.5% client-libs
1 0.5% client-libs/javax.sound
1 0.5% client-libs/javax.imageio
1 0.5% client-libs/javax.accessibility
28 13.5% infrastructure
23 11.1% infrastructure/build
3 1.4% infrastructure
2 1.0% infrastructure/release_eng
22 10.6% security-libs
8 3.9% security-libs/java.security
6 2.9% security-libs/javax.net.ssl
5 2.4% security-libs/org.ietf.jgss
2 1.0% security-libs/javax.crypto:pkcs11
1 0.5% security-libs/javax.crypto
8 3.9% tools
4 1.9% tools/javadoc(tool)
2 1.0% tools/javac
2 1.0% tools
4 1.9% core-svc
1 0.5% core-svc/tools
1 0.5% core-svc
1 0.5% core-svc/debugger
1 0.5% core-svc/java.lang.management
2 1.0% xml
1 0.5% xml/jaxp
1 0.5% xml
1 0.5% globalization
1 0.5% globalization/translation

Distribution by affiliation

This Release Pushes

Original Pushes

Count Committer
207 100% Total
149 72.0% SAP
119 57.5% Goetz Lindenmaier
22 10.6% Christoph Langer
7 3.4% Matthias Baesken
1 0.5% Richard Reingruber
26 12.6% Amazon
15 7.2% Sergey Bylokhov
5 2.4% Autumn Capasso
2 1.0% Victor Rudometov
2 1.0% Joshua Cao
1 0.5% Aleksey Shipilev
1 0.5% Elif Aslan
10 4.8% Red Hat
6 2.9% Severin Gehwolf
2 1.0% karm
1 0.5% Andrew Hughes
1 0.5% Thomas Stuefe
7 3.4% Azul
4 1.9% Roman Marchenko
2 1.0% Ekaterina Vergizova
1 0.5% Yuri Nesterenko
3 1.4% Fujitsu
1 0.5% nagata.haruhito
1 0.5% Kimura Yukihiro
1 0.5% Masanori Yano
3 1.4% Microsoft
2 1.0% George Adams
1 0.5% Dhamoder Nalla
2 1.0% IBM
1 0.5% Ichiroh Takiguchi
1 0.5% Shruthi Acharya
2 1.0% Oracle
1 0.5% Lance Andersen
1 0.5% Pankaj Bansal
2 1.0% VMWare
2 1.0% Kumar Srinivasan
1 0.5% Alibaba
1 0.5% Denghui Dong
1 0.5% BellSoft
1 0.5% Aleksei Voitylov
1 0.5% Independent
1 0.5% AutumnCapasso
Count Committer
207 100% Total
133 64.3% Oracle
12 5.8% Magnus Ihse Bursie
8 3.9% Daniel Fuchs
6 2.9% Weijun Wang
6 2.9% Christian Hagedorn
4 1.9% Brian Burkhalter
4 1.9% Alexander Zuev
4 1.9% Chris Plummer
4 1.9% Philip Race
4 1.9% Serguei Spitsyn
3 1.4% Daniel Daugherty
3 1.4% Pankaj Bansal
3 1.4% Ioi Lam
3 1.4% Rajan Halade
3 1.4% Ravi Gupta
3 1.4% Igor Ignatyev
3 1.4% Justin Lu
2 1.0% Frank Yuan
2 1.0% Jayathirth D V
2 1.0% Tobias Hartmann
2 1.0% Ivan Sipka
2 1.0% Erik Joelsson
2 1.0% Thomas Schatzl
2 1.0% Conor Cleary
2 1.0% Lawrence Andrews
2 1.0% David Holmes
2 1.0% Mikhailo Seledtsov
2 1.0% Lance Andersen
2 1.0% Prasanta Sadhukhan
2 1.0% Vladimir Kozlov
2 1.0% Naoto Sato
2 1.0% Jaikiran Pai
2 1.0% Joe Darcy
2 1.0% Alisen Chung
1 0.5% Harshitha Onkar
1 0.5% Markus Grönlund
1 0.5% Sibabrata Sahoo
1 0.5% Sean Mullan
1 0.5% Alan Bateman
1 0.5% Evgeny Nikitin
1 0.5% Roberto Castaneda Lozano
1 0.5% Patrick Concannon
1 0.5% Sean Coffey
1 0.5% Roger Riggs
1 0.5% Alexander Zvegintsev
1 0.5% Kim Barrett
1 0.5% Rajat Mahajan
1 0.5% Raffaello Giulietti
1 0.5% Ryan Wallace
1 0.5% Emanuel Peter
1 0.5% Hannes Wallnoefer
1 0.5% Daniel Jelinski
1 0.5% Igor Veresov
1 0.5% joe.cherian
1 0.5% Priya Lakshmi Muthuswamy
1 0.5% Coleen Phillimore
1 0.5% Harold Seigel
1 0.5% Jonathan Gibbons
1 0.5% Mandy Chung
1 0.5% Mikael Vidstedt
22 10.6% SAP
8 3.9% Christoph Langer
7 3.4% Matthias Baesken
6 2.9% Goetz Lindenmaier
1 0.5% Richard Reingruber
12 5.8% Amazon
8 3.9% Sergey Bylokhov
4 1.9% Aleksey Shipilev
10 4.8% Independent
2 1.0% Chris Hegarty
2 1.0% Zhengyu Gu
1 0.5% Julian Waters
1 0.5% Andrey Turbanov
1 0.5% Dmitriy Samersoff
1 0.5% ruprabhu25
1 0.5% vikeytk
1 0.5% Thejasvi Voniadka
8 3.9% Red Hat
3 1.4% Severin Gehwolf
1 0.5% karm
1 0.5% Jonathan Dowland
1 0.5% Andrew Hughes
1 0.5% Thomas Stuefe
1 0.5% Roland Westrelin
4 1.9% Google
3 1.4% Martin Buchholz
1 0.5% Liam Miller-Cushon
4 1.9% Tencent
3 1.4% Xuelei Fan
1 0.5% Peng Xie
3 1.4% Azul
1 0.5% Yuri Nesterenko
1 0.5% Roman Marchenko
1 0.5% Ekaterina Vergizova
2 1.0% ARM
1 0.5% Hao Sun
1 0.5% Nick Gasson
2 1.0% Fujitsu
1 0.5% Kimura Yukihiro
1 0.5% Masanori Yano
2 1.0% IBM
2 1.0% Ichiroh Takiguchi
1 0.5% BellSoft
1 0.5% Aleksei Voitylov
1 0.5% JetBrains
1 0.5% Maxim Kartashev
1 0.5% Microsoft
1 0.5% Dhamoder Nalla
1 0.5% NTT DATA
1 0.5% Koichi Sakata
1 0.5% VMWare
1 0.5% Kumar Srinivasan

Chronological push log:

UTC Time This Release Push By Original Push By Bug Summary
Name Affiliation Name Affiliation
2023/04/12 22:16 Christoph Langer SAP (same) (same) JDK-8299596 [11u] Remove designator DEFAULT_PROMOTED_VERSION_PRE=ea for release 11.0.19
2023/03/21 14:42 Goetz Lindenmaier SAP (same) (same) JDK-8304389 [11u] Crash on Windows in C2 compiled code after 8248238 and 8218431
2023/03/03 18:44 AutumnCapasso Independent Pankaj Bansal Oracle JDK-8303595 Create implementation of native accessibility peer for ScrollPane and ScrollBar Java Accessibility roles
2023/03/03 17:57 Kumar Srinivasan VMWare Brian Burkhalter Oracle JDK-8303592 Test generation scripts do not invoke stream preprocessor correctly
2023/03/03 17:57 Kumar Srinivasan VMWare (same) (same) JDK-8302000 [11u] A subtle race condition during jdk11u build
2023/03/03 15:19 Lance Andersen Oracle (same) (same) JDK-8303583 Update Zlib Data Compression Library to Version 1.2.13
2023/03/03 08:47 Goetz Lindenmaier SAP Rajan Halade Oracle JDK-8303557 Remove SSLv2Hello and SSLv3 from default enabled TLS protocols
2023/03/02 16:43 Matthias Baesken SAP (same) (same) JDK-8303521 TestPrintXML.java output error messages in case compare fails
2023/03/01 14:45 Goetz Lindenmaier SAP Brian Burkhalter Oracle JDK-8303460 test/jdk/java/nio/file/Files/probeContentType/Basic.java fails on some systems for the ".rar" extension
2023/03/01 14:44 Goetz Lindenmaier SAP Xuelei Fan Tencent JDK-8303459 code cleanup in SSLContextImpl.java
2023/02/28 11:58 Goetz Lindenmaier SAP Rajan Halade Oracle JDK-8303342 Add Certigna Root CA
2023/02/28 11:56 Goetz Lindenmaier SAP Daniel Jelinski Oracle JDK-8303341 java/net/httpclient/ConnectExceptionTest.java should not rely on system resolver
2023/02/28 11:54 Goetz Lindenmaier SAP Aleksey Shipilev Amazon JDK-8303340 sun/security/pkcs11/Signature/TestDSAKeyLength.java fails when NSS version detection fails
2023/02/28 11:52 Goetz Lindenmaier SAP Aleksey Shipilev Amazon JDK-8303339 java/util/concurrent/atomic/Serial.java uses {Double,Long}Accumulator incorrectly
2023/02/28 11:50 Goetz Lindenmaier SAP Ichiroh Takiguchi IBM JDK-8303338 jdk/java/lang/ProcessBuilder/Basic.java fails on AIX
2023/02/28 11:48 Goetz Lindenmaier SAP Chris Plummer Oracle JDK-8303337 serviceability/sa/ClhsdbScanOops.java can fail due to unexpected GC
2023/02/28 11:46 Goetz Lindenmaier SAP Daniel Daugherty Oracle JDK-8303336 ProblemList runtime/jni/checked/TestPrimitiveArrayCriticalWithBadParam.java on macosx-x64
2023/02/28 11:46 Goetz Lindenmaier SAP Daniel Daugherty Oracle JDK-8303335 ProblemList 7 serviceability/sa tests on macosx-x64
2023/02/28 11:43 Goetz Lindenmaier SAP Jaikiran Pai Oracle JDK-8303333 javax/xml/crypto/dsig/LogParameters.java failed with "RuntimeException: Unexpected log output:"
2023/02/27 08:55 Christoph Langer SAP (same) (same) JDK-8302903 [11u] Add modified test snippet after backport of JDK-8221871
2023/02/27 08:09 Goetz Lindenmaier SAP Igor Ignatyev Oracle JDK-8303226 use Utils.TEST_NATIVE_PATH instead of System.getProperty("test.nativepath")
2023/02/24 21:34 Shruthi Acharya IBM Masanori Yano Fujitsu JDK-8303200 duplicate property key in java.sql.rowset resource bundle
2023/02/24 20:13 Goetz Lindenmaier SAP (same) (same) JDK-8303075 [11u] Add CompileClassWithDebugTest to ProblemList for 8303074
2023/02/24 20:12 Goetz Lindenmaier SAP Lawrence Andrews Oracle JDK-8303197 [TESTBUG] java/awt/print/Dialog/DialogCopies.java does not show instruction
2023/02/24 20:10 Goetz Lindenmaier SAP Christian Hagedorn Oracle JDK-8303196 compiler/ciReplay/TestVMNoCompLevel.java fails due to wrong data size with TieredStopAtLevel=2,3
2023/02/24 20:08 Goetz Lindenmaier SAP Aleksey Shipilev Amazon JDK-8303195 compiler/cpuflags/TestSSE4Disabled.java should test for CPU feature explicitly
2023/02/24 20:05 Goetz Lindenmaier SAP Hao Sun ARM JDK-8303194 Test image build failure with clang-10 due to -Wmisleading-indentation
2023/02/24 19:56 Goetz Lindenmaier SAP Jonathan Gibbons Oracle JDK-8303191 fix missing newlines at end of files
2023/02/24 12:39 Ekaterina Vergizova Azul (same) (same) JDK-8303160 JFR: increase checkpoint event size for stacktrace and string pool
2023/02/17 10:19 Goetz Lindenmaier SAP Daniel Daugherty Oracle JDK-8302728 Tier1 validate-source fails after 8279614
2023/02/17 10:17 Goetz Lindenmaier SAP Nick Gasson ARM JDK-8302727 [TESTBUG] serviceability/sa/ClhsdbCDSCore.java fails with -XX:TieredStopAtLevel=1
2023/02/17 10:16 Goetz Lindenmaier SAP Evgeny Nikitin Oracle JDK-8302726 compiler/whitebox/BlockingCompilation.java timed out
2023/02/17 10:15 Goetz Lindenmaier SAP Conor Cleary Oracle JDK-8302725 java/nio/channels/DatagramChannel/SRTest.java fails intermittently
2023/02/17 10:13 Goetz Lindenmaier SAP Brian Burkhalter Oracle JDK-8302724 jdk/test/jdk/java/util/prefs/ExportNode.java relies on default platform encoding
2023/02/17 10:12 Goetz Lindenmaier SAP Naoto Sato Oracle JDK-8302723 sun/util/resources/cldr/TimeZoneNamesTest.java timed out
2023/02/17 10:10 Goetz Lindenmaier SAP Igor Veresov Oracle JDK-8302722 MakeMethodNotCompilableTest fails with -XX:TieredStopAtLevel={1,2,3}
2023/02/17 10:08 Goetz Lindenmaier SAP Ivan Sipka Oracle JDK-8302721 Refactor UncaughtExceptions shell test as java test.
2023/02/17 10:05 Goetz Lindenmaier SAP Peng Xie Tencent JDK-8302720 Typo in compiler/runtime/safepoints/TestRegisterRestoring.java
2023/02/17 10:04 Goetz Lindenmaier SAP Igor Ignatyev Oracle JDK-8302719 Introduce Utils.TEST_NATIVE_PATH
2023/02/17 09:57 Christoph Langer SAP (same) (same) JDK-8302694 [11u] Update GHA Boot JDK to 11.0.18
2023/02/17 09:30 Goetz Lindenmaier SAP Sean Coffey Oracle JDK-8302715 jdk/lambda/vm/StrictfpDefault.java file can be removed
2023/02/17 09:29 Goetz Lindenmaier SAP Thomas Schatzl Oracle JDK-8302714 gc/stress/gclocker/TestExcessGCLockerCollections.java does not compile
2023/02/17 09:27 Goetz Lindenmaier SAP Martin Buchholz Google JDK-8302713 java/util/concurrent/CountDownLatch/Basic.java fails
2023/02/17 09:23 Goetz Lindenmaier SAP Frank Yuan Oracle JDK-8302712 sun/net/www/protocol/file/DirPermissionDenied.java failed on Windows 2016 because DirPermissionDenied directory has no read permission
2023/02/17 09:20 Goetz Lindenmaier SAP Priya Lakshmi Muthuswamy Oracle JDK-8302710 bad test with broken links needs to be updated
2023/02/17 09:14 Goetz Lindenmaier SAP Magnus Ihse Bursie Oracle JDK-8302657 [11u] Add missing '(' in makefile after backport of 8218431
2023/02/16 16:18 Thomas Stuefe Red Hat (same) (same) JDK-8302675 Add pid to process reaper thread name
2023/02/16 12:45 Christoph Langer SAP Julian Waters Independent JDK-8302655 Partially fix string expansion issues in UTIL_DEFUN_NAMED and related macros
2023/02/16 12:44 Christoph Langer SAP Erik Joelsson Oracle JDK-8302653 Optionally add get-task-allow entitlement to macos binaries
2023/02/16 10:38 Goetz Lindenmaier SAP Frank Yuan Oracle JDK-8302647 Refactor shell test javax/xml/jaxp/common/8035437/run.sh to java
2023/02/16 10:34 Goetz Lindenmaier SAP Liam Miller-Cushon Google JDK-8302646 SourcePositions are wrong for Strings concatenated with '+' operator
2023/02/16 10:31 Goetz Lindenmaier SAP Igor Ignatyev Oracle JDK-8302645 serviceability/tmtools/jstat tests times out with -Xcomp
2023/02/16 10:30 Goetz Lindenmaier SAP Daniel Fuchs Oracle JDK-8302643 java/net/URLConnection/ResendPostBody.java failed with "Error while cleaning up threads after test"
2023/02/16 10:28 Goetz Lindenmaier SAP Serguei Spitsyn Oracle JDK-8302642 jvmti/scenarios/contention/TC04/tc04t001/TestDescription.java fails on jvmti->InterruptThread (JVMTI_ERROR_THREAD_NOT_ALIVE)
2023/02/16 10:26 Goetz Lindenmaier SAP Serguei Spitsyn Oracle JDK-8302641 jvmti/scenarios/contention/TC04/tc04t001/TestDescription.java still fails due to wrong number of MonitorContendedEntered events
2023/02/16 10:25 Goetz Lindenmaier SAP Daniel Fuchs Oracle JDK-8302640 Replace wildcard address with loopback or local host in tests - part 2
2023/02/16 10:19 Goetz Lindenmaier SAP Joe Darcy Oracle JDK-8302638 Reduce incidence of compiler.warn.source.no.bootclasspath in javac tests
2023/02/15 14:51 Goetz Lindenmaier SAP Rajat Mahajan Oracle JDK-8302585 Rendering Issues with Borders on Windows High-DPI systems
2023/02/15 13:56 Goetz Lindenmaier SAP Alisen Chung Oracle JDK-8302579 The left line of the TitledBorder is not painted on 150 scale factor
2023/02/15 13:56 Goetz Lindenmaier SAP joe.cherian Oracle JDK-8302578 Change bugs.java.com and bugreport.java.com URL's to https
2023/02/15 09:06 Christoph Langer SAP Magnus Ihse Bursie Oracle JDK-8302533 Remove debug printout from JDK-8285093
2023/02/15 09:06 Christoph Langer SAP Erik Joelsson Oracle JDK-8302532 JDK-8285093 changed the default for --with-output-sync
2023/02/15 09:06 Christoph Langer SAP Magnus Ihse Bursie Oracle JDK-8302531 Introduce UTIL_ARG_WITH
2023/02/14 20:31 Goetz Lindenmaier SAP Christian Hagedorn Oracle JDK-8302510 C2: assert(dead->outcnt() == 0 && !dead->is_top()) failed: node must be dead
2023/02/14 20:29 Goetz Lindenmaier SAP Serguei Spitsyn Oracle JDK-8302509 [TEST] develop a test case for SuspendThreadList including current thread
2023/02/14 20:28 Goetz Lindenmaier SAP Serguei Spitsyn Oracle JDK-8302507 jvmti/scenarios/contention/TC04/tc04t001/TestDescription.java fails due to wrong number of MonitorContendedEntered events
2023/02/14 20:26 Goetz Lindenmaier SAP Martin Buchholz Google JDK-8302506 java/util/concurrent/BlockingQueue/DrainToFails.java testBounded fails intermittently
2023/02/14 20:23 Goetz Lindenmaier SAP Daniel Fuchs Oracle JDK-8302505 java/net/Socket/LingerTest.java and java/net/Socket/ShutdownBoth.java timeout intermittently
2023/02/14 20:18 Goetz Lindenmaier SAP Joe Darcy Oracle JDK-8302504 Add tests for ElementKind predicates
2023/02/14 20:14 Goetz Lindenmaier SAP Chris Hegarty Independent JDK-8302503 Run java/net/URL/HandlerLoop.java in othervm mode
2023/02/14 20:10 Goetz Lindenmaier SAP Chris Hegarty Independent JDK-8302502 sun/net/www/protocol/http/StackTraceTest.java fails intermittently with Invalid Http response
2023/02/14 20:04 Goetz Lindenmaier SAP Martin Buchholz Google JDK-8302500 java/util/concurrent/CountDownLatch/Basic.java failed w/ Xcomp
2023/02/14 20:01 Goetz Lindenmaier SAP Daniel Fuchs Oracle JDK-8302499 sun/net/www/protocol/http/ProtocolRedirect.java failed with "java.net.ConnectException"
2023/02/14 09:33 Goetz Lindenmaier SAP Ioi Lam Oracle JDK-8302451 Avoid JVM crash when containers share the same /tmp dir
2023/02/13 14:39 Goetz Lindenmaier SAP Ravi Gupta Oracle JDK-8302331 Modify TextAreaTextEventTest.java as to verify the content change of TextComponent sends TextEvent
2023/02/13 14:37 Goetz Lindenmaier SAP Daniel Fuchs Oracle JDK-8302330 sun/net/www/http/HttpClient/MultiThreadTest.java should be more resilient to unexpected traffic
2023/02/13 14:19 Christoph Langer SAP Magnus Ihse Bursie Oracle JDK-8302327 building.md should link to both md and html
2023/02/13 11:48 Ekaterina Vergizova Azul Markus Grönlund Oracle JDK-8302318 Let checkpoint event sizes grow beyond u4 limit
2023/02/12 19:08 Goetz Lindenmaier SAP Ravi Gupta Oracle JDK-8302286 Write a test to verify List sends ItemEvent/ActionEvent
2023/02/10 08:43 Goetz Lindenmaier SAP Weijun Wang Oracle JDK-8302201 Exclude linux-aarch64 in NSS tests
2023/02/10 07:54 Yuri Nesterenko Azul (same) (same) JDK-8302194 Fix possible leak in SpNegoContext dispose
2023/02/08 16:07 Goetz Lindenmaier SAP Chris Plummer Oracle JDK-8302081 CompressedClassSpaceSizeInJmapHeap.java time out after 8 minutes
2023/02/08 16:07 Goetz Lindenmaier SAP Chris Plummer Oracle JDK-8302079 gc/metaspace/CompressedClassSpaceSizeInJmapHeap.java causes test task timeout on macosx
2023/02/08 16:05 Goetz Lindenmaier SAP Tobias Hartmann Oracle JDK-8302078 C2: CreateExNode::Identity fails with assert(i < _max) failed: oob: i=1, _max=1
2023/02/08 16:04 Goetz Lindenmaier SAP Weijun Wang Oracle JDK-8302076 sspi_bridge.dll not built if BUILD_CRYPTO is false
2023/02/08 16:01 Goetz Lindenmaier SAP Conor Cleary Oracle JDK-8302075 java/net/httpclient/ServerCloseTest.java failed once with ConnectException
2023/02/06 13:38 Kimura Yukihiro Fujitsu (same) (same) JDK-8300742 jstat's CGCT is 5 percent higher than the pause time in -Xlog:gc.
2023/02/06 11:24 Goetz Lindenmaier SAP Magnus Ihse Bursie Oracle JDK-8301847 Improved platform checking in makefiles
2023/02/05 04:11 Sergey Bylokhov Amazon (same) (same) JDK-8301826 The sun/awt/shell/FileSystemViewMemoryLeak.java is unstable
2023/02/04 04:51 Ichiroh Takiguchi IBM (same) (same) JDK-8301817 CustomTzIDCheckDST.java may fail at future date
2023/02/03 18:48 Victor Rudometov Amazon Ravi Gupta Oracle JDK-8301802 Write a test to verify the components selection sends ItemEvent
2023/02/03 10:13 Goetz Lindenmaier SAP Christian Hagedorn Oracle JDK-8301751 Assert in PhaseIdealLoop::dump_real_LCA is too strong
2023/02/01 10:10 Goetz Lindenmaier SAP (same) (same) JDK-8301600 Address the inconsistency between the constant array and pool size
2023/02/01 10:07 Goetz Lindenmaier SAP Thejasvi Voniadka Independent JDK-8301598 Change java/util/zip/ZipFile/DeleteTempJar.java to stop HttpServer cleanly in case of exceptions
2023/02/01 10:00 Goetz Lindenmaier SAP Sibabrata Sahoo Oracle JDK-8301596 Test to cover CodeSource.getCodeSigners()
2023/02/01 09:12 Goetz Lindenmaier SAP Magnus Ihse Bursie Oracle JDK-8301583 Split up MakeBase.gmk
2023/02/01 08:05 Matthias Baesken SAP (same) (same) JDK-8301579 Add cause in a couple of IllegalArgumentException and InvalidParameterException shown by sun/security/pkcs11 tests
2023/01/31 09:40 Christoph Langer SAP (same) (same) JDK-8301470 [11u, 17u] Bump jtreg to fix issue with build JDK 11.0.18
2023/01/30 16:32 Elif Aslan Amazon Lawrence Andrews Oracle JDK-8301370 TEST_BUG: closed/javax/sound/midi/Synthesizer/Receiver/bug6186488.java fails
2023/01/30 08:59 Goetz Lindenmaier SAP Harshitha Onkar Oracle JDK-8301331 Update Libpng to 1.6.38
2023/01/30 08:57 Goetz Lindenmaier SAP ruprabhu25 Independent JDK-8301330 maxOutputSize, instead of javatest.maxOutputSize, should be used in TEST.properties
2023/01/27 17:26 Sergey Bylokhov Amazon Raffaello Giulietti Oracle JDK-8301259 Disable an assertion in test/jdk/java/util/DoubleStreamSums/CompensatedSums.java
2023/01/27 17:20 Sergey Bylokhov Amazon Philip Race Oracle JDK-8301258 Regression test java/awt/font/TextLayout/CombiningPerf.java fails
2023/01/26 20:31 Masanori Yano Fujitsu Alexander Zvegintsev Oracle JDK-8301196 [macosx] test java/awt/Frame/ShapeNotSetSometimes/ShapeNotSetSometimes.java fails (again)
2023/01/26 16:18 Victor Rudometov Amazon Alan Bateman Oracle JDK-8301172 File.listRoots performance degradation
2023/01/26 14:09 Sergey Bylokhov Amazon Mikael Vidstedt Oracle JDK-8301158 Missing comma in copyright header
2023/01/25 17:33 Sergey Bylokhov Amazon (same) (same) JDK-8301105 sRGB-ColorSpace to sRGB-ColorSpace Conversion
2023/01/25 10:27 Severin Gehwolf Red Hat Jonathan Dowland Red Hat JDK-8301062 CgroupMetrics.getTotalMemorySize0() can report invalid results on 32 bit systems
2023/01/25 09:00 Goetz Lindenmaier SAP Christian Hagedorn Oracle JDK-8301057 C2: Create skeleton predicates for all If nodes in loop predication
2023/01/25 08:58 Goetz Lindenmaier SAP Christian Hagedorn Oracle JDK-8301056 C2: Cast node is not processed again in CCP and keeps a wrong too narrow type which is later replaced by top
2023/01/25 08:55 Goetz Lindenmaier SAP Roland Westrelin Red Hat JDK-8301055 C2 compilation hits "assert((mode == ControlAroundStripMined && use == sfpt) || !use->is_reachable_from_root()) failed: missed a node"
2023/01/25 08:51 Goetz Lindenmaier SAP Justin Lu Oracle JDK-8301054 Update IANA Language Subtag Registry to Version 2022-08-08
2023/01/25 08:49 Goetz Lindenmaier SAP Kim Barrett Oracle JDK-8301052 CloneableReference subtest should not throw CloneNotSupportedException
2023/01/25 08:40 Goetz Lindenmaier SAP Thomas Schatzl Oracle JDK-8301049 Reference discovery is confused about atomicity and degree of parallelism
2023/01/25 08:35 Goetz Lindenmaier SAP Matthias Baesken SAP JDK-8301048 adjust libsplashscreen linux ppc64le builds for easier libpng update
2023/01/23 21:08 Autumn Capasso Amazon Alexander Zuev Oracle JDK-8300932 Create implementation for component peer for all the components who should be ignored in a11y interactions
2023/01/19 21:24 Goetz Lindenmaier SAP (same) (same) JDK-8300695 [17u,11u] Fix DEFAULT_PROMOTED_VERSION_PRE=ea for -dev
2023/01/18 14:11 Goetz Lindenmaier SAP Hannes Wallnoefer Oracle JDK-8300532 Upgrade jQuery to 3.6.1
2023/01/18 14:06 Goetz Lindenmaier SAP Alisen Chung Oracle JDK-8300530 Update LCMS to 2.14
2023/01/18 13:58 Goetz Lindenmaier SAP Andrey Turbanov Independent JDK-8300529 java/nio/file/Files/probeContentType/Basic.java fails on Windows 11
2023/01/18 11:08 Goetz Lindenmaier SAP (same) (same) JDK-8300424 [11u] Chunk lost in backport of 8297569
2023/01/18 08:17 Matthias Baesken SAP (same) (same) JDK-8300443 improve cleanup and error handling of awt_parseColorModel in awt_parseImage.c
2023/01/18 08:16 Matthias Baesken SAP (same) (same) JDK-8300442 GetPrimitiveArrayCritical in imageioJPEG misses result - NULL check
2023/01/17 17:25 Severin Gehwolf Red Hat Magnus Ihse Bursie Oracle JDK-8300293 Fix autoconf 2.71 warning "AC_CHECK_HEADERS: you should use literals"
2023/01/17 17:02 Autumn Capasso Amazon Alexander Zuev Oracle JDK-8300283 Create implementation for NSAccessibilityCheckBox protocol peer
2023/01/17 15:54 Goetz Lindenmaier SAP Tobias Hartmann Oracle JDK-8300278 C2: assert(is_valid_AArch64_address(dest.target())) failed: bad address
2023/01/17 15:52 Goetz Lindenmaier SAP Daniel Fuchs Oracle JDK-8300276 java/util/logging/CheckZombieLockTest.java failing intermittently
2023/01/17 07:31 Goetz Lindenmaier SAP Chris Plummer Oracle JDK-8300232 vmTestbase/nsk/jdi/ThreadStartEvent/thread/thread001 failed due to SocketTimeoutException
2023/01/16 19:22 Goetz Lindenmaier SAP Dmitriy Samersoff Independent JDK-8300224 Use 64bit atomics in patch_verified_entry on x86_64
2023/01/16 19:09 Goetz Lindenmaier SAP Jaikiran Pai Oracle JDK-8300223 URLPermission constructor throws IllegalArgumentException: Invalid characters in hostname after JDK-8294378
2023/01/16 17:51 Goetz Lindenmaier SAP Ryan Wallace Oracle JDK-8300217 URLPermission constructor exception when using tr locale
2023/01/16 17:47 Goetz Lindenmaier SAP Vladimir Kozlov Oracle JDK-8300216 SIGSEGV in PhaseIdealLoop::build_loop_late_post_work
2023/01/16 17:40 Goetz Lindenmaier SAP Naoto Sato Oracle JDK-8300212 Update IANA Language Subtag Registry to Version 2022-03-02
2023/01/16 17:37 Goetz Lindenmaier SAP Roger Riggs Oracle JDK-8300211 [test] java/net/URL/HandlerLoop has illegal reflective access
2023/01/15 06:55 Sergey Bylokhov Amazon (same) (same) JDK-8300174 Compilation of gtest causes build to fail if runtime libraries are in different dirs
2023/01/13 07:54 Matthias Baesken SAP Vladimir Kozlov Oracle JDK-8300105 fix 2 compiler tests to avoid JDK-8208690
2023/01/11 16:05 Autumn Capasso Amazon Alexander Zuev Oracle JDK-8299980 Create implementation for NSAccessibilityRadioButton protocol
2023/01/10 10:30 Severin Gehwolf Red Hat (same) (same) JDK-8299871 java/security/SignedJar/spi-calendar-provider/TestSPISigned.java failing on Windows
2023/01/10 09:53 Severin Gehwolf Red Hat (same) (same) JDK-8299869 Add a regression test for JDK-8297684
2023/01/10 09:32 Christoph Langer SAP (same) (same) JDK-8300521 [11u] Remove designator DEFAULT_PROMOTED_VERSION_PRE=ea for release 11.0.18
2023/01/09 16:38 Goetz Lindenmaier SAP Matthias Baesken SAP JDK-8299824 support latest VS2022 MSC_VER in abstract_vm_version.cpp
2023/01/09 16:29 Goetz Lindenmaier SAP Roberto Castaneda Lozano Oracle JDK-8299822 C2 compilation fails with assert "non-reduction loop contains reduction nodes"
2023/01/09 16:24 Goetz Lindenmaier SAP Emanuel Peter Oracle JDK-8299819 C2: fix and simplify IdealLoopTree::do_remove_empty_loop
2023/01/09 15:58 Goetz Lindenmaier SAP David Holmes Oracle JDK-8299815 ProblemList java/text/Format/NumberFormat/CurrencyFormat.java
2023/01/09 15:58 Goetz Lindenmaier SAP Justin Lu Oracle JDK-8299814 java/text/Format/NumberFormat/CurrencyFormat.java fails for hr_HR
2023/01/07 17:24 Autumn Capasso Amazon Pankaj Bansal Oracle JDK-8299771 Create implementation for NSAccessibilityStaticText protocol
2023/01/06 05:18 Dhamoder Nalla Microsoft (same) (same) JDK-8292863 assert(_print_inlining_stream->size() > 0) failed: missing inlining msg
2023/01/05 23:26 Joshua Cao Amazon Ioi Lam Oracle JDK-8299704 Crash in KlassFactory::check_shared_class_file_load_hook
2023/01/05 21:15 Goetz Lindenmaier SAP Daniel Fuchs Oracle JDK-8299698 BootstrapLoggerTest : Executor still alive
2023/01/05 21:13 Goetz Lindenmaier SAP Daniel Fuchs Oracle JDK-8299697 java/util/logging/LogManager/Configuration/updateConfiguration/HandlersOnComplexResetUpdate.java fails with Unexpected reference: java.lang.ref.WeakReference
2023/01/05 21:11 Goetz Lindenmaier SAP Mandy Chung Oracle JDK-8299696 [TESTBUG] assertEquals is invoked with the arguments in the wrong order
2023/01/05 21:03 Goetz Lindenmaier SAP Brian Burkhalter Oracle JDK-8299695 [test] java/math/BigInteger/ModPow.java can throw an ArithmeticException
2023/01/05 21:00 Goetz Lindenmaier SAP Lance Andersen Oracle JDK-8299694 test/jdk/java/nio/file/DirectoryStream/Basic.java not correct when using a glob
2023/01/05 07:54 Goetz Lindenmaier SAP Justin Lu Oracle JDK-8299655 ISO 4217 Amendment 174 Update
2023/01/04 21:57 Aleksey Shipilev Amazon (same) (same) JDK-8299616 [11u] Bootcycle build fails after JDK-8257679 backport
2023/01/04 10:30 Goetz Lindenmaier SAP Weijun Wang Oracle JDK-8299590 [sspi] gss_accept_sec_context leaves output_token uninitialized
2023/01/04 10:27 Goetz Lindenmaier SAP Coleen Phillimore Oracle JDK-8299589 Add ResourceHashtable support for deleting selected entries
2023/01/04 10:25 Goetz Lindenmaier SAP Weijun Wang Oracle JDK-8299588 Deadlock in libj2gss.so when loading "j2gss" and "net" libraries in parallel.
2023/01/03 17:46 Joshua Cao Amazon Ioi Lam Oracle JDK-8299551 FindTests.gmk cannot handle "=" in TEST.groups comments
2023/01/03 10:16 Roman Marchenko Azul (same) (same) JDK-8299445 EndingDotHostname.java fails because of compilation errors
2023/01/02 11:48 Goetz Lindenmaier SAP Prasanta Sadhukhan Oracle JDK-8299457 [macosx] javax/swing/Popup/TaskbarPositionTest.java fails because Popup is one pixel off
2023/01/02 11:44 Goetz Lindenmaier SAP Philip Race Oracle JDK-8299456 JNI exception pending in awt_GraphicsEnv.c:1432
2023/01/02 11:41 Goetz Lindenmaier SAP Zhengyu Gu Independent JDK-8299455 java.sun.awt.X11GraphicsDevice.getDoubleBufferVisuals() leaks XdbeScreenVisualInfo
2023/01/02 11:40 Goetz Lindenmaier SAP Zhengyu Gu Independent JDK-8299454 NMT: Correct NMT tag on CollectedHeap
2023/01/02 11:38 Goetz Lindenmaier SAP Christian Hagedorn Oracle JDK-8299453 C2: assert(C->live_nodes() <= C->max_node_limit()) failed: Live Node limit exceeded limit
2023/01/02 11:35 Goetz Lindenmaier SAP Philip Race Oracle JDK-8299452 SA tests fail with "Windbg Error: ReadVirtual failed"
2023/01/02 11:31 Goetz Lindenmaier SAP Weijun Wang Oracle JDK-8299449 JGSS: Fix leak in exception cases in getJavaOID()
2023/01/02 11:29 Goetz Lindenmaier SAP Weijun Wang Oracle JDK-8299448 JGSS: Fix cut/paste error in NativeUtil.c
2022/12/30 08:16 Sergey Bylokhov Amazon Jayathirth D V Oracle JDK-8299420 Update ProblemList after verification of jtreg tests in Win 7
2022/12/29 21:31 Sergey Bylokhov Amazon (same) (same) JDK-8299418 Opensource unit/regression tests for CMM
2022/12/29 12:59 Sergey Bylokhov Amazon Jayathirth D V Oracle JDK-8299410 Remove SCCS id's from awt jtreg tests
2022/12/29 12:59 Sergey Bylokhov Amazon Prasanta Sadhukhan Oracle JDK-8299409 AWT test TestSinhalaChar.java has old SCCS markings
2022/12/27 22:05 nagata.haruhito Fujitsu vikeytk Independent JDK-8299383 Tests may fail with zh locale on MacOS
2022/12/27 21:55 karm Red Hat (same) (same) JDK-8299382 WebSockets: HandshakeUrlEncodingTest unnecessarily depends on a response body
2022/12/27 21:55 karm Red Hat Patrick Concannon Oracle JDK-8299381 WebSocket can lose the URL encoding of URI query parameters
2022/12/26 23:16 Sergey Bylokhov Amazon Philip Race Oracle JDK-8299354 Problem list java/awt/event/KeyEvent/KeyTyped/CtrlASCII.java on Linux
2022/12/23 10:32 Severin Gehwolf Red Hat Sean Mullan Oracle JDK-8299391 Cannot use '-Djava.system.class.loader' with class loader in signed JAR
2022/12/23 08:46 Christoph Langer SAP (same) (same) JDK-8299303 Cygwin's uname -m returns different string than before
2022/12/23 08:28 Christoph Langer SAP Maxim Kartashev JetBrains JDK-8299302 Windows builds in different directories are not fully reproducible
2022/12/23 08:28 Christoph Langer SAP Magnus Ihse Bursie Oracle JDK-8299301 Reproducible builds should turn on the "deterministic" flag for Visual Studio
2022/12/22 10:23 Christoph Langer SAP Magnus Ihse Bursie Oracle JDK-8299265 Start supporting SOURCE_DATE_EPOCH
2022/12/22 08:01 Roman Marchenko Azul Xuelei Fan Tencent JDK-8299257 Use fixed certificate validation date in SSLExampleCert template
2022/12/21 12:56 Matthias Baesken SAP Mikhailo Seledtsov Oracle JDK-8299205 Problemlist several sun/security tests until JDK-8295343 is resolved
2022/12/21 10:57 Roman Marchenko Azul Rajan Halade Oracle JDK-8299197 EndingDotHostname.java test fails because SSL cert expired
2022/12/21 06:31 Denghui Dong Alibaba Koichi Sakata NTT DATA JDK-8299175 jdeprscan --help causes an exception when the locale is ja, zh_CN or de
2022/12/20 10:41 Roman Marchenko Azul Xuelei Fan Tencent JDK-8299084 Trailing dot in hostname causes TLS handshake to fail with SNI disabled
2022/12/20 10:23 Severin Gehwolf Red Hat (same) (same) JDK-8299083 [TESTBUG] TestMemoryAwareness.java fails on cgroups v2 and crun
2022/12/20 08:53 Sergey Bylokhov Amazon (same) (same) JDK-8299081 The crash in XRobotPeer when the custom GraphicsDevice is used
2022/12/20 01:07 Sergey Bylokhov Amazon (same) (same) JDK-8299062 Incorrect size of the pixel storage is used by the robot on macOS
2022/12/19 21:50 Autumn Capasso Amazon Alexander Zuev Oracle JDK-8299046 Create implementation for NSAccessibilityStepper protocol
2022/12/19 09:29 George Adams Microsoft Magnus Ihse Bursie Oracle JDK-8299017 Restore cancel-in-progress in GHA
2022/12/19 09:29 George Adams Microsoft Magnus Ihse Bursie Oracle JDK-8299016 Rewrite of GitHub Actions (GHA) sanity tests
2022/12/19 09:12 Christoph Langer SAP (same) (same) JDK-8299013 Improve handling of macos xcode toolchain
2022/12/19 08:21 Sergey Bylokhov Amazon (same) (same) JDK-8299011 java/lang/String/StringRepeat.java test requests too much heap on windows x86
2022/12/19 08:16 Aleksei Voitylov BellSoft (same) (same) JDK-8299185 8296772 backport to jdk11u caused build error on sparc
2022/12/15 08:23 Richard Reingruber SAP (same) (same) JDK-8298847 frame::interpreter_frame_print_on() crashes if free BasicObjectLock exists in frame
2022/12/15 07:54 Matthias Baesken SAP (same) (same) JDK-8298836 Improve container information
2022/12/15 01:46 Andrew Hughes Red Hat (same) (same) JDK-8299184 (tz) Update Timezone Data to 2022g
2022/12/14 18:58 Pankaj Bansal Oracle (same) (same) JDK-8298795 Create implementation for NSAccessibilityImage protocol peer
2022/12/14 17:10 Christoph Langer SAP (same) (same) JDK-8298792 Fix msys2 linking and handling out of tree build directory for source zip creation
2022/12/14 16:56 Christoph Langer SAP Harold Seigel Oracle JDK-8298791 Test test/hotspot/jtreg/runtime/7162488/TestUnrecognizedVmOption.java fails when -XX:+IgnoreUnrecognizedVMOptions is set
2022/12/14 16:56 Christoph Langer SAP Mikhailo Seledtsov Oracle JDK-8298790 [TESTBUG] rewrite runtime shell tests in java
2022/12/14 16:37 Christoph Langer SAP David Holmes Oracle JDK-8298789 [TESTBUG] java/lang/annotation/loaderLeak/Main.java fails with -Xcomp
2022/12/14 16:37 Christoph Langer SAP Ivan Sipka Oracle JDK-8298788 Refactor LoaderLeak shell test as java test.
2022/12/12 09:25 Sergey Bylokhov Amazon (same) (same) JDK-8298537 Document Filter attached to JPasswordField and setText("") is not cleared instead inserted characters replaced with unicode null characters
2022/12/09 17:36 Christoph Langer SAP Magnus Ihse Bursie Oracle JDK-8298723 JDK build fails with incorrect fixpath script
2022/12/07 09:16 Goetz Lindenmaier SAP (same) (same) JDK-8297257 Bump update version for OpenJDK: jdk-11.0.19

No changesets log

JDK-8304363 Create implementation for NSAccessibilityScrollBar protocol peer

Committer push log

AutumnCapasso, Independent

Bug Summary
JDK-8303595 Create implementation of native accessibility peer for ScrollPane and ScrollBar Java Accessibility roles

Shruthi Acharya, IBM

Bug Summary
JDK-8303200 duplicate property key in java.sql.rowset resource bundle

Andrew Hughes, Red Hat

Bug Summary
JDK-8299184 (tz) Update Timezone Data to 2022g

Autumn Capasso, Amazon

Bug Summary
JDK-8300932 Create implementation for component peer for all the components who should be ignored in a11y interactions
JDK-8300283 Create implementation for NSAccessibilityCheckBox protocol peer
JDK-8299980 Create implementation for NSAccessibilityRadioButton protocol
JDK-8299771 Create implementation for NSAccessibilityStaticText protocol
JDK-8299046 Create implementation for NSAccessibilityStepper protocol

Aleksei Voitylov, BellSoft

Bug Summary
JDK-8299185 8296772 backport to jdk11u caused build error on sparc

Christoph Langer, SAP

Bug Summary
JDK-8300521 [11u] Remove designator DEFAULT_PROMOTED_VERSION_PRE=ea for release 11.0.18

Christoph Langer, SAP

Bug Summary
JDK-8301470 [11u, 17u] Bump jtreg to fix issue with build JDK 11.0.18
JDK-8302903 [11u] Add modified test snippet after backport of JDK-8221871
JDK-8299596 [11u] Remove designator DEFAULT_PROMOTED_VERSION_PRE=ea for release 11.0.19
JDK-8302694 [11u] Update GHA Boot JDK to 11.0.18
JDK-8298789 [TESTBUG] java/lang/annotation/loaderLeak/Main.java fails with -Xcomp
JDK-8298790 [TESTBUG] rewrite runtime shell tests in java
JDK-8302327 building.md should link to both md and html
JDK-8299303 Cygwin's uname -m returns different string than before
JDK-8298792 Fix msys2 linking and handling out of tree build directory for source zip creation
JDK-8299013 Improve handling of macos xcode toolchain
JDK-8302531 Introduce UTIL_ARG_WITH
JDK-8298723 JDK build fails with incorrect fixpath script
JDK-8302532 JDK-8285093 changed the default for --with-output-sync
JDK-8302653 Optionally add get-task-allow entitlement to macos binaries
JDK-8302655 Partially fix string expansion issues in UTIL_DEFUN_NAMED and related macros
JDK-8298788 Refactor LoaderLeak shell test as java test.
JDK-8302533 Remove debug printout from JDK-8285093
JDK-8299301 Reproducible builds should turn on the "deterministic" flag for Visual Studio
JDK-8299265 Start supporting SOURCE_DATE_EPOCH
JDK-8298791 Test test/hotspot/jtreg/runtime/7162488/TestUnrecognizedVmOption.java fails when -XX:+IgnoreUnrecognizedVMOptions is set
JDK-8299302 Windows builds in different directories are not fully reproducible

Denghui Dong, Alibaba

Bug Summary
JDK-8299175 jdeprscan --help causes an exception when the locale is ja, zh_CN or de

Dhamoder Nalla, Microsoft

Bug Summary
JDK-8292863 assert(_print_inlining_stream->size() > 0) failed: missing inlining msg

Elif Aslan, Amazon

Bug Summary
JDK-8301370 TEST_BUG: closed/javax/sound/midi/Synthesizer/Receiver/bug6186488.java fails

Ekaterina Vergizova, Azul

Bug Summary
JDK-8303160 JFR: increase checkpoint event size for stacktrace and string pool
JDK-8302318 Let checkpoint event sizes grow beyond u4 limit

George Adams, Microsoft

Bug Summary
JDK-8299017 Restore cancel-in-progress in GHA
JDK-8299016 Rewrite of GitHub Actions (GHA) sanity tests

Goetz Lindenmaier, SAP

Bug Summary
JDK-8303075 [11u] Add CompileClassWithDebugTest to ProblemList for 8303074
JDK-8302657 [11u] Add missing '(' in makefile after backport of 8218431
JDK-8300424 [11u] Chunk lost in backport of 8297569
JDK-8304389 [11u] Crash on Windows in C2 compiled code after 8248238 and 8218431
JDK-8300695 [17u,11u] Fix DEFAULT_PROMOTED_VERSION_PRE=ea for -dev
JDK-8299457 [macosx] javax/swing/Popup/TaskbarPositionTest.java fails because Popup is one pixel off
JDK-8299590 [sspi] gss_accept_sec_context leaves output_token uninitialized
JDK-8302509 [TEST] develop a test case for SuspendThreadList including current thread
JDK-8299695 [test] java/math/BigInteger/ModPow.java can throw an ArithmeticException
JDK-8300211 [test] java/net/URL/HandlerLoop has illegal reflective access
JDK-8299696 [TESTBUG] assertEquals is invoked with the arguments in the wrong order
JDK-8303197 [TESTBUG] java/awt/print/Dialog/DialogCopies.java does not show instruction
JDK-8302727 [TESTBUG] serviceability/sa/ClhsdbCDSCore.java fails with -XX:TieredStopAtLevel=1
JDK-8303342 Add Certigna Root CA
JDK-8299589 Add ResourceHashtable support for deleting selected entries
JDK-8302504 Add tests for ElementKind predicates
JDK-8301600 Address the inconsistency between the constant array and pool size
JDK-8301048 adjust libsplashscreen linux ppc64le builds for easier libpng update
JDK-8301751 Assert in PhaseIdealLoop::dump_real_LCA is too strong
JDK-8302451 Avoid JVM crash when containers share the same /tmp dir
JDK-8302710 bad test with broken links needs to be updated
JDK-8299698 BootstrapLoggerTest : Executor still alive
JDK-8297257 Bump update version for OpenJDK: jdk-11.0.19
JDK-8299822 C2 compilation fails with assert "non-reduction loop contains reduction nodes"
JDK-8301055 C2 compilation hits "assert((mode == ControlAroundStripMined && use == sfpt) || !use->is_reachable_from_root()) failed: missed a node"
JDK-8299453 C2: assert(C->live_nodes() <= C->max_node_limit()) failed: Live Node limit exceeded limit
JDK-8302510 C2: assert(dead->outcnt() == 0 && !dead->is_top()) failed: node must be dead
JDK-8300278 C2: assert(is_valid_AArch64_address(dest.target())) failed: bad address
JDK-8301056 C2: Cast node is not processed again in CCP and keeps a wrong too narrow type which is later replaced by top
JDK-8301057 C2: Create skeleton predicates for all If nodes in loop predication
JDK-8302078 C2: CreateExNode::Identity fails with assert(i < _max) failed: oob: i=1, _max=1
JDK-8299819 C2: fix and simplify IdealLoopTree::do_remove_empty_loop
JDK-8302578 Change bugs.java.com and bugreport.java.com URL's to https
JDK-8301598 Change java/util/zip/ZipFile/DeleteTempJar.java to stop HttpServer cleanly in case of exceptions
JDK-8301052 CloneableReference subtest should not throw CloneNotSupportedException
JDK-8303459 code cleanup in SSLContextImpl.java
JDK-8303196 compiler/ciReplay/TestVMNoCompLevel.java fails due to wrong data size with TieredStopAtLevel=2,3
JDK-8303195 compiler/cpuflags/TestSSE4Disabled.java should test for CPU feature explicitly
JDK-8302726 compiler/whitebox/BlockingCompilation.java timed out
JDK-8302081 CompressedClassSpaceSizeInJmapHeap.java time out after 8 minutes
JDK-8299588 Deadlock in libj2gss.so when loading "j2gss" and "net" libraries in parallel.
JDK-8302201 Exclude linux-aarch64 in NSS tests
JDK-8303191 fix missing newlines at end of files
JDK-8302079 gc/metaspace/CompressedClassSpaceSizeInJmapHeap.java causes test task timeout on macosx
JDK-8302714 gc/stress/gclocker/TestExcessGCLockerCollections.java does not compile
JDK-8301847 Improved platform checking in makefiles
JDK-8302719 Introduce Utils.TEST_NATIVE_PATH
JDK-8299655 ISO 4217 Amendment 174 Update
JDK-8299455 java.sun.awt.X11GraphicsDevice.getDoubleBufferVisuals() leaks XdbeScreenVisualInfo
JDK-8303341 java/net/httpclient/ConnectExceptionTest.java should not rely on system resolver
JDK-8302075 java/net/httpclient/ServerCloseTest.java failed once with ConnectException
JDK-8302505 java/net/Socket/LingerTest.java and java/net/Socket/ShutdownBoth.java timeout intermittently
JDK-8302643 java/net/URLConnection/ResendPostBody.java failed with "Error while cleaning up threads after test"
JDK-8302725 java/nio/channels/DatagramChannel/SRTest.java fails intermittently
JDK-8300529 java/nio/file/Files/probeContentType/Basic.java fails on Windows 11
JDK-8299814 java/text/Format/NumberFormat/CurrencyFormat.java fails for hr_HR
JDK-8303339 java/util/concurrent/atomic/Serial.java uses {Double,Long}Accumulator incorrectly
JDK-8302506 java/util/concurrent/BlockingQueue/DrainToFails.java testBounded fails intermittently
JDK-8302500 java/util/concurrent/CountDownLatch/Basic.java failed w/ Xcomp
JDK-8302713 java/util/concurrent/CountDownLatch/Basic.java fails
JDK-8300276 java/util/logging/CheckZombieLockTest.java failing intermittently
JDK-8299697 java/util/logging/LogManager/Configuration/updateConfiguration/HandlersOnComplexResetUpdate.java fails with Unexpected reference: java.lang.ref.WeakReference
JDK-8303333 javax/xml/crypto/dsig/LogParameters.java failed with "RuntimeException: Unexpected log output:"
JDK-8303338 jdk/java/lang/ProcessBuilder/Basic.java fails on AIX
JDK-8302715 jdk/lambda/vm/StrictfpDefault.java file can be removed
JDK-8302724 jdk/test/jdk/java/util/prefs/ExportNode.java relies on default platform encoding
JDK-8299448 JGSS: Fix cut/paste error in NativeUtil.c
JDK-8299449 JGSS: Fix leak in exception cases in getJavaOID()
JDK-8299456 JNI exception pending in awt_GraphicsEnv.c:1432
JDK-8302507 jvmti/scenarios/contention/TC04/tc04t001/TestDescription.java fails due to wrong number of MonitorContendedEntered events
JDK-8302642 jvmti/scenarios/contention/TC04/tc04t001/TestDescription.java fails on jvmti->InterruptThread (JVMTI_ERROR_THREAD_NOT_ALIVE)
JDK-8302641 jvmti/scenarios/contention/TC04/tc04t001/TestDescription.java still fails due to wrong number of MonitorContendedEntered events
JDK-8302722 MakeMethodNotCompilableTest fails with -XX:TieredStopAtLevel={1,2,3}
JDK-8301330 maxOutputSize, instead of javatest.maxOutputSize, should be used in TEST.properties
JDK-8302331 Modify TextAreaTextEventTest.java as to verify the content change of TextComponent sends TextEvent
JDK-8299454 NMT: Correct NMT tag on CollectedHeap
JDK-8303335 ProblemList 7 serviceability/sa tests on macosx-x64
JDK-8299815 ProblemList java/text/Format/NumberFormat/CurrencyFormat.java
JDK-8303336 ProblemList runtime/jni/checked/TestPrimitiveArrayCriticalWithBadParam.java on macosx-x64
JDK-8302638 Reduce incidence of compiler.warn.source.no.bootclasspath in javac tests
JDK-8302647 Refactor shell test javax/xml/jaxp/common/8035437/run.sh to java
JDK-8302721 Refactor UncaughtExceptions shell test as java test.
JDK-8301049 Reference discovery is confused about atomicity and degree of parallelism
JDK-8303557 Remove SSLv2Hello and SSLv3 from default enabled TLS protocols
JDK-8302585 Rendering Issues with Borders on Windows High-DPI systems
JDK-8302640 Replace wildcard address with loopback or local host in tests - part 2
JDK-8302503 Run java/net/URL/HandlerLoop.java in othervm mode
JDK-8299452 SA tests fail with "Windbg Error: ReadVirtual failed"
JDK-8303337 serviceability/sa/ClhsdbScanOops.java can fail due to unexpected GC
JDK-8302645 serviceability/tmtools/jstat tests times out with -Xcomp
JDK-8300216 SIGSEGV in PhaseIdealLoop::build_loop_late_post_work
JDK-8302646 SourcePositions are wrong for Strings concatenated with '+' operator
JDK-8301583 Split up MakeBase.gmk
JDK-8302076 sspi_bridge.dll not built if BUILD_CRYPTO is false
JDK-8302330 sun/net/www/http/HttpClient/MultiThreadTest.java should be more resilient to unexpected traffic
JDK-8302712 sun/net/www/protocol/file/DirPermissionDenied.java failed on Windows 2016 because DirPermissionDenied directory has no read permission
JDK-8302499 sun/net/www/protocol/http/ProtocolRedirect.java failed with "java.net.ConnectException"
JDK-8302502 sun/net/www/protocol/http/StackTraceTest.java fails intermittently with Invalid Http response
JDK-8303340 sun/security/pkcs11/Signature/TestDSAKeyLength.java fails when NSS version detection fails
JDK-8302723 sun/util/resources/cldr/TimeZoneNamesTest.java timed out
JDK-8299824 support latest VS2022 MSC_VER in abstract_vm_version.cpp
JDK-8303194 Test image build failure with clang-10 due to -Wmisleading-indentation
JDK-8301596 Test to cover CodeSource.getCodeSigners()
JDK-8299694 test/jdk/java/nio/file/DirectoryStream/Basic.java not correct when using a glob
JDK-8303460 test/jdk/java/nio/file/Files/probeContentType/Basic.java fails on some systems for the ".rar" extension
JDK-8302579 The left line of the TitledBorder is not painted on 150 scale factor
JDK-8302728 Tier1 validate-source fails after 8279614
JDK-8302720 Typo in compiler/runtime/safepoints/TestRegisterRestoring.java
JDK-8300212 Update IANA Language Subtag Registry to Version 2022-03-02
JDK-8301054 Update IANA Language Subtag Registry to Version 2022-08-08
JDK-8300530 Update LCMS to 2.14
JDK-8301331 Update Libpng to 1.6.38
JDK-8300532 Upgrade jQuery to 3.6.1
JDK-8300217 URLPermission constructor exception when using tr locale
JDK-8300223 URLPermission constructor throws IllegalArgumentException: Invalid characters in hostname after JDK-8294378
JDK-8300224 Use 64bit atomics in patch_verified_entry on x86_64
JDK-8303226 use Utils.TEST_NATIVE_PATH instead of System.getProperty("test.nativepath")
JDK-8300232 vmTestbase/nsk/jdi/ThreadStartEvent/thread/thread001 failed due to SocketTimeoutException
JDK-8302286 Write a test to verify List sends ItemEvent/ActionEvent

Ichiroh Takiguchi, IBM

Bug Summary
JDK-8301817 CustomTzIDCheckDST.java may fail at future date

Joshua Cao, Amazon

Bug Summary
JDK-8299704 Crash in KlassFactory::check_shared_class_file_load_hook
JDK-8299551 FindTests.gmk cannot handle "=" in TEST.groups comments

karm, Red Hat

Bug Summary
JDK-8299381 WebSocket can lose the URL encoding of URI query parameters
JDK-8299382 WebSockets: HandshakeUrlEncodingTest unnecessarily depends on a response body

Kimura Yukihiro, Fujitsu

Bug Summary
JDK-8300742 jstat's CGCT is 5 percent higher than the pause time in -Xlog:gc.

Kumar Srinivasan, VMWare

Bug Summary
JDK-8302000 [11u] A subtle race condition during jdk11u build
JDK-8303592 Test generation scripts do not invoke stream preprocessor correctly

Lance Andersen, Oracle

Bug Summary
JDK-8303583 Update Zlib Data Compression Library to Version 1.2.13

Matthias Baesken, SAP

Bug Summary
JDK-8301579 Add cause in a couple of IllegalArgumentException and InvalidParameterException shown by sun/security/pkcs11 tests
JDK-8300105 fix 2 compiler tests to avoid JDK-8208690
JDK-8300442 GetPrimitiveArrayCritical in imageioJPEG misses result - NULL check
JDK-8300443 improve cleanup and error handling of awt_parseColorModel in awt_parseImage.c
JDK-8298836 Improve container information
JDK-8299205 Problemlist several sun/security tests until JDK-8295343 is resolved
JDK-8303521 TestPrintXML.java output error messages in case compare fails

Masanori Yano, Fujitsu

Bug Summary
JDK-8301196 [macosx] test java/awt/Frame/ShapeNotSetSometimes/ShapeNotSetSometimes.java fails (again)

nagata.haruhito, Fujitsu

Bug Summary
JDK-8299383 Tests may fail with zh locale on MacOS

Pankaj Bansal, Oracle

Bug Summary
JDK-8298795 Create implementation for NSAccessibilityImage protocol peer

Roman Marchenko, Azul

Bug Summary
JDK-8299445 EndingDotHostname.java fails because of compilation errors
JDK-8299197 EndingDotHostname.java test fails because SSL cert expired
JDK-8299084 Trailing dot in hostname causes TLS handshake to fail with SNI disabled
JDK-8299257 Use fixed certificate validation date in SSLExampleCert template

Richard Reingruber, SAP

Bug Summary
JDK-8298847 frame::interpreter_frame_print_on() crashes if free BasicObjectLock exists in frame

Sergey Bylokhov, Amazon

Bug Summary
JDK-8299409 AWT test TestSinhalaChar.java has old SCCS markings
JDK-8300174 Compilation of gtest causes build to fail if runtime libraries are in different dirs
JDK-8301259 Disable an assertion in test/jdk/java/util/DoubleStreamSums/CompensatedSums.java
JDK-8298537 Document Filter attached to JPasswordField and setText("") is not cleared instead inserted characters replaced with unicode null characters
JDK-8299062 Incorrect size of the pixel storage is used by the robot on macOS
JDK-8299011 java/lang/String/StringRepeat.java test requests too much heap on windows x86
JDK-8301158 Missing comma in copyright header
JDK-8299418 Opensource unit/regression tests for CMM
JDK-8299354 Problem list java/awt/event/KeyEvent/KeyTyped/CtrlASCII.java on Linux
JDK-8301258 Regression test java/awt/font/TextLayout/CombiningPerf.java fails
JDK-8299410 Remove SCCS id's from awt jtreg tests
JDK-8301105 sRGB-ColorSpace to sRGB-ColorSpace Conversion
JDK-8299081 The crash in XRobotPeer when the custom GraphicsDevice is used
JDK-8301826 The sun/awt/shell/FileSystemViewMemoryLeak.java is unstable
JDK-8299420 Update ProblemList after verification of jtreg tests in Win 7

Severin Gehwolf, Red Hat

Bug Summary
JDK-8299083 [TESTBUG] TestMemoryAwareness.java fails on cgroups v2 and crun
JDK-8299869 Add a regression test for JDK-8297684
JDK-8299391 Cannot use '-Djava.system.class.loader' with class loader in signed JAR
JDK-8301062 CgroupMetrics.getTotalMemorySize0() can report invalid results on 32 bit systems
JDK-8300293 Fix autoconf 2.71 warning "AC_CHECK_HEADERS: you should use literals"
JDK-8299871 java/security/SignedJar/spi-calendar-provider/TestSPISigned.java failing on Windows

Aleksey Shipilev, Amazon

Bug Summary
JDK-8299616 [11u] Bootcycle build fails after JDK-8257679 backport

Thomas Stuefe, Red Hat

Bug Summary
JDK-8302675 Add pid to process reaper thread name

Victor Rudometov, Amazon

Bug Summary
JDK-8301172 File.listRoots performance degradation
JDK-8301802 Write a test to verify the components selection sends ItemEvent

Yuri Nesterenko, Azul

Bug Summary
JDK-8302194 Fix possible leak in SpNegoContext dispose