PUSHES REPORT: 11.0.2

This report shows who pushed the backports to the given release. This usually shows who did the backporting, testing, and review work.

Report generated: Wed Sep 01 03:17:35 CEST 2021

Distribution by priority

Count Priority
1 P1
19 P2
32 P3
40 P4

Distribution by components

Count Component
92 Total
41 (44.6%) hotspot
18 (19.6%) hotspot/compiler
12 (13.0%) hotspot/runtime
3 (3.3%) hotspot/jvmti
3 (3.3%) hotspot/svc-agent
3 (3.3%) hotspot/gc
1 (1.1%) hotspot/jfr
1 (1.1%) hotspot
14 (15.2%) security-libs
7 (7.6%) security-libs/javax.net.ssl
4 (4.3%) security-libs/javax.crypto
2 (2.2%) security-libs/javax.xml.crypto
1 (1.1%) security-libs/java.security
13 (14.1%) core-libs
4 (4.3%) core-libs/java.net
4 (4.3%) core-libs/java.util:i18n
1 (1.1%) core-libs
1 (1.1%) core-libs/java.io
1 (1.1%) core-libs/java.nio.charsets
1 (1.1%) core-libs/javax.naming
1 (1.1%) core-libs/java.util.jar
10 (10.9%) client-libs
4 (4.3%) client-libs/java.awt
3 (3.3%) client-libs/javax.swing
2 (2.2%) client-libs/2d
1 (1.1%) client-libs/javax.sound
7 (7.6%) infrastructure
7 (7.6%) infrastructure/build
3 (3.3%) tools
1 (1.1%) tools/javadoc(tool)
1 (1.1%) tools/launcher
1 (1.1%) tools
2 (2.2%) core-svc
2 (2.2%) core-svc/java.lang.management
1 (1.1%) globalization
1 (1.1%) globalization/translation
1 (1.1%) xml
1 (1.1%) xml/javax.xml.stream

Distribution by affiliation

Count Committer
92 Total
48 (52.2%) Oracle
9 (9.8%) Sean Coffey
7 (7.6%) Robert Mckenna
5 (5.4%) Vladimir Kozlov
5 (5.4%) Jamil Nimeh
4 (4.3%) Michael McMahon
3 (3.3%) Frank Yuan
3 (3.3%) Kevin Walls
2 (2.2%) David Holmes
2 (2.2%) Mandy Chung
2 (2.2%) Manajit Halder
2 (2.2%) Dmitry Markov
1 (1.1%) Henry Jen
1 (1.1%) Prasanta Sadhukhan
1 (1.1%) Aleksej Efimov
1 (1.1%) Coleen Phillimore
20 (21.7%) SAP
12 (13.0%) Martin Doerr
8 (8.7%) Goetz Lindenmaier
18 (19.6%) Red Hat
10 (10.9%) Severin Gehwolf
6 (6.5%) Aleksey Shipilev
1 (1.1%) Andrew Dinn
1 (1.1%) Roland Westrelin
2 (2.2%) Amazon
2 (2.2%) Sergey Bylokhov
2 (2.2%) Google
1 (1.1%) Martin Buchholz
1 (1.1%) Jiangli Zhou
2 (2.2%) Independent
1 (1.1%) Laurent Bourgès
1 (1.1%) Nishit Jain

Chronological push log:

Days Ago Committer Affiliation Bug Summary
1029 Sean Coffey Oracle JDK-8212172 jdk/javax/xml/crypto/dsig/GenerationTests.java timed out
1037 Martin Doerr SAP JDK-8213081 inspect stack during error reporting
1037 Martin Doerr SAP JDK-8213080 Zero builds fail after JDK-8207343 (Automate vtable/itable stub size calculation)
1037 Martin Doerr SAP JDK-8213079 Minimal and Zero non-PCH builds fail after JDK-8207343 (Automate vtable/itable stub size calculation)
1037 Martin Doerr SAP JDK-8213078 Automate vtable/itable stub size calculation
1039 Vladimir Kozlov Oracle JDK-8213068 Minimal VM build failures after JDK-8211251 (Default mask register for avx512 instructions)
1039 Vladimir Kozlov Oracle JDK-8213067 x86_32 build failures after JDK-8210764 (Update avx512 implementation)
1039 Vladimir Kozlov Oracle JDK-8213066 Default mask register for avx512 instructions
1039 Vladimir Kozlov Oracle JDK-8213065 Update avx512 implementation
1040 Sergey Bylokhov Amazon JDK-8213064 Swing apps are slow if displaying from a remote source to many local displays
1040 Sergey Bylokhov Amazon JDK-8213063 Clip.isRunning() may return true after Clip.stop() was called
1040 Mandy Chung Oracle JDK-8213062 ThreadInfoCompositeData.toCompositeData fails to map ThreadInfo to CompositeData
1040 Kevin Walls Oracle JDK-8213042 Need to update vm_version.cpp to recognise VS2017 minor versions
1040 Kevin Walls Oracle JDK-8213041 HotSpot vm_version.cpp should recognise updated VS2017
1040 Kevin Walls Oracle JDK-8213040 "-XX:OnOutOfMemoryError" uses fork instead of vfork
1041 Michael McMahon Oracle JDK-8212927 HttpClient does not retrieve files with large sizes over HTTP/1.1
1042 Aleksej Efimov Oracle JDK-8212746 TimeZone.getDisplayName given Locale.US doesn't always honor the Locale
1042 Martin Doerr SAP JDK-8212924 [s390]: Use of shift operators not covered by cpp standard
1042 Martin Doerr SAP JDK-8212923 SIGBUS in CodeHeapState::print_names()
1042 Martin Doerr SAP JDK-8212922 SIGSEGV in MethodArityHistogram() with -XX:+CountCompiledCalls
1042 Aleksey Shipilev Red Hat JDK-8212917 Build failure: undefined JvmtiSampledObjectAllocEventCollector::object_alloc_is_safe_to_sample
1042 Michael McMahon Oracle JDK-8211445 java.net.http.HttpClient hangs on 204 reply without Content-length 0
1042 Michael McMahon Oracle JDK-8212693 com.sun.net.httpserver.HttpServer returns Content-length header for 204 response code
1044 Jamil Nimeh Oracle JDK-8212789 TLS 1.3 handshake server name indication is missing on a session resume
1044 Michael McMahon Oracle JDK-8212692 java.net.http HTTP client should allow specifying Origin and Referer headers
1047 Robert Mckenna Oracle JDK-8211839 java.nio.file.Files.writeString writes garbled UTF-16 instead of UTF-8
1047 Martin Doerr SAP JDK-8212690 print_location is not reliable enough (printing register info)
1047 Aleksey Shipilev Red Hat JDK-8212689 Tests fail with assert(VM_Version::supports_sse4_1()) on ThreadRipper CPU
1047 Aleksey Shipilev Red Hat JDK-8212688 BarrierSetC1::generate_referent_check() confuses register allocator
1047 Aleksey Shipilev Red Hat JDK-8212687 Epsilon alignment adjustments can overflow max TLAB size
1047 Aleksey Shipilev Red Hat JDK-8212686 Epsilon elastic TLAB sizing may cause misalignment
1047 Aleksey Shipilev Red Hat JDK-8212685 Soft reference reclamation race in com.sun.xml.internal.stream.util.ThreadLocalBufferAllocator
1048 Mandy Chung Oracle JDK-8212674 OpenDataException thrown when constructing CompositeData for StackTraceElement
1048 David Holmes Oracle JDK-8212671 JDWP Transport Listener: dt_socket thread crash
1048 Severin Gehwolf Red Hat JDK-8212668 [x86] sharedRuntimeTrig/sharedRuntimeTrans compiled without optimization
1048 Severin Gehwolf Red Hat JDK-8212667 [linux] Poor StrictMath performance due to non-optimized compilation
1048 Martin Doerr SAP JDK-8212661 add more ld preloading info to hs_error file on Linux
1048 Manajit Halder Oracle JDK-8212644 Instead of circle rendered in appl window, but ellipse is produced JEditor Pane
1049 Jamil Nimeh Oracle JDK-8212599 Add test to exercise server-side client hello processing
1049 Jamil Nimeh Oracle JDK-8210445 TLS 1.3 server fails if ClientHello doesn't have pre_shared_key and psk_key_exchange_modes
1050 Jiangli Zhou Google JDK-8212100 AppCDS crashes for some uses with JRuby
1050 Robert Mckenna Oracle JDK-8212274 Restrict the use of EXPORT cipher suites
1050 Robert Mckenna Oracle JDK-8211430 LDAPS communication failure with jdk 1.8.0_181
1050 Robert Mckenna Oracle JDK-8210581 The Japanese message of FileNotFoundException garbled.
1050 Robert Mckenna Oracle JDK-8210468 Add additional TeliaSonera root certificate
1050 Robert Mckenna Oracle JDK-8209884 Disable all DES cipher suites
1050 Robert Mckenna Oracle JDK-8208447 JDK 11 L10n resource file update - msg drop 10
1050 Vladimir Kozlov Oracle JDK-8212204 [TESTBUG] test/hotspot/jtreg/compiler/intrinsics/base64/TestBase64.java fails
1050 Roland Westrelin Red Hat JDK-8212239 assert failure in coalesce.cpp: attempted to spill a non-spillable item
1050 Sean Coffey Oracle JDK-8212238 CipherCore performance improvement
1050 Sean Coffey Oracle JDK-8212237 Further improvements to cipher buffer management
1050 Sean Coffey Oracle JDK-8212236 Better management of CipherCore buffers
1050 Sean Coffey Oracle JDK-8212235 Better management of internal KeyStore buffers
1050 Manajit Halder Oracle JDK-8212007 [macosx] Cycling through windows (JFrames) does not work with keyboard shortcut
1050 Severin Gehwolf Red Hat JDK-8212231 Build of saproc.dll broken on Windows 32 bit after JDK-8210647
1050 Dmitry Markov Oracle JDK-8212230 OS X: requestFocus() does not work properly for embedded frame
1050 Dmitry Markov Oracle JDK-8212229 OS X: keyboard input in textfield is not possible if the window contained textfield is owned by EmbeddedFrame
1050 Nishit Jain Independent JDK-8211916 Javadoc -link makes broken links if module name matches package name
1051 Coleen Phillimore Oracle JDK-8212203 RedefineStress tests crash
1051 Goetz Lindenmaier SAP JDK-8212176 [ppc, s390] ProblemList some failing tests.
1051 Goetz Lindenmaier SAP JDK-8211421 serviceability/sa/TestJmapCore.java times out parsing a 4GB hprof file
1053 Laurent Bourgès Independent JDK-8212118 Clipping problems with complex affine transforms: negative scaling factors or small scaling factors
1054 Martin Buchholz Google JDK-8212140 Malayalam glyph substitution is failing for Malayalam with Windows Kartika font.
1054 Sean Coffey Oracle JDK-8211730 jdk/javax/xml/crypto/dsig/GenerationTests.java slow on linux
1054 Henry Jen Oracle JDK-8212126 Escaped character at specific position in argument file is not handled properly
1054 Prasanta Sadhukhan Oracle JDK-8212123 [macos] Problem with input of yen symbol
1054 Goetz Lindenmaier SAP JDK-8212121 [s390] Implement JFR profiling.
1054 Severin Gehwolf Red Hat JDK-8212113 No debug info for assembler files
1054 Frank Yuan Oracle JDK-8212105 localized currency symbol of VES
1054 Frank Yuan Oracle JDK-8212104 ISO 4217 Amendment #169 Update
1054 Frank Yuan Oracle JDK-8212103 ISO 4217 Amendment #168 Update
1054 Goetz Lindenmaier SAP JDK-8212101 Some intrinsic tests take long time to run
1055 David Holmes Oracle JDK-8212085 Private method check in linkResolver is incorrect
1055 Sean Coffey Oracle JDK-8212073 JarEntry.setCreation/LastAccessTime without setLastModifiedTime causes Invalid CEN header
1055 Sean Coffey Oracle JDK-8212072 JVM TI Spec missing copyright
1055 Sean Coffey Oracle JDK-8210657 jdeps does not handle properly on analyzing a mixture of MR JARs and non-MR JARs
1055 Severin Gehwolf Red Hat JDK-8212069 vmStructs.cpp compiled with -O0
1055 Severin Gehwolf Red Hat JDK-8212068 [Zero] atomic_copy64: Use ldrexd for atomic reads on ARMv7
1055 Severin Gehwolf Red Hat JDK-8212067 SA: jhsdb jstack --mixed throws UnmappedAddressException on i686
1055 Severin Gehwolf Red Hat JDK-8212066 libjsig is being compiled without optimization
1055 Severin Gehwolf Red Hat JDK-8212065 Build fails with warn_unused_result in openjdk/src/jdk.hotspot.agent/linux/native/libsaproc/ps_core.c
1055 Severin Gehwolf Red Hat JDK-8212064 libsaproc is being compiled without optimization
1055 Martin Doerr SAP JDK-8212058 make AllocateHeapAt an unsupported option on AIX
1055 Martin Doerr SAP JDK-8212052 [epsilon] range function for EpsilonTLABElasticity causes compiler warning
1061 Goetz Lindenmaier SAP JDK-8211757 [PPC64] Fix JFR profiling.
1061 Goetz Lindenmaier SAP JDK-8211753 [TESTBUG] javax/swing/plaf/basic/BasicGraphicsUtils/8132119/bug8132119.java fails on machines without Arial font
1062 Martin Doerr SAP JDK-8211721 [PPC64] Vector registers not saved across safepoint
1064 Goetz Lindenmaier SAP JDK-8211370 JDK12 fails to build on s390x with gcc 7.3
1070 Andrew Dinn Red Hat JDK-8211105 AArch64: Disable cos/sin and log intrinsics in jdk11u pending fix
1071 Goetz Lindenmaier SAP JDK-8211095 [testbug] IncompatibleOptions.java fails if VM configured without ZGC
1075 Jamil Nimeh Oracle JDK-8211041 TLSv.1.3 interop problems with OpenSSL 1.1.1 when used on the client side with mutual auth
1075 Jamil Nimeh Oracle JDK-8211040 NPE in SupportedGroupsExtension

No changesets log

JDK-8221679 Exception in thread "AWT-EventQueue-1" java.lang.IllegalArgumentException: null source
JDK-8221678 AWT hang occurs when sequenced events arrive out of sequence in multiple AppContexts.
JDK-8221427 Problems with AES-GCM native acceleration
JDK-8221426 -Xlog option usage => Invalid decorator '\temp\app_cds.log'.
JDK-8221425 X25519/X448 code improvements
JDK-8221424 Encryption using GCM results in RuntimeException: input length out of bound
JDK-8221423 ECC Field Arithmetic Enhancements
JDK-8221422 Allow the addition of more number to the Java version string
JDK-8221421 Crash in C2 compiled code during execution of double array heavy processing code
JDK-8221420 AssertionError in DeferredAttr at setOverloadKind caused by JDK-8203679
JDK-8221418 JarFile constructor throws undocumented java.nio.file.InvalidPathException
JDK-8221417 Crypto AES/ECB encryption/decryption performance regression (introduced in jdk9b73)
JDK-8221416 c.s.t.javac.code.DeferredCompletionFailureHandler seems to use WeakHashMap incorrectly
JDK-8219071 Release Note: GTK+ 3.20 and Later Unsupported by Swing
JDK-8217247 JAVA_VERSION_DATE="2018-10-16" even though release was 2019-01-15
JDK-8215135 IIOException "tEXt chunk length is not proper" on opening png file
JDK-8214735 Create test to cover JDK-8205330 InitialDirContext ctor sometimes throws NPE if the server has sent a disconnection
JDK-8214734 InitialDirContext ctor sometimes throws NPE if the server has sent a disconnection
JDK-8214379 Populate handlers while holding streamHandlerLock
JDK-8214378 URLStreamHandler initialization race
JDK-8214320 The "supported_groups" extension in ServerHellos
JDK-8214319 Update test certificates in QuoVadisCA.java test
JDK-8214318 (tz) Upgrade time-zone data to tzdata2018g
JDK-8214147 Release Note: Disabled TLS anon and NULL Cipher Suites
JDK-8213816 Disable anon and NULL cipher suites
JDK-8212838 jnlp element not corectly parsed.
JDK-8212641 Add Entrust root certificates
JDK-8211237 Oracle JDK builds for "11.0.1" should indicate they are "LTS"
JDK-8211128 [Linux] JDK 11, warning when uninstall rpm package "warning: %postun(jdk-11-2000:11-ga.x86_64) scriptlet failed, exit status 2
JDK-8210086 API docs should be updated to refer to javase11
JDK-8210085 SSLEngine negotiation fail exception behavior changed from fail-fast to fail-lazy
JDK-8210084 AArch64: Float registers incorrectly restored in JNI call
JDK-8210083 CompilerThread releasing code buffer in destructor is unsafe
JDK-8210082 [s390x] Interpreter doesn't call result handler after native calls
JDK-8210081 Disable avx512 by default
JDK-8209723 HttpClient response without content-length does not return body
JDK-8209722 Two security tests failed after JDK-8164639 due to dependency was missed
JDK-8209721 Configure PKCS11 tests to use user-supplied NSS libraries
JDK-8209720 C2: Lucene crashes on AVX512 instruction
JDK-8209718 Add Google Trust Services GlobalSign root certificates
JDK-8209717 [a11y] [macos] Unable to navigate between Radiobuttons in Radio group using keyboard.
JDK-8209716 VerifyCACerts.java failed with "At least one cacert test failed"
JDK-8209715 TimeoutHandler generates huge core files
JDK-8209714 [Graal] gc/TestNUMAPageSize.java fail with OOM in -Xcomp
JDK-8209713 Cannot input text into JOptionPane Text Input Dialog
JDK-8209706 Remove the temporary tls13VN field
JDK-8209705 TLS 1.3 half-close and synchronization issues
JDK-8209703 New TLS 1.3 standard names
JDK-8209225 Differentiate response and connect timeouts in HTTP Client API
JDK-8209223 [TESTBUG] runtime/RedefineTests/RedefineRunningMethods.java needs a longer timeout
JDK-8209222 [TESTBUG] AArch64: sun/security/pkcs11/Secmod/TestNssDbSqlite.java fails in aarch64 platforms
JDK-8209221 Missing NULL check and resource leak in NetworkPerformanceInterface::NetworkPerformance::network_utilization
JDK-8209220 JDK 11 L10n resource file update - msg drop 20
JDK-8209219 Update java.se module summary to reflect removal of java.se.ee module
JDK-8209218 [TESTBUG] Add a regression test for JDK-8026328
JDK-8209217 Tighten up jdk.includeInExceptions security property
JDK-8209216 [TESTBUG] hotspot/test/compiler/whitebox/IsMethodCompilableTest.java test fails with -XX:CompileThreshold=1
JDK-8209215 ProblemList tests that fail due to 'Error attaching to process: Can't create thread_db agent!' in jdk-11+25 testing
JDK-8209214 New Test to verify concurrent behavior of TLS.
JDK-8209213 C1 compilation hangs in ComputeLinearScanOrder::compute_dominator
JDK-8209212 [Testbug] compiler/linkage/LinkageErrors.java fails if run twice
JDK-8209211 NMT is not enabled on Windows 2016/10
JDK-8209210 Colors with alpha are painted incorrectly on Linux
JDK-8209209 Upgrade JDK to libpng 1.6.35
JDK-8209208 Fix potential memory leak in harfbuzz shaping.
JDK-8209207 arm32 vm crash: C1 arm32 platform functions parameters type mismatch
JDK-8209206 ProblemList compiler/cpuflags/TestAESIntrinsicsOnSupportedConfig.java
JDK-8209205 ProblemList more tests that fail due to 'Error attaching to process: Can't create thread_db agent!'
JDK-8208455 fix typo in ReservedStack tests' @requires
JDK-8208454 java.lang.ClassFormatError: Extra bytes at the end of class file test" possibly violation of JVMS 4.7.1
JDK-8208453 serviceability/jvmti/HeapMonitor/MyPackage/HeapMonitorGCCMSTest.java fails intermittently on Linux-X64
JDK-8208452 [Graal] serviceability/jvmti/GetModulesInfo/JvmtiGetAllModulesTest.java fails with Graal in Xcomp mode
JDK-8208451 ProblemList compiler/jvmci/compilerToVM/GetFlagValueTest.java
JDK-8208450 (str) improve specification of String::lines
JDK-8208449 Fix 'frames()' in ThreadReferenceImpl.c to prevent quadratic runtime behavior
JDK-8208448 java/util/TimeZone/Bug8149452.java failed on de_DE and ja_JP locale.
JDK-8208446 [Test Error] sun/security/pkcs11 tests fail if NSS libs not found
JDK-8208445 Still unable to use custom SSLEngine with default TrustManagerFactory after JDK-8207029
JDK-8208444 ProblemList com/sun/jdi/BasicJDWPConnectionTest.java
JDK-8208442 ProblemList tests that fail due to 'Error attaching to process: Can't create thread_db agent!'
JDK-8208441 SSLSocket#setEnabledCipherSuites is accepting empty string
JDK-8208440 ProblemList compiler/graalunit/JttThreadsTest.java
JDK-8208439 Update build documentation to reflect compiler upgrades at Oracle
JDK-8208438 Generalize the jdk.net.includeInExceptions security property
JDK-8208437 Quarantine vmTestbase/nsk/jvmti/RedefineClasses/StressRedefineWithoutBytecodeCorruption/TestDescription.java
JDK-8208436 [PPC64] Implement JFR profiling.
JDK-8208435 Non-negative WINDOW_UPDATE increments may leave the stream window size negative
JDK-8208434 The initial value of SETTINGS_MAX_CONCURRENT_STREAMS should have no limit
JDK-8208433 Problem list java/nio/channels/Selector/RacyDeregister.java
JDK-8208432 Signature#getParameters for RSASSA-PSS throws ProviderException when not initialized
JDK-8208431 [Graal] SelfChangedCDS.java fails with "guarantee(disp == (intptr_t)(jint)disp) failed: must be 32-bit offset"
JDK-8208430 ProblemList serviceability/sa/ClhsdbCDSCore.java
JDK-8208429 JImageListTest.java failed in Windows
JDK-8208428 UseNUMA memory interleaving vs membind
JDK-8208427 C1 still does eden allocations when TLAB is enabled
JDK-8208426 Problem-list 3 sctp tests
JDK-8208424 RMI activation tests fail with InvalidClassException
JDK-8208423 compiler/graalunit/PhasesCommonTest.java fails with java.lang.Error: TESTBUG: no tests found for prefix org.graalvm.compiler.phases.common.test
JDK-8208422 [AOT] jaotc w/ '--ignore-errors' should ignore illegal class files
JDK-8208421 Java does not set the default format locale correctly on mac10.13
JDK-8208419 [aix] disable jfr in build and tests
JDK-8208418 [testbug] Adapt tests for Aix.
JDK-8208417 update bug ids mentioned in tests
JDK-8208413 Remove cacerts.internal from Oracle JDK
JDK-8208411 SSL Handshake failures are reported with more generic SSLException
JDK-8208408 Make man pages optional
JDK-8208016 [Graal] org.graalvm.compiler.debug.test.DebugContextTest fails with java.util.ServiceConfigurationError
JDK-8208015 java/nio/channels/Selector/SelectWithConsumer.java testCancel() fails intermittently
JDK-8208014 HeapMonitorStatIntervalTest.java fails with ZGC
JDK-8208013 java/nio/channels/Selector/SelectWithConsumer.java testInterruptDuringSelect() fails intermittently
JDK-8208012 Epsilon GC to support object pinning
JDK-8208011 Fix translation filtering to also support zh_HK and zh_TW
JDK-8208010 [AOT] we should check that VM uses the same GC as one used for AOT library generation.
JDK-8208009 ARM32: ShouldNotReachHere assertion on Test8168712 jtreg test
JDK-8208008 [TESTBUG] docker jtreg tests fail on systems without cpuset.effective_cpus / cpuset.effective_mems
JDK-8208007 Problem list serviceability/jvmti/HeapMonitor/MyPackage/HeapMonitorStatRateTest.java
JDK-8208006 Problem list several rmi tests
JDK-8208004 Split compiler/graalunit/JttReflectFTest.java
JDK-8208003 jtreg: Fix failing TestRTMAbortRatio on PPC64
JDK-8208002 jtreg: Fix failing TestRTMSpinLoopCount on PPC64
JDK-8208001 PPC64: RTM: Fix counter for aborts on nested transactions
JDK-8208000 PPC64: RTM: Fix abort on native calls
JDK-8207999 PPC64: RTM: Don't retry lock on abort if abort was intentional
JDK-8207998 compiler/graalunit/JttLangMTest.java timeout
JDK-8207997 Misleading "COMPILE SKIPPED: invalid non-klass dependency" compile log
JDK-8207996 PBES2 AlgorithmId encoding error in PKCS12 KeyStore
JDK-8207994 serviceability/jvmti/HeapMonitor/MyPackage/HeapMonitorStatRateTest.java failed with Error. Parse Exception: Can't find source file: HeapMonitorStatIntervalTest.java
JDK-8207993 error occurred during error reporting (printing register info)
JDK-8207992 Update the JVMTI Spec for Heap Sampling
JDK-8207991 serviceability/jvmti/HeapMonitor/MyPackage/HeapMonitorStatRateTest.java fails with Rate average over 10% for rate 8192 -> 69.0, 1280.0
JDK-8207990 serviceability/jvmti/HeapMonitor/MyPackage/HeapMonitorStatArrayCorrectnessTest.java fails with Should not have any events stored yet.
JDK-8207989 [Graal] JDI and JDWP tests that consume all memory should be filtered out to not run with Graal
JDK-8207988 Check session context for TLS 1.3 session resumption
JDK-8207987 AARCH64: C2-only VM does not build
JDK-8207986 AArch64: Trampoline generation code reads from uninitialized memory
JDK-8207985 KeyStore#getInstance(File, LoadStoreParameter) does not load the keystore
JDK-8207525 aarch64 jtreg: assert in TestOptionsWithRanges.jtr
JDK-8207524 Minor improvements of jdk C-coding
JDK-8207523 The help-doc.html generated by the doclet is incomplete
JDK-8207522 Cleanup compiler tests for Client VM
JDK-8207521 Add T-Systems, GlobalSign and Starfield services root certificates
JDK-8207520 ManagementFactory.getPlatformMXBeans(BufferPoolMXBean.class) throws NPE
JDK-8207518 XDH TCK issues
JDK-8207517 Serializing non-zero byte as zero to ByteBuffer
JDK-8207516 Unable to use custom SSLEngine with default TrustManagerFactory after updating to JDK 11 b21
JDK-8207515 Multiple VM variants build fail.
JDK-8207514 [test] runtime/ElfDecoder/TestElfDirectRead.java requires longer timeout on ppc64
JDK-8207513 [test] prevent timeouts in serviceability/tmtools/jstat/{GcTest02,GcCauseTest02}.java
JDK-8207512 AArch64: Fix CompareAndSwapOp when useLSE is enabled in Graal
JDK-8207511 2 Null pointer dereference defect groups in LIRGenerator
JDK-8207510 Minor improvements of compiler code.
JDK-8207509 Add trace info to java/nio/channels/Selector/RegisterDuringSelect.java
JDK-8207508 RegisterDuringSelect.java fails with java.util.concurrent.ExecutionException: java.nio.channels.ClosedSelectorException
JDK-8207507 Problem list java/lang/management/ThreadMXBean/AllThreadIds.java
JDK-8207506 Problem list javax/sound/sampled/Clip/AutoCloseTimeCheck.java
JDK-8207505 [Graal] serviceability/jvmti/HeapMonitor/MyPackage/HeapMonitor tests fail
JDK-8207504 compiler/profiling/TestTypeProfiling.java fails when JVMCI build disabled
JDK-8207503 Placeholder for Japanese new era should be two characters
JDK-8207502 Lookup.accessClass fails for an array type in the same package when assertions are enabled
JDK-8207501 Minor improvements of runtime code.
JDK-8207500 *.obj.log files get truncated causing unreliable incremental builds on Windows
JDK-8207499 Unable to build Client VM
JDK-8207498 Aspect ratio is not maintained when Image is scaled in JEditorPane
JDK-8207497 The frame could be resized by dragging a corner of the frame with the mouse
JDK-8207496 serviceability/sa/TestUniverse.java#id0 crashes with EpsilonGC and AOT
JDK-8207495 sun/security/pkcs12/EmptyPassword.java fails with Sequence tag error
JDK-8207494 DateTimeFormatter throws parsing a valid string depending on the locale
JDK-8207493 [Graal] serviceability/jvmti/HeapMonitor/MyPackage/HeapMonitorGCCMSTest.java fails
JDK-8207492 minimal vm build fail: missing #include
JDK-8207491 Remove sun/security/krb5/auto/UnboundSSL.java from ProblemList.txt
JDK-8207490 forkjoin/FJExceptionTableLeak.java fails "AssertionError: failed to satisfy condition"
JDK-8207489 s390: add missing info to vm_version_ext_s390
JDK-8207487 Client jtreg ProblemList cleanup
JDK-8207486 javax/net/ssl/SSLSession/TestEnabledProtocols.java failed with Connection reset
JDK-8207485 Building jvm with AOT but without JVMCI should fail at configure time
JDK-8207484 Add missing license header to zHash.inline.hpp
JDK-8207483 [Graal] org.graalvm.compiler.hotspot.test.GraalOSRTest to ProblemList-graal.txt
JDK-8207482 HeapRegion.apply_to_marked_objects_other_vm_test fails with assert(!hr->is_free() || hr->is_empty()) failed: Free region 0 is not empty for set Free list #
JDK-8207481 Deadlock in Kitchensink when trying to print compile queues causing timeout
JDK-8207480 Wrong assert in phase_enum_2_phase_string() in referenceProcessorPhaseTimes.cpp
JDK-8207479 C2 Crash in Node::in(unsigned int) const+0x14
JDK-8207478 Test runtime/Thread/ThreadPriorities.java crashes with SEGV in pthread_getcpuclockid
JDK-8207477 java/lang/Class/GetPackageBootLoaderChildLayer.java fails with Graal
JDK-8207476 Address missing block coverage for ChaCha20 and Poly1305 algorithms
JDK-8207475 pthread_getcpuclockid is expected to return 0 code
JDK-8207474 Missing some legal notices in docs bundle
JDK-8207473 The help-doc.html generated by the doclet is outdated
JDK-8207472 UseSubwordForMaxVector causes performance regression
JDK-8207471 fix legal notice in hotspot tests
JDK-8207470 [solaris sparc] jck tests api/javax_print/PrintService failing
JDK-8207469 Broken link in jdk.jsobject
JDK-8207468 Deprecate for removal com.sun.awt.SecurityWarning
JDK-8207467 PPC64: add missing info to vm_version_ext_ppc
JDK-8207466 Broken links in java.desktop javadoc
JDK-8207465 [s390] Prevent restoring incorrect bcp and locals in interpreter and avoid incorrect size of partialSubtypeCheckNode in C2
JDK-8207464 AArch64: incorrect code generation for StoreCM
JDK-8207463 Humongous continues remembered set does not match humongous start region one after Remark
JDK-8207462 java.util.MissingResourceException: sun.security.util.AuthResources when trying to use com.sun.security.auth.module.UnixLoginModule
JDK-8207461 [testbug] New Nestmates JDI test times out with Xcomp on sparc
JDK-8207460 eventThreadGroup was null in TestJavaBlockedEvent.java
JDK-8207459 Generating an anonymous class with Filer#createClassFile causes an NPE in JavacProcessingEnvironment
JDK-8207458 Incorrect setting of MetaspaceSize and NewSizeThreadIncrease when using JVMCI compiler
JDK-8207457 ProblemList update of bug ID for SwingFontMetricsTest
JDK-8207456 Upgrade JDK11 to harfbuzz 1.8.2
JDK-8207455 Add JImageListTest.java to ProblemList.txt
JDK-8207454 sun/nio/cs/TestIBMBugs.java no longer compiles
JDK-8207453 compiler/whitebox/DeoptimizeFramesTest.java to ProblemList-graal.txt
JDK-8207452 missing ResourceMark in AOTCompiledMethod::metadata_do, AOTCompiledMethod::clear_inline_caches , CompiledMethod::clear_ic_stubs , CompiledMethod::cleanup_inline_caches_impl
JDK-8207451 JImageExtractTest.java & JImageListTest.java failed in Windows.
JDK-8207450 & is displayed in some Swing docs
JDK-8207449 Codepage mappings for IBM-943 and Big5 (aix)
JDK-8207448 possible hang in sun.awt.shell.Win32ShellFolder2$KnownFolderDefinition::
JDK-8207447 java -XshowSettings fails if memory.limit_in_bytes overflows LONG.max
JDK-8207446 SSLSessionImpl.getLocalPrincipal() throws NPE
JDK-8207444 Enable TLS1.3 by default in Http Client
JDK-8207443 dbgsysSocketClose - do not restart close if errno is EINTR [linux]
JDK-8207442 fix compiler/intrinsics/sha/cli/TestUseSHAOptionOnSupportedCPU.java jtreg test on linux s390x
JDK-8207441 C2 compilation fails with "assert(store->find_edge(load) != -1) failed: missing precedence edge"
JDK-8207440 tools/jimage/JImageExtractTest.java, fails intermittently at testExtract (macos)
JDK-8207439 ZGC: Preferred tmpfs mount point not found on Debian
JDK-8207438 ZGC: Premature OOME due to failure to expand backing file
JDK-8207436 Unable to complete emergency dump during safepoint
JDK-8207435 MallocSiteTable::initialize() doesn't take function descriptors into account
JDK-8207434 ZGC: Incorrect license header in gtests
JDK-8207433 Short week days, NaN value and timezone name are inconsistent between CLDR and Java in zh_CN, zh_TW locales.
JDK-8207432 [TESTBUG]: jdk/internal/platform/docker/TestDockerMemoryMetrics.java fails depending on kernel config
JDK-8207431 jck test fails with C2: vm/jvmti/FollowReferences/fref001/fref00113/fref00113.html
JDK-8207430 docs-reference build fails due to extlink.spec.version property not set
JDK-8207429 Race with ConcurrentHashTable deleting items on insert with cleanup thread
JDK-8207428 Bad HTML in {@link} in HttpResponse.BodySubscribers.ofPublisher
JDK-8207427 JDK 11 javadoc generates bad code example
JDK-8207426 [Graal] runtime/ReservedStack/ReservedStackTest.java triggers: assert(thread->deopt_mark() == __null) failed: no stack overflow from deopt blob/uncommon trap
JDK-8207425 (fs) Extended attributes assumed to be enabled on ext3 (lnx)
JDK-8207424 CodeHeap State Analytics must digest new method state
JDK-8207423 Compilation succeeds without checking readability when --add-exports used
JDK-8207422 JDK9 javax.lang.model.util.Elements#getTypeElement regressed 1000x in performance.
JDK-8207413 Drop JVM-MANAGEMENT-MIB.mib from Java SE
JDK-8207412 Several jib profiles missing autoconf dependency
JDK-8207410 [REDO] 8202561 clean up TEST.groups
JDK-8207409 Backout JDK-8202561
JDK-8207408 clean up TEST.groups file

Committer push log

Andrew Dinn, Red Hat

Bug Summary
JDK-8211105 AArch64: Disable cos/sin and log intrinsics in jdk11u pending fix

Aleksej Efimov, Oracle

Bug Summary
JDK-8212746 TimeZone.getDisplayName given Locale.US doesn't always honor the Locale

Sean Coffey, Oracle

Bug Summary
JDK-8212236 Better management of CipherCore buffers
JDK-8212235 Better management of internal KeyStore buffers
JDK-8212238 CipherCore performance improvement
JDK-8212237 Further improvements to cipher buffer management
JDK-8212073 JarEntry.setCreation/LastAccessTime without setLastModifiedTime causes Invalid CEN header
JDK-8210657 jdeps does not handle properly on analyzing a mixture of MR JARs and non-MR JARs
JDK-8211730 jdk/javax/xml/crypto/dsig/GenerationTests.java slow on linux
JDK-8212172 jdk/javax/xml/crypto/dsig/GenerationTests.java timed out
JDK-8212072 JVM TI Spec missing copyright

Coleen Phillimore, Oracle

Bug Summary
JDK-8212203 RedefineStress tests crash

David Holmes, Oracle

Bug Summary
JDK-8212671 JDWP Transport Listener: dt_socket thread crash
JDK-8212085 Private method check in linkResolver is incorrect

Dmitry Markov, Oracle

Bug Summary
JDK-8212229 OS X: keyboard input in textfield is not possible if the window contained textfield is owned by EmbeddedFrame
JDK-8212230 OS X: requestFocus() does not work properly for embedded frame

Frank Yuan, Oracle

Bug Summary
JDK-8212103 ISO 4217 Amendment #168 Update
JDK-8212104 ISO 4217 Amendment #169 Update
JDK-8212105 localized currency symbol of VES

Goetz Lindenmaier, SAP

Bug Summary
JDK-8212176 [ppc, s390] ProblemList some failing tests.
JDK-8211757 [PPC64] Fix JFR profiling.
JDK-8212121 [s390] Implement JFR profiling.
JDK-8211095 [testbug] IncompatibleOptions.java fails if VM configured without ZGC
JDK-8211753 [TESTBUG] javax/swing/plaf/basic/BasicGraphicsUtils/8132119/bug8132119.java fails on machines without Arial font
JDK-8211370 JDK12 fails to build on s390x with gcc 7.3
JDK-8211421 serviceability/sa/TestJmapCore.java times out parsing a 4GB hprof file
JDK-8212101 Some intrinsic tests take long time to run

Henry Jen, Oracle

Bug Summary
JDK-8212126 Escaped character at specific position in argument file is not handled properly

Jiangli Zhou, Google

Bug Summary
JDK-8212100 AppCDS crashes for some uses with JRuby

Jamil Nimeh, Oracle

Bug Summary
JDK-8212599 Add test to exercise server-side client hello processing
JDK-8211040 NPE in SupportedGroupsExtension
JDK-8212789 TLS 1.3 handshake server name indication is missing on a session resume
JDK-8210445 TLS 1.3 server fails if ClientHello doesn't have pre_shared_key and psk_key_exchange_modes
JDK-8211041 TLSv.1.3 interop problems with OpenSSL 1.1.1 when used on the client side with mutual auth

Kevin Walls, Oracle

Bug Summary
JDK-8213040 "-XX:OnOutOfMemoryError" uses fork instead of vfork
JDK-8213041 HotSpot vm_version.cpp should recognise updated VS2017
JDK-8213042 Need to update vm_version.cpp to recognise VS2017 minor versions

Vladimir Kozlov, Oracle

Bug Summary
JDK-8212204 [TESTBUG] test/hotspot/jtreg/compiler/intrinsics/base64/TestBase64.java fails
JDK-8213066 Default mask register for avx512 instructions
JDK-8213068 Minimal VM build failures after JDK-8211251 (Default mask register for avx512 instructions)
JDK-8213065 Update avx512 implementation
JDK-8213067 x86_32 build failures after JDK-8210764 (Update avx512 implementation)

Laurent Bourgès, Independent

Bug Summary
JDK-8212118 Clipping problems with complex affine transforms: negative scaling factors or small scaling factors

Martin Buchholz, Google

Bug Summary
JDK-8212140 Malayalam glyph substitution is failing for Malayalam with Windows Kartika font.

Mandy Chung, Oracle

Bug Summary
JDK-8212674 OpenDataException thrown when constructing CompositeData for StackTraceElement
JDK-8213062 ThreadInfoCompositeData.toCompositeData fails to map ThreadInfo to CompositeData

Martin Doerr, SAP

Bug Summary
JDK-8212052 [epsilon] range function for EpsilonTLABElasticity causes compiler warning
JDK-8211721 [PPC64] Vector registers not saved across safepoint
JDK-8212924 [s390]: Use of shift operators not covered by cpp standard
JDK-8212661 add more ld preloading info to hs_error file on Linux
JDK-8213078 Automate vtable/itable stub size calculation
JDK-8213081 inspect stack during error reporting
JDK-8212058 make AllocateHeapAt an unsupported option on AIX
JDK-8213079 Minimal and Zero non-PCH builds fail after JDK-8207343 (Automate vtable/itable stub size calculation)
JDK-8212690 print_location is not reliable enough (printing register info)
JDK-8212923 SIGBUS in CodeHeapState::print_names()
JDK-8212922 SIGSEGV in MethodArityHistogram() with -XX:+CountCompiledCalls
JDK-8213080 Zero builds fail after JDK-8207343 (Automate vtable/itable stub size calculation)

Manajit Halder, Oracle

Bug Summary
JDK-8212007 [macosx] Cycling through windows (JFrames) does not work with keyboard shortcut
JDK-8212644 Instead of circle rendered in appl window, but ellipse is produced JEditor Pane

Michael McMahon, Oracle

Bug Summary
JDK-8212693 com.sun.net.httpserver.HttpServer returns Content-length header for 204 response code
JDK-8212927 HttpClient does not retrieve files with large sizes over HTTP/1.1
JDK-8212692 java.net.http HTTP client should allow specifying Origin and Referer headers
JDK-8211445 java.net.http.HttpClient hangs on 204 reply without Content-length 0

Nishit Jain, Independent

Bug Summary
JDK-8211916 Javadoc -link makes broken links if module name matches package name

Prasanta Sadhukhan, Oracle

Bug Summary
JDK-8212123 [macos] Problem with input of yen symbol

Robert Mckenna, Oracle

Bug Summary
JDK-8210468 Add additional TeliaSonera root certificate
JDK-8209884 Disable all DES cipher suites
JDK-8211839 java.nio.file.Files.writeString writes garbled UTF-16 instead of UTF-8
JDK-8208447 JDK 11 L10n resource file update - msg drop 10
JDK-8211430 LDAPS communication failure with jdk 1.8.0_181
JDK-8212274 Restrict the use of EXPORT cipher suites
JDK-8210581 The Japanese message of FileNotFoundException garbled.

Roland Westrelin, Red Hat

Bug Summary
JDK-8212239 assert failure in coalesce.cpp: attempted to spill a non-spillable item

Sergey Bylokhov, Amazon

Bug Summary
JDK-8213063 Clip.isRunning() may return true after Clip.stop() was called
JDK-8213064 Swing apps are slow if displaying from a remote source to many local displays

Severin Gehwolf, Red Hat

Bug Summary
JDK-8212667 [linux] Poor StrictMath performance due to non-optimized compilation
JDK-8212668 [x86] sharedRuntimeTrig/sharedRuntimeTrans compiled without optimization
JDK-8212068 [Zero] atomic_copy64: Use ldrexd for atomic reads on ARMv7
JDK-8212065 Build fails with warn_unused_result in openjdk/src/jdk.hotspot.agent/linux/native/libsaproc/ps_core.c
JDK-8212231 Build of saproc.dll broken on Windows 32 bit after JDK-8210647
JDK-8212066 libjsig is being compiled without optimization
JDK-8212064 libsaproc is being compiled without optimization
JDK-8212113 No debug info for assembler files
JDK-8212067 SA: jhsdb jstack --mixed throws UnmappedAddressException on i686
JDK-8212069 vmStructs.cpp compiled with -O0

Aleksey Shipilev, Red Hat

Bug Summary
JDK-8212688 BarrierSetC1::generate_referent_check() confuses register allocator
JDK-8212917 Build failure: undefined JvmtiSampledObjectAllocEventCollector::object_alloc_is_safe_to_sample
JDK-8212687 Epsilon alignment adjustments can overflow max TLAB size
JDK-8212686 Epsilon elastic TLAB sizing may cause misalignment
JDK-8212685 Soft reference reclamation race in com.sun.xml.internal.stream.util.ThreadLocalBufferAllocator
JDK-8212689 Tests fail with assert(VM_Version::supports_sse4_1()) on ThreadRipper CPU