PUSHES REPORT: 11.0.22

This report shows who pushed the backports to the given release. This usually shows who did the backporting, testing, and review work.

Report generated: Thu Feb 22 15:42:59 CET 2024

Distribution by priority

Count Priority
12 P2
42 P3
132 P4
3 P5

Distribution by components

Count Component
189 100% Total
49 25.9% client-libs
20 10.6% client-libs/java.awt
12 6.3% client-libs/javax.swing
9 4.8% client-libs
7 3.7% client-libs/2d
1 0.5% client-libs/javax.sound
48 25.4% hotspot
16 8.5% hotspot/runtime
10 5.3% hotspot/compiler
8 4.2% hotspot/gc
6 3.2% hotspot/jfr
3 1.6% hotspot/svc
3 1.6% hotspot/test
2 1.1% hotspot/svc-agent
33 17.5% core-libs
14 7.4% core-libs/java.net
4 2.1% core-libs/java.lang
3 1.6% core-libs/java.util.logging
3 1.6% core-libs/javax.naming
2 1.1% core-libs/java.util.jar
2 1.1% core-libs/java.nio
1 0.5% core-libs/java.rmi
1 0.5% core-libs/java.util.concurrent
1 0.5% core-libs
1 0.5% core-libs/java.lang.invoke
1 0.5% core-libs/java.util:i18n
26 13.8% security-libs
17 9.0% security-libs/java.security
3 1.6% security-libs/javax.net.ssl
2 1.1% security-libs/jdk.security
2 1.1% security-libs/javax.security
1 0.5% security-libs/javax.xml.crypto
1 0.5% security-libs/javax.crypto
21 11.1% infrastructure
18 9.5% infrastructure/build
2 1.1% infrastructure/release_eng
1 0.5% infrastructure
7 3.7% core-svc
3 1.6% core-svc/debugger
2 1.1% core-svc/javax.management
1 0.5% core-svc/tools
1 0.5% core-svc/java.lang.management
5 2.6% tools
2 1.1% tools/jshell
1 0.5% tools/javap
1 0.5% tools/javac
1 0.5% tools

Distribution by affiliation

This Release Pushes

Original Pushes

Count Committer
189 100% Total
103 54.5% SAP
41 21.7% Goetz Lindenmaier
40 21.2% Andrew Lu
11 5.8% Christoph Langer
4 2.1% Matthias Baesken
3 1.6% Ralf Schmelter
3 1.6% Martin Doerr
1 0.5% Johannes Bechberger
29 15.3% Amazon
18 9.5% Aleksey Shipilev
5 2.6% Roy Soumadipta
3 1.6% Sergey Bylokhov
1 0.5% Andrei Pangin
1 0.5% Volker Simonis
1 0.5% Chad Rakoczy
23 12.2% Independent
18 9.5% amosshi
3 1.6% Kangcheng Xu
2 1.1% Fei Yang
19 10.1% Red Hat
14 7.4% Sonia Zaldana Calles
2 1.1% Andrew Hughes
2 1.1% Severin Gehwolf
1 0.5% Frederic Thevenet
5 2.6% Azul
3 1.6% Yuri Nesterenko
2 1.1% Alexey Bakhtin
3 1.6% Fujitsu
2 1.1% ogata.toshitaka
1 0.5% Kimura Yukihiro
2 1.1% Loongson
1 0.5% Qi Ao
1 0.5% Sun Guoyun
1 0.5% Alibaba
1 0.5% yibo.yl
1 0.5% Canonical
1 0.5% pushkar.kulkarni
1 0.5% Microsoft
1 0.5% Mat Carter
1 0.5% Oracle
1 0.5% Prasanta Sadhukhan
1 0.5% Rivos
1 0.5% Ludovic Henry
Count Committer
189 100% Total
111 58.7% Oracle
8 4.2% Daniel Fuchs
8 4.2% Rajan Halade
7 3.7% Harshitha Onkar
7 3.7% Philip Race
5 2.6% Prasanta Sadhukhan
4 2.1% Sean Coffey
4 2.1% Alexander Zvegintsev
3 1.6% Weijun Wang
3 1.6% Alexander Zuev
3 1.6% Magnus Ihse Bursie
3 1.6% Alexey Ivanov
2 1.1% Kevin Walls
2 1.1% Alex Menkov
2 1.1% Erik Gahlin
2 1.1% Lawrence Andrews
2 1.1% David Holmes
2 1.1% Renjith Kannath Pariyangad
2 1.1% Igor Ignatyev
2 1.1% Harold Seigel
2 1.1% Weibing Xiao
1 0.5% Brian Burkhalter
1 0.5% Ludvig Janiuk
1 0.5% Sean Mullan
1 0.5% Alan Bateman
1 0.5% Tejesh R
1 0.5% Haimay Chao
1 0.5% Jayathirth D V
1 0.5% Leo Korinth
1 0.5% Roger Riggs
1 0.5% Valerie Peng
1 0.5% Tobias Holenstein
1 0.5% Stefan Karlsson
1 0.5% naveen.n.narayanan
1 0.5% Tobias Hartmann
1 0.5% Matthew Donovan
1 0.5% Ambarish Rapte
1 0.5% Thomas Schatzl
1 0.5% Daniel Daugherty
1 0.5% Joakim Nordström
1 0.5% Ekaterina Pavlova
1 0.5% Emanuel Peter
1 0.5% Jan Lahoda
1 0.5% Pankaj Bansal
1 0.5% Leonid Mesnik
1 0.5% Fernando Guallini
1 0.5% Vicente Arturo Romero Zaldivar
1 0.5% Christian Stein
1 0.5% Mikhailo Seledtsov
1 0.5% Ravi Gupta
1 0.5% Aleksej Efimov
1 0.5% Damon Nguyen
1 0.5% Matias Saavedra Silva
1 0.5% Daniil Titov
1 0.5% Jonathan Gibbons
1 0.5% Chris Yin
1 0.5% Justin Lu
1 0.5% Alisen Chung
1 0.5% Manukumar V S
27 14.3% Amazon
16 8.5% Aleksey Shipilev
5 2.6% Roy Soumadipta
2 1.1% Sergey Bylokhov
2 1.1% Volker Simonis
1 0.5% Xin Liu
1 0.5% Chad Rakoczy
19 10.1% SAP
7 3.7% Christoph Langer
4 2.1% Matthias Baesken
3 1.6% Ralf Schmelter
2 1.1% Goetz Lindenmaier
2 1.1% Martin Doerr
1 0.5% Johannes Bechberger
10 5.3% Independent
3 1.6% Eirik Bjørsnøs
2 1.1% Per Liden
1 0.5% Julian Waters
1 0.5% Chris Hegarty
1 0.5% yanglongplus
1 0.5% Zixian Cai
1 0.5% Quan Anh Mai
6 3.2% Red Hat
5 2.6% Thomas Stuefe
1 0.5% Frederic Thevenet
3 1.6% Tencent
2 1.1% Xuelei Fan
1 0.5% John Jiang
3 1.6% Unknown
3 1.6% N/A
2 1.1% Google
2 1.1% Jiangli Zhou
1 0.5% @proton.me
1 0.5% largeprimes
1 0.5% Azul
1 0.5% Yuri Nesterenko
1 0.5% BellSoft
1 0.5% Alexandr Scherbatiy
1 0.5% Fujitsu
1 0.5% Kimura Yukihiro
1 0.5% IBM
1 0.5% Toshio Nakamura
1 0.5% Loongson
1 0.5% Qi Ao
1 0.5% Microsoft
1 0.5% Mat Carter
1 0.5% VMWare
1 0.5% Vyom Tewari

Chronological push log:

UTC Time This Release Push By Original Push By Bug Summary
Name Affiliation Name Affiliation
2024/01/09 22:19 Christoph Langer SAP (same) (same) JDK-8323423 [11u] Remove designator DEFAULT_PROMOTED_VERSION_PRE=ea for release 11.0.22
2023/12/15 22:30 Alexey Bakhtin Azul Weijun Wang Oracle JDK-8323850 RSA signature verification fails on signed data that does not encode params correctly
2023/12/15 04:26 Alexey Bakhtin Azul Valerie Peng Oracle JDK-8323848 Allocate BadPaddingException only if it will be thrown
2023/11/30 11:18 Andrew Lu SAP Rajan Halade Oracle JDK-8321103 Add three eMudhra emSign roots
2023/11/28 13:49 Sonia Zaldana Calles Red Hat Aleksey Shipilev Amazon JDK-8320896 sun.awt.X11.ListHelper.removeAll() should use clear()
2023/11/28 13:49 Sonia Zaldana Calles Red Hat Quan Anh Mai Independent JDK-8320895 Objects.requireNonNull should be ForceInline
2023/11/28 13:46 Sonia Zaldana Calles Red Hat Philip Race Oracle JDK-8320894 Wrong font ligatures used when 2 versions of same font used
2023/11/28 13:43 Kangcheng Xu Independent Alan Bateman Oracle JDK-8320893 (dc) DatagramChannel.read() throws exception instead of discarding data when buffer too small
2023/11/28 11:42 Roy Soumadipta Amazon (same) (same) JDK-8320883 Parallelize gc/stress/TestStressRSetCoarsening.java test
2023/11/28 11:39 Andrew Lu SAP Daniel Fuchs Oracle JDK-8320882 java/net/DatagramSocket/PortUnreachable.java still fails intermittently with BindException
2023/11/28 11:39 Andrew Lu SAP Daniel Fuchs Oracle JDK-8320881 java/net/DatagramSocket/PortUnreachable.java still fails intermittently with SocketTimeoutException
2023/11/28 11:37 Andrew Lu SAP Aleksej Efimov Oracle JDK-8320880 Replace wildcard address with loopback or local host in tests - part 9
2023/11/28 11:33 Andrew Lu SAP Igor Ignatyev Oracle JDK-8320879 vmTestbase/vm/mlvm/mixed/stress/regression/b6969574/INDIFY_Test.java fails with -Xcomp
2023/11/28 11:31 Andrew Lu SAP Igor Ignatyev Oracle JDK-8320878 [mlvm] vm/mlvm/mixed/stress/regression/b6969574 fails and perf regression
2023/11/28 11:18 Andrew Lu SAP Rajan Halade Oracle JDK-8320876 Add four DigiCert root certificates
2023/11/27 09:57 Martin Doerr SAP (same) (same) JDK-8320748 Top of lock-stack does not match the unlocked object
2023/11/24 15:06 Andrew Hughes Red Hat Sean Mullan Oracle JDK-8320705 NullPointerException in CertStore.getCRLs after 8297955
2023/11/23 13:08 Andrew Lu SAP Daniel Fuchs Oracle JDK-8320659 Instrument FlowTest.java to provide more debug traces.
2023/11/23 10:13 Andrew Lu SAP Harshitha Onkar Oracle JDK-8320653 Add manual tests to open
2023/11/22 11:47 Andrew Lu SAP Chris Yin Oracle JDK-8320591 cleanup rawtypes warnings in open jndi tests
2023/11/22 11:45 Andrew Lu SAP John Jiang Tencent JDK-8320590 java/net/httpclient/whitebox/FlowTestDriver.java should not specify a TLS protocol
2023/11/21 14:45 Severin Gehwolf Red Hat Rajan Halade Oracle JDK-8320521 Add Let's Encrypt ISRG Root X2
2023/11/20 14:50 pushkar.kulkarni Canonical Erik Gahlin Oracle JDK-8320411 JFR: FlightRecorderOptions reset date format
2023/11/20 10:47 Andrew Lu SAP Per Liden Independent JDK-8320389 ZGC: vmTestbase/gc/gctests/SoftReference/soft004/soft004.java fails with assert(_phases->length() <= 1000) failed: Too many recored phases?
2023/11/20 10:45 Andrew Lu SAP N/A Unknown JDK-8320388 Check boxes and radio buttons have rendering issues on Windows in High DPI env
2023/11/17 14:50 Sonia Zaldana Calles Red Hat Rajan Halade Oracle JDK-8320326 Tests for AffirmTrust roots
2023/11/13 08:42 Andrew Lu SAP N/A Unknown JDK-8319953 Test java/awt/Focus/ActualFocusedWindowTest/ActualFocusedWindowBlockingTest.java fails intermittentently on windows
2023/11/13 08:40 Goetz Lindenmaier SAP Prasanta Sadhukhan Oracle JDK-8319952 Deproblemlist few problemlisted test
2023/11/13 08:38 Andrew Lu SAP Xuelei Fan Tencent JDK-8319951 javax/net/ssl/DTLS/RespondToRetransmit.java timed out
2023/11/13 08:36 Andrew Lu SAP Stefan Karlsson Oracle JDK-8319950 Print count in "Too many recored phases?" assert
2023/11/10 17:02 Andrew Lu SAP Thomas Schatzl Oracle JDK-8319930 Crash in HSpaceCounters::update_used()
2023/11/09 16:11 Sonia Zaldana Calles Red Hat Philip Race Oracle JDK-8319836 Open source some AWT tests relating to Button and a few other classes
2023/11/09 16:04 Sonia Zaldana Calles Red Hat Justin Lu Oracle JDK-8319834 (cal) Japanese calendar unit test system should avoid multiple static imports
2023/11/09 16:01 Sonia Zaldana Calles Red Hat Brian Burkhalter Oracle JDK-8319833 (fs) Print size values in java/nio/file/FileStore/Basic.java when they differ by > 1GiB
2023/11/09 15:57 Sonia Zaldana Calles Red Hat Harold Seigel Oracle JDK-8319832 [TESTBUG] Remove defmeth tests for class file versions 50 and 51
2023/11/09 15:55 Sonia Zaldana Calles Red Hat David Holmes Oracle JDK-8319831 [Testbug] Fix for 8144279 didn't define a test case!
2023/11/09 15:52 Sonia Zaldana Calles Red Hat Mikhailo Seledtsov Oracle JDK-8319830 [TESTBUG] Improve test configuration for shared strings
2023/11/09 11:27 Andrew Lu SAP Sean Coffey Oracle JDK-8319787 Test SignedLoggerFinderTest.java is still failing
2023/11/09 11:27 Andrew Lu SAP Sean Coffey Oracle JDK-8319786 SignedLoggerFinderTest.java test failed
2023/11/09 11:27 Andrew Lu SAP Sean Coffey Oracle JDK-8319785 Signed jars triggering Logger finder recursion and StackOverflowError
2023/11/08 17:10 Ludovic Henry Rivos Thomas Stuefe Red Hat JDK-8319739 (process) jspawnhelper should not use argv[0]
2023/11/08 08:40 Goetz Lindenmaier SAP Alexander Zvegintsev Oracle JDK-8319699 Test "java/awt/print/PrinterJob/ImagePrinting/PrintARGBImage.java" fails because the frames of instruction does not display
2023/11/08 08:16 Goetz Lindenmaier SAP Prasanta Sadhukhan Oracle JDK-8319694 ProgressMonitorInputStream not large file aware (>2GB)
2023/11/08 08:14 Goetz Lindenmaier SAP Weijun Wang Oracle JDK-8319693 Remove BadKeyUsageTest.java from Problem List
2023/11/08 08:10 Goetz Lindenmaier SAP Daniel Fuchs Oracle JDK-8319692 Replace wildcard address with loopback or local host in tests - part 23
2023/11/07 17:08 Severin Gehwolf Red Hat Rajan Halade Oracle JDK-8319646 Add Telia Root CA v2
2023/11/07 12:48 Matthias Baesken SAP (same) (same) JDK-8319627 Do not run sun/tools/jhsdb tests concurrently
2023/11/07 10:30 Johannes Bechberger SAP (same) (same) JDK-8319614 JDWP-agent sends broken exception event with onthrow option
2023/11/07 10:26 Goetz Lindenmaier SAP Leonid Mesnik Oracle JDK-8319612 Update applications/scimark/Scimark.java to accept VM flags
2023/11/07 10:23 Goetz Lindenmaier SAP Harshitha Onkar Oracle JDK-8319611 Add new positioning options to PassFailJFrame test framework
2023/11/07 10:21 Goetz Lindenmaier SAP N/A Unknown JDK-8319610 jarsigner never shows a warning in badKeyUsage case
2023/11/07 09:20 Goetz Lindenmaier SAP Lawrence Andrews Oracle JDK-8319608 Remove jtreg tag manual=yesno for java/awt/print/PrinterJob/PageRangesDlgTest.java
2023/11/07 09:12 Goetz Lindenmaier SAP Roger Riggs Oracle JDK-8319601 Add diagnostic output to test java/util/ProcessBuilder/Basic.java
2023/11/07 09:06 Goetz Lindenmaier SAP Daniel Fuchs Oracle JDK-8319600 Replace wildcard address with loopback or local host in tests - part 22
2023/11/06 12:35 Ralf Schmelter SAP (same) (same) JDK-8319530 jdk/jfr/jvm/TestDumpOnCrash.java fails on Linux ppc64le and Linux aarch64
2023/11/06 12:35 Ralf Schmelter SAP (same) (same) JDK-8319529 JfrStructCopyFailed uses heap words instead of bytes for object sizes
2023/11/06 08:34 Frederic Thevenet Red Hat (same) (same) JDK-8319518 Target OS detection in 'test-prebuilt' makefile target is incorrect when running on MSYS2
2023/11/06 08:31 Sonia Zaldana Calles Red Hat Rajan Halade Oracle JDK-8319517 Enhance test/jdk/javax/net/ssl/TLSCommon/SSLEngineTestCase.java to handle default cases
2023/11/06 08:29 Andrew Lu SAP Ludvig Janiuk Oracle JDK-8319515 Clarify TLABWasteTargetPercent flag
2023/11/06 08:27 Andrew Lu SAP Weibing Xiao Oracle JDK-8319513 The socket is not closed in Connection::createSocket when the handshake failed for LDAP connection
2023/11/06 08:24 Sonia Zaldana Calles Red Hat Alexander Zvegintsev Oracle JDK-8319512 Open source several choice AWT tests
2023/11/06 08:22 Sonia Zaldana Calles Red Hat Kevin Walls Oracle JDK-8319511 Add sanity check for signal handler modification warning.
2023/11/06 08:11 Goetz Lindenmaier SAP Harshitha Onkar Oracle JDK-8319508 Refactoring changes to PassFailJFrame Test Framework
2023/11/06 07:46 Goetz Lindenmaier SAP Lawrence Andrews Oracle JDK-8319505 Remove jtreg tag manual=yesno for java/awt/print/PrinterJob/ImagePrinting/ClippedImages.java
2023/11/06 07:44 Goetz Lindenmaier SAP Fernando Guallini Oracle JDK-8319504 Refactor java/lang/Runtime shell tests to java
2023/11/06 07:42 Goetz Lindenmaier SAP Alexandr Scherbatiy BellSoft JDK-8319503 Rewrite sun/management/jmxremote/bootstrap/CustomLauncherTest.java test to make binaries from source file
2023/11/06 07:40 Goetz Lindenmaier SAP Daniel Fuchs Oracle JDK-8319502 Replace wildcard address with loopback or local host in tests - part 19
2023/11/06 07:38 Goetz Lindenmaier SAP Daniel Fuchs Oracle JDK-8319501 Replace wildcard address with loopback or local host in tests - part 10
2023/11/06 07:33 Goetz Lindenmaier SAP Daniel Fuchs Oracle JDK-8319500 Replace wildcard address with loopback or local host in tests - part 1
2023/11/06 07:28 Goetz Lindenmaier SAP Jiangli Zhou Google JDK-8319499 Remove hard-coded 127.0.0.1 loopback address in JDK networking tests
2023/11/01 16:39 Sonia Zaldana Calles Red Hat Alexey Ivanov Oracle JDK-8319237 Provide a reason for PassFailJFrame.forceFail
2023/10/31 15:16 yibo.yl Alibaba yanglongplus Independent JDK-8319183 Socket.connect does not timeout when profiling
2023/10/30 10:45 Goetz Lindenmaier SAP (same) (same) JDK-8319101 [macos] ProblemList java/rmi/registry/multipleRegistries/MultipleRegistries.java
2023/10/30 10:38 Goetz Lindenmaier SAP Matias Saavedra Silva Oracle JDK-8319100 Allow executeAndLog to accept running process
2023/10/30 10:11 Goetz Lindenmaier SAP Philip Race Oracle JDK-8319098 Some client related jtreg problem list entries are malformed
2023/10/30 10:09 Goetz Lindenmaier SAP Joakim Nordström Oracle JDK-8319097 JFR: Don't commit JFR internal jdk.JavaMonitorWait events
2023/10/30 10:06 Goetz Lindenmaier SAP Harshitha Onkar Oracle JDK-8319095 [macosx] The text "big" is truncated in JTabbedPane
2023/10/30 10:04 ogata.toshitaka Fujitsu Aleksey Shipilev Amazon JDK-8319093 [TESTBUG] serviceability/sa/TestUniverse.java looks for wrong string with Shenandoah
2023/10/30 08:14 Matthias Baesken SAP (same) (same) JDK-8319085 use close after failing os::fdopen in vmError and ciEnv
2023/10/30 00:06 ogata.toshitaka Fujitsu Per Liden Independent JDK-8319073 Clean up serviceability/sa/TestUniverse.java
2023/10/28 14:19 Ralf Schmelter SAP (same) (same) JDK-8319057 Metadata for regionsRefilled of G1EvacuationStatistics event is wrong
2023/10/27 06:50 Sun Guoyun Loongson Jiangli Zhou Google JDK-8318954 CDS dumping of springboot asserts in G1ArchiveAllocator::alloc_new_region
2023/10/26 18:21 Goetz Lindenmaier SAP Leo Korinth Oracle JDK-8318931 JTREG: Clean up, remove unused imports in gc folder
2023/10/25 15:19 Kangcheng Xu Independent Volker Simonis Amazon JDK-8318830 jdk.test.lib.util.JarUtils updates jar files incorrectly
2023/10/25 08:20 Goetz Lindenmaier SAP Renjith Kannath Pariyangad Oracle JDK-8318800 Remove UTF-8 character from TaskbarPositionTest.java
2023/10/25 08:17 Goetz Lindenmaier SAP Damon Nguyen Oracle JDK-8318799 java/awt/dnd/NoFormatsDropTest/NoFormatsDropTest.java timed out
2023/10/25 08:12 amosshi Independent Eirik Bjørsnøs Independent JDK-8318797 Update VerifySignedJar to actually exercise and test verification
2023/10/25 08:09 Goetz Lindenmaier SAP Manukumar V S Oracle JDK-8318796 java/awt/PopupMenu/PopupMenuLocation.java is unstable in MacOS machines
2023/10/25 08:03 Kangcheng Xu Independent Aleksey Shipilev Amazon JDK-8318793 Platform.isTieredSupported should handle the no-compiler case
2023/10/25 08:00 Goetz Lindenmaier SAP Erik Gahlin Oracle JDK-8318791 JFR: Add SecurityProviderService#threshold to TestActiveSettingEvent.java
2023/10/25 08:00 Goetz Lindenmaier SAP Sean Coffey Oracle JDK-8318790 Add java.security.Provider.getService JFR Event
2023/10/25 07:58 Goetz Lindenmaier SAP Alexander Zuev Oracle JDK-8318789 javax/swing/JPopupMenu/7156657/bug7156657.java fails on macOS
2023/10/24 07:32 Andrew Lu SAP Pankaj Bansal Oracle JDK-8318698 TAB key cannot change input focus after the radio button in the Color Selection dialog
2023/10/24 07:30 Andrew Lu SAP Ambarish Rapte Oracle JDK-8318697 [macos] JSpinner buttons in JColorChooser dialog may capture focus using TAB Key.
2023/10/19 09:32 amosshi Independent Matthew Donovan Oracle JDK-8318504 Missing coverage for javax.xml.crypto.dom.DOMCryptoContext
2023/10/19 09:27 Andrew Lu SAP Toshio Nakamura IBM JDK-8318503 Unexpected round errors in FreetypeFontScaler
2023/10/19 09:22 amosshi Independent Alisen Chung Oracle JDK-8318502 java/awt/Mouse/EnterExitEvents/DragWindowTest.java fails with "No MouseReleased event on label!"
2023/10/19 09:17 Andrew Lu SAP Emanuel Peter Oracle JDK-8318501 Increase buffer size for buf (insert_features_names) in Abstract_VM_Version::insert_features_names
2023/10/19 09:15 amosshi Independent Philip Race Oracle JDK-8318494 Define jtreg jdk_desktop test group time-based sub-tasks for use by headful testing.
2023/10/17 08:32 Aleksey Shipilev Amazon Xin Liu Amazon JDK-8318287 [GHA] get-bootjdk action should return the abolute path
2023/10/17 07:54 amosshi Independent Ravi Gupta Oracle JDK-8318284 Write a test to check various components send Events while mouse and key are used simultaneously
2023/10/17 07:51 amosshi Independent Eirik Bjørsnøs Independent JDK-8318282 Add test coverage for processing of pending block files in signed JARs
2023/10/17 07:49 amosshi Independent David Holmes Oracle JDK-8318280 Test runtime/jni/nativeStack/ needs to detach the native thread
2023/10/17 07:46 amosshi Independent Eirik Bjørsnøs Independent JDK-8318278 Improve readability of the test JarWithOneNonDisabledDigestAlg
2023/10/17 07:35 amosshi Independent naveen.n.narayanan Oracle JDK-8318276 Write a test to verify setAccelerator method of JMenuItem
2023/10/17 07:28 Matthias Baesken SAP (same) (same) JDK-8318273 avoid potential leaks in KeystoreImpl.m related to JNU_CHECK_EXCEPTION early returns
2023/10/17 07:24 Matthias Baesken SAP (same) (same) JDK-8318271 report some fontconfig related environment variables in hs_err file
2023/10/15 10:16 Andrew Lu SAP Alex Menkov Oracle JDK-8318121 com/sun/jdi/JdbOptions.java failed with "RuntimeException: 'prop[boo] = >foo<' missing from stdout/stderr"
2023/10/15 10:16 Andrew Lu SAP Alex Menkov Oracle JDK-8318120 com/sun/jdi/JdbOptions.java failed with "RuntimeException: 'prop[boo] = >foo 2<' missing from stdout/stderr"
2023/10/12 22:04 Mat Carter Microsoft (same) (same) JDK-8318052 SunMSCAPI provider leaks memory and keys
2023/10/12 19:55 amosshi Independent Ekaterina Pavlova Oracle JDK-8318045 Mark vmTestbase/vm/mlvm/meth/stress/compiler/deoptimize test as stress test
2023/10/11 09:24 amosshi Independent Renjith Kannath Pariyangad Oracle JDK-8317892 Update javax/swing/Popup/TaskbarPositionTest.java
2023/10/11 09:23 amosshi Independent Prasanta Sadhukhan Oracle JDK-8317891 Test javax/swing/dnd/7171812/bug7171812.java fails with java.lang.RuntimeException: Test failed, scroll on drag doesn't work
2023/10/11 09:21 amosshi Independent Alexander Zvegintsev Oracle JDK-8317890 jtreg time out of CtrlASCII.java seems to hang the Xserver.
2023/10/11 09:20 amosshi Independent Tejesh R Oracle JDK-8317889 Screen capture for test JFileChooserSetLocationTest.java, failure case
2023/10/11 09:18 amosshi Independent Philip Race Oracle JDK-8317888 DrawStringWithInfiniteXform.java failed with "RuntimeException: drawString with InfiniteXform transform takes long time"
2023/10/11 09:16 amosshi Independent Prasanta Sadhukhan Oracle JDK-8317887 [Test] Intermittent timeout with javax/swing JColorChooser Test
2023/10/11 08:27 Andrew Lu SAP Tobias Hartmann Oracle JDK-8317881 Failure during CompileOnly parsing leads to ShouldNotReachHere
2023/10/11 08:24 Andrew Lu SAP Vicente Arturo Romero Zaldivar Oracle JDK-8317879 Javac inferred type does not conform to equality constraint
2023/10/11 08:21 Andrew Lu SAP Harold Seigel Oracle JDK-8317878 JCK test .vm.classfmt.ins.code__002.code__00201m1.code__00201m1 hangs with -noverify
2023/10/11 07:28 Christoph Langer SAP Rajan Halade Oracle JDK-8317867 Framework for CA interoperability testing
2023/10/09 18:49 Roy Soumadipta Amazon (same) (same) JDK-8317748 Parallelize java/util/concurrent/tck/JSR166TestCase.java
2023/10/06 09:04 Christoph Langer SAP (same) (same) JDK-8317656 Exclude java/awt/font/Rotate/RotatedTextTest.java
2023/10/06 07:33 Christoph Langer SAP (same) (same) JDK-8318440 [11u] Remove designator DEFAULT_PROMOTED_VERSION_PRE=ea for release 11.0.21
2023/10/05 12:31 Aleksey Shipilev Amazon (same) (same) JDK-8317595 Better diagnostic header for VtableStub
2023/10/05 11:24 Yuri Nesterenko Azul Weijun Wang Oracle JDK-8317296 Arrays should be cloned in several JAAS Callback classes
2023/10/04 21:07 Roy Soumadipta Amazon (same) (same) JDK-8317557 Enable parallelism in vmTestbase/nsk/stress/numeric tests
2023/10/04 15:54 Roy Soumadipta Amazon (same) (same) JDK-8317526 Parallelize gc/stress/TestStressIHOPMultiThread.java test
2023/10/03 20:10 Goetz Lindenmaier SAP Thomas Stuefe Red Hat JDK-8317457 Thread stacksize is reported with wrong units in os::create_thread logging
2023/10/03 19:58 Goetz Lindenmaier SAP Thomas Stuefe Red Hat JDK-8317455 libjsig should ignore non-modifying sigaction calls
2023/09/29 15:54 amosshi Independent Alexander Zvegintsev Oracle JDK-8317323 java/awt/event/SequencedEvent/MultipleContextsFunctionalTest.java failed with "Total [200] - Expected [400]"
2023/09/29 15:52 amosshi Independent largeprimes @proton.me JDK-8317322 Off-by-one bug when searching arrays in AlpnGreaseTest
2023/09/29 09:54 Goetz Lindenmaier SAP Thomas Stuefe Red Hat JDK-8317303 DCmdArgument::parse_value() should handle NULL input
2023/09/28 15:18 Roy Soumadipta Amazon (same) (same) JDK-8317256 serviceability/sa/TestJmapCoreMetaspace.java should run with -XX:-VerifyDependencies
2023/09/28 14:03 Goetz Lindenmaier SAP Thomas Stuefe Red Hat JDK-8317250 Show stack dimensions in UL logging when attaching threads
2023/09/28 11:56 Yuri Nesterenko Azul (same) (same) JDK-8318439 Exclude cleaner test failing on older releases
2023/09/28 09:20 Andrew Lu SAP Jan Lahoda Oracle JDK-8317227 Verify 4th party information in src/jdk.internal.le/share/legal/jline.md
2023/09/27 08:53 Andrew Lu SAP Kevin Walls Oracle JDK-8317036 Handle control characters in java_lang_String::print
2023/09/27 08:50 Andrew Lu SAP Weibing Xiao Oracle JDK-8317035 com.sun.jndi.ldap.Connection.cleanup does not close connections on SocketTimeoutErrors
2023/09/27 08:21 Goetz Lindenmaier SAP Alexey Ivanov Oracle JDK-8317031 Test StretchedFontTest.java fails for Baekmuk font
2023/09/27 08:07 Goetz Lindenmaier SAP Harshitha Onkar Oracle JDK-8317026 [windows] Actual and Preferred Size of AWT Non-resizable frame are different
2023/09/22 15:48 Aleksey Shipilev Amazon (same) (same) JDK-8316754 Better diagnostic header for CodeBlobs
2023/09/22 07:09 Kimura Yukihiro Fujitsu Kimura Yukihiro Fujitsu JDK-8316717 The exception messages printed by jcmd ManagementAgent.start are corrupted on Japanese Windows
2023/09/22 07:07 Andrew Lu SAP Philip Race Oracle JDK-8316716 Update test java/awt/Choice/DragOffNoSelect.java
2023/09/22 07:03 Andrew Lu SAP Jayathirth D V Oracle JDK-8316715 Open source some AWT tests related to TextComponent and Toolkit
2023/09/22 06:46 Goetz Lindenmaier SAP Harshitha Onkar Oracle JDK-8316714 Make AwtFramePackTest generic by removing @requires tag
2023/09/22 06:46 Goetz Lindenmaier SAP Harshitha Onkar Oracle JDK-8316713 [windows] last button is not shown in AWT Frame with BorderLayout and MenuBar set.
2023/09/20 13:57 Aleksey Shipilev Amazon Christian Stein Oracle JDK-8316599 [GHA] Update checkout action to use v4
2023/09/20 10:37 Christoph Langer SAP (same) (same) JDK-8316380 [11u] Backport 8170089: nsk/jdi/EventSet/resume/resume008: ERROR: suspendCounts don't match for : Common-Cleaner
2023/09/18 15:04 Andrew Lu SAP Jonathan Gibbons Oracle JDK-8316429 T6587786.java failed after JDK-8189997
2023/09/15 10:47 Goetz Lindenmaier SAP Alexey Ivanov Oracle JDK-8316598 Ideographic characters aren't stretched by AffineTransform.scale(2, 1)
2023/09/15 07:45 Qi Ao Loongson (same) (same) JDK-8316339 The macro definition for LoongArch64 zero build is not accurate.
2023/09/14 15:37 Christoph Langer SAP Daniil Titov Oracle JDK-8316303 javax/management/remote/mandatory/connection/MultiThreadDeadLockTest.java possible deadlock
2023/09/14 15:34 Christoph Langer SAP (same) (same) JDK-8316302 java/lang/ProcessHandle/InfoTest.java fails on Windows when run as user with Administrator privileges
2023/09/14 15:34 Christoph Langer SAP Daniel Daugherty Oracle JDK-8316300 jdk/jshell/JdiHangingLaunchExecutionControlTest.java - launch timeout
2023/09/14 15:31 Christoph Langer SAP (same) (same) JDK-8315862 [11u] Backport 8227337: javax/management/remote/mandatory/connection/ReconnectTest.java NoSuchObjectException no such object in table
2023/09/13 20:57 Andrew Lu SAP Alexander Zuev Oracle JDK-8316222 Clean up and open source four Dialog related tests
2023/09/13 20:55 Chad Rakoczy Amazon (same) (same) JDK-8316221 C1: Uninitialized PhiResolver::_loop field
2023/09/13 20:54 Andrew Lu SAP Alexander Zuev Oracle JDK-8316220 Clean up and open source some AWT tests
2023/09/12 01:06 Fei Yang Independent Aleksey Shipilev Amazon JDK-8316059 Unsafe.allocateInstance should be intrinsified without UseUnalignedAccesses
2023/09/11 13:22 Christoph Langer SAP (same) (same) JDK-8316249 [11u] Exclude some failing Z-GC tests
2023/09/11 13:22 Christoph Langer SAP Chris Hegarty Independent JDK-8316012 (sctp) Flx link-local IPv6 scope handling and test cleanup.
2023/09/07 13:26 Martin Doerr SAP (same) (same) JDK-8316248 C1 compilation crashes in LinearScan::resolve_exception_edge
2023/09/07 08:04 Andrew Lu SAP Philip Race Oracle JDK-8315840 Open source AWT CardLayout and Checkbox tests
2023/09/05 20:48 Andrew Hughes Red Hat Haimay Chao Oracle JDK-8315725 Increase jdk.jar.maxSignatureFileSize default which is too low for JARs such as WhiteSource/Mend unified agent jar
2023/09/05 09:50 Aleksey Shipilev Amazon Tobias Holenstein Oracle JDK-8315682 C2 crash due to unexpected exception control flow
2023/09/05 09:48 Aleksey Shipilev Amazon (same) (same) JDK-8315681 GHA: Drop libfreetype6-dev transitional package in favor of libfreetype-dev
2023/09/04 08:37 Martin Doerr SAP Rajan Halade Oracle JDK-8315835 Add Certigna Root CA - 2
2023/09/04 06:40 Aleksey Shipilev Amazon (same) (same) JDK-8315597 GHA: Bootstrap sysroots with --variant=minbase
2023/09/01 16:34 Sergey Bylokhov Amazon (same) (same) JDK-8315553 GCC 7 reports compiler warning in bundled freetype 2.13.0
2023/09/01 13:22 Fei Yang Independent Aleksey Shipilev Amazon JDK-8315540 Improve Weak CAS VarHandle/Unsafe tests resilience under spurious failures
2023/09/01 13:03 Aleksey Shipilev Amazon (same) (same) JDK-8315480 [11u] Harmonize GHA cross-compilation block with mainline
2023/09/01 13:03 Aleksey Shipilev Amazon (same) (same) JDK-8315537 GHA: Cut down cross-compilation sysroots deeper
2023/08/31 16:32 Sergey Bylokhov Amazon Magnus Ihse Bursie Oracle JDK-8315477 Allow warnings to be disabled on a per-file basis
2023/08/31 15:04 Aleksey Shipilev Amazon Julian Waters Independent JDK-8315472 Minor improvements in MSYS2 Workflow handling
2023/08/31 15:03 Aleksey Shipilev Amazon (same) (same) JDK-8315470 GHA: qemu-debootstrap is deprecated, use the regular one
2023/08/31 15:02 Aleksey Shipilev Amazon (same) (same) JDK-8315469 GHA: Cut down cross-compilation sysroots
2023/08/31 04:21 Sergey Bylokhov Amazon (same) (same) JDK-8315430 MidiSystem.getSoundbank() throws unexpected SecurityException
2023/08/30 15:20 Andrei Pangin Amazon Vyom Tewari VMWare JDK-8315379 PlainSocketImpl.socketAccept() handles EINTR incorrectly
2023/08/30 15:16 Volker Simonis Amazon (same) (same) JDK-8315135 Memory leak in the native implementation of Pack200.Unpacker.unpack()
2023/08/30 08:47 Aleksey Shipilev Amazon (same) (same) JDK-8315345 GHA: Bump GCC versions for July 2023 updates
2023/08/30 08:47 Aleksey Shipilev Amazon Zixian Cai Independent JDK-8315344 GHA: Bump gcc versions
2023/08/30 08:47 Aleksey Shipilev Amazon Magnus Ihse Bursie Oracle JDK-8315343 Run GHA manually with user-specified make and configure arguments
2023/08/30 08:47 Aleksey Shipilev Amazon Magnus Ihse Bursie Oracle JDK-8315342 GHA: dump config.log in case of configure failure
2023/08/30 08:47 Aleksey Shipilev Amazon (same) (same) JDK-8315341 GHA: Harmonize GCC version handling for host and cross builds
2023/08/30 08:47 Aleksey Shipilev Amazon (same) (same) JDK-8315340 GHA: Bump to Ubuntu 22.04
2023/08/30 08:11 Goetz Lindenmaier SAP (same) (same) JDK-8312972 Bump update version for OpenJDK: jdk-11.0.22
2023/08/11 14:30 Yuri Nesterenko Azul Xuelei Fan Tencent JDK-8318437 Buffer clean in PasswordCallback
2021/04/21 14:20 Prasanta Sadhukhan Oracle (same) (same) JDK-8265678 Test java/awt/Focus/ActualFocusedWindowTest/ActualFocusedWindowBlockingTest.java fails intermittentently on windows

No changesets log

Committer push log

Alexey Bakhtin, Azul

Bug Summary
JDK-8323848 Allocate BadPaddingException only if it will be thrown
JDK-8323850 RSA signature verification fails on signed data that does not encode params correctly

amosshi, Independent

Bug Summary
JDK-8317887 [Test] Intermittent timeout with javax/swing JColorChooser Test
JDK-8318282 Add test coverage for processing of pending block files in signed JARs
JDK-8318494 Define jtreg jdk_desktop test group time-based sub-tasks for use by headful testing.
JDK-8317888 DrawStringWithInfiniteXform.java failed with "RuntimeException: drawString with InfiniteXform transform takes long time"
JDK-8318278 Improve readability of the test JarWithOneNonDisabledDigestAlg
JDK-8317323 java/awt/event/SequencedEvent/MultipleContextsFunctionalTest.java failed with "Total [200] - Expected [400]"
JDK-8318502 java/awt/Mouse/EnterExitEvents/DragWindowTest.java fails with "No MouseReleased event on label!"
JDK-8317890 jtreg time out of CtrlASCII.java seems to hang the Xserver.
JDK-8318045 Mark vmTestbase/vm/mlvm/meth/stress/compiler/deoptimize test as stress test
JDK-8318504 Missing coverage for javax.xml.crypto.dom.DOMCryptoContext
JDK-8317322 Off-by-one bug when searching arrays in AlpnGreaseTest
JDK-8317889 Screen capture for test JFileChooserSetLocationTest.java, failure case
JDK-8318280 Test runtime/jni/nativeStack/ needs to detach the native thread
JDK-8317891 Test javax/swing/dnd/7171812/bug7171812.java fails with java.lang.RuntimeException: Test failed, scroll on drag doesn't work
JDK-8317892 Update javax/swing/Popup/TaskbarPositionTest.java
JDK-8318797 Update VerifySignedJar to actually exercise and test verification
JDK-8318284 Write a test to check various components send Events while mouse and key are used simultaneously
JDK-8318276 Write a test to verify setAccelerator method of JMenuItem

Andrew Hughes, Red Hat

Bug Summary
JDK-8315725 Increase jdk.jar.maxSignatureFileSize default which is too low for JARs such as WhiteSource/Mend unified agent jar
JDK-8320705 NullPointerException in CertStore.getCRLs after 8297955

Andrew Lu, SAP

Bug Summary
JDK-8318697 [macos] JSpinner buttons in JColorChooser dialog may capture focus using TAB Key.
JDK-8320878 [mlvm] vm/mlvm/mixed/stress/regression/b6969574 fails and perf regression
JDK-8320876 Add four DigiCert root certificates
JDK-8320653 Add manual tests to open
JDK-8321103 Add three eMudhra emSign roots
JDK-8320388 Check boxes and radio buttons have rendering issues on Windows in High DPI env
JDK-8319515 Clarify TLABWasteTargetPercent flag
JDK-8316222 Clean up and open source four Dialog related tests
JDK-8316220 Clean up and open source some AWT tests
JDK-8320591 cleanup rawtypes warnings in open jndi tests
JDK-8317035 com.sun.jndi.ldap.Connection.cleanup does not close connections on SocketTimeoutErrors
JDK-8318120 com/sun/jdi/JdbOptions.java failed with "RuntimeException: 'prop[boo] = >foo 2<' missing from stdout/stderr"
JDK-8318121 com/sun/jdi/JdbOptions.java failed with "RuntimeException: 'prop[boo] = >foo<' missing from stdout/stderr"
JDK-8319930 Crash in HSpaceCounters::update_used()
JDK-8317881 Failure during CompileOnly parsing leads to ShouldNotReachHere
JDK-8317036 Handle control characters in java_lang_String::print
JDK-8318501 Increase buffer size for buf (insert_features_names) in Abstract_VM_Version::insert_features_names
JDK-8320659 Instrument FlowTest.java to provide more debug traces.
JDK-8320882 java/net/DatagramSocket/PortUnreachable.java still fails intermittently with BindException
JDK-8320881 java/net/DatagramSocket/PortUnreachable.java still fails intermittently with SocketTimeoutException
JDK-8320590 java/net/httpclient/whitebox/FlowTestDriver.java should not specify a TLS protocol
JDK-8317879 Javac inferred type does not conform to equality constraint
JDK-8319951 javax/net/ssl/DTLS/RespondToRetransmit.java timed out
JDK-8317878 JCK test .vm.classfmt.ins.code__002.code__00201m1.code__00201m1 hangs with -noverify
JDK-8315840 Open source AWT CardLayout and Checkbox tests
JDK-8316715 Open source some AWT tests related to TextComponent and Toolkit
JDK-8319950 Print count in "Too many recored phases?" assert
JDK-8320880 Replace wildcard address with loopback or local host in tests - part 9
JDK-8319785 Signed jars triggering Logger finder recursion and StackOverflowError
JDK-8319786 SignedLoggerFinderTest.java test failed
JDK-8316429 T6587786.java failed after JDK-8189997
JDK-8318698 TAB key cannot change input focus after the radio button in the Color Selection dialog
JDK-8319953 Test java/awt/Focus/ActualFocusedWindowTest/ActualFocusedWindowBlockingTest.java fails intermittentently on windows
JDK-8319787 Test SignedLoggerFinderTest.java is still failing
JDK-8319513 The socket is not closed in Connection::createSocket when the handshake failed for LDAP connection
JDK-8318503 Unexpected round errors in FreetypeFontScaler
JDK-8316716 Update test java/awt/Choice/DragOffNoSelect.java
JDK-8317227 Verify 4th party information in src/jdk.internal.le/share/legal/jline.md
JDK-8320879 vmTestbase/vm/mlvm/mixed/stress/regression/b6969574/INDIFY_Test.java fails with -Xcomp
JDK-8320389 ZGC: vmTestbase/gc/gctests/SoftReference/soft004/soft004.java fails with assert(_phases->length() <= 1000) failed: Too many recored phases?

Qi Ao, Loongson

Bug Summary
JDK-8316339 The macro definition for LoongArch64 zero build is not accurate.

Andrei Pangin, Amazon

Bug Summary
JDK-8315379 PlainSocketImpl.socketAccept() handles EINTR incorrectly

Chad Rakoczy, Amazon

Bug Summary
JDK-8316221 C1: Uninitialized PhiResolver::_loop field

Christoph Langer, SAP

Bug Summary
JDK-8323423 [11u] Remove designator DEFAULT_PROMOTED_VERSION_PRE=ea for release 11.0.22

Christoph Langer, SAP

Bug Summary
JDK-8316012 (sctp) Flx link-local IPv6 scope handling and test cleanup.
JDK-8316380 [11u] Backport 8170089: nsk/jdi/EventSet/resume/resume008: ERROR: suspendCounts don't match for : Common-Cleaner
JDK-8315862 [11u] Backport 8227337: javax/management/remote/mandatory/connection/ReconnectTest.java NoSuchObjectException no such object in table
JDK-8316249 [11u] Exclude some failing Z-GC tests
JDK-8318440 [11u] Remove designator DEFAULT_PROMOTED_VERSION_PRE=ea for release 11.0.21
JDK-8317656 Exclude java/awt/font/Rotate/RotatedTextTest.java
JDK-8317867 Framework for CA interoperability testing
JDK-8316302 java/lang/ProcessHandle/InfoTest.java fails on Windows when run as user with Administrator privileges
JDK-8316303 javax/management/remote/mandatory/connection/MultiThreadDeadLockTest.java possible deadlock
JDK-8316300 jdk/jshell/JdiHangingLaunchExecutionControlTest.java - launch timeout

Frederic Thevenet, Red Hat

Bug Summary
JDK-8319518 Target OS detection in 'test-prebuilt' makefile target is incorrect when running on MSYS2

Fei Yang, Independent

Bug Summary
JDK-8315540 Improve Weak CAS VarHandle/Unsafe tests resilience under spurious failures
JDK-8316059 Unsafe.allocateInstance should be intrinsified without UseUnalignedAccesses

Goetz Lindenmaier, SAP

Bug Summary
JDK-8319101 [macos] ProblemList java/rmi/registry/multipleRegistries/MultipleRegistries.java
JDK-8319095 [macosx] The text "big" is truncated in JTabbedPane
JDK-8317026 [windows] Actual and Preferred Size of AWT Non-resizable frame are different
JDK-8316713 [windows] last button is not shown in AWT Frame with BorderLayout and MenuBar set.
JDK-8319601 Add diagnostic output to test java/util/ProcessBuilder/Basic.java
JDK-8318790 Add java.security.Provider.getService JFR Event
JDK-8319611 Add new positioning options to PassFailJFrame test framework
JDK-8319100 Allow executeAndLog to accept running process
JDK-8312972 Bump update version for OpenJDK: jdk-11.0.22
JDK-8317303 DCmdArgument::parse_value() should handle NULL input
JDK-8319952 Deproblemlist few problemlisted test
JDK-8316598 Ideographic characters aren't stretched by AffineTransform.scale(2, 1)
JDK-8319610 jarsigner never shows a warning in badKeyUsage case
JDK-8318799 java/awt/dnd/NoFormatsDropTest/NoFormatsDropTest.java timed out
JDK-8318796 java/awt/PopupMenu/PopupMenuLocation.java is unstable in MacOS machines
JDK-8318789 javax/swing/JPopupMenu/7156657/bug7156657.java fails on macOS
JDK-8318791 JFR: Add SecurityProviderService#threshold to TestActiveSettingEvent.java
JDK-8319097 JFR: Don't commit JFR internal jdk.JavaMonitorWait events
JDK-8318931 JTREG: Clean up, remove unused imports in gc folder
JDK-8317455 libjsig should ignore non-modifying sigaction calls
JDK-8316714 Make AwtFramePackTest generic by removing @requires tag
JDK-8319694 ProgressMonitorInputStream not large file aware (>2GB)
JDK-8319504 Refactor java/lang/Runtime shell tests to java
JDK-8319508 Refactoring changes to PassFailJFrame Test Framework
JDK-8319693 Remove BadKeyUsageTest.java from Problem List
JDK-8319499 Remove hard-coded 127.0.0.1 loopback address in JDK networking tests
JDK-8319505 Remove jtreg tag manual=yesno for java/awt/print/PrinterJob/ImagePrinting/ClippedImages.java
JDK-8319608 Remove jtreg tag manual=yesno for java/awt/print/PrinterJob/PageRangesDlgTest.java
JDK-8318800 Remove UTF-8 character from TaskbarPositionTest.java
JDK-8319500 Replace wildcard address with loopback or local host in tests - part 1
JDK-8319501 Replace wildcard address with loopback or local host in tests - part 10
JDK-8319502 Replace wildcard address with loopback or local host in tests - part 19
JDK-8319600 Replace wildcard address with loopback or local host in tests - part 22
JDK-8319692 Replace wildcard address with loopback or local host in tests - part 23
JDK-8319503 Rewrite sun/management/jmxremote/bootstrap/CustomLauncherTest.java test to make binaries from source file
JDK-8317250 Show stack dimensions in UL logging when attaching threads
JDK-8319098 Some client related jtreg problem list entries are malformed
JDK-8319699 Test "java/awt/print/PrinterJob/ImagePrinting/PrintARGBImage.java" fails because the frames of instruction does not display
JDK-8317031 Test StretchedFontTest.java fails for Baekmuk font
JDK-8317457 Thread stacksize is reported with wrong units in os::create_thread logging
JDK-8319612 Update applications/scimark/Scimark.java to accept VM flags

Johannes Bechberger, SAP

Bug Summary
JDK-8319614 JDWP-agent sends broken exception event with onthrow option

Kangcheng Xu, Independent

Bug Summary
JDK-8320893 (dc) DatagramChannel.read() throws exception instead of discarding data when buffer too small
JDK-8318830 jdk.test.lib.util.JarUtils updates jar files incorrectly
JDK-8318793 Platform.isTieredSupported should handle the no-compiler case

Kimura Yukihiro, Fujitsu

Bug Summary
JDK-8316717 The exception messages printed by jcmd ManagementAgent.start are corrupted on Japanese Windows

Ludovic Henry, Rivos

Bug Summary
JDK-8319739 (process) jspawnhelper should not use argv[0]

Mat Carter, Microsoft

Bug Summary
JDK-8318052 SunMSCAPI provider leaks memory and keys

Matthias Baesken, SAP

Bug Summary
JDK-8318273 avoid potential leaks in KeystoreImpl.m related to JNU_CHECK_EXCEPTION early returns
JDK-8319627 Do not run sun/tools/jhsdb tests concurrently
JDK-8318271 report some fontconfig related environment variables in hs_err file
JDK-8319085 use close after failing os::fdopen in vmError and ciEnv

Martin Doerr, SAP

Bug Summary
JDK-8315835 Add Certigna Root CA - 2
JDK-8316248 C1 compilation crashes in LinearScan::resolve_exception_edge
JDK-8320748 Top of lock-stack does not match the unlocked object

ogata.toshitaka, Fujitsu

Bug Summary
JDK-8319093 [TESTBUG] serviceability/sa/TestUniverse.java looks for wrong string with Shenandoah
JDK-8319073 Clean up serviceability/sa/TestUniverse.java

Prasanta Sadhukhan, Oracle

Bug Summary
JDK-8265678 Test java/awt/Focus/ActualFocusedWindowTest/ActualFocusedWindowBlockingTest.java fails intermittentently on windows

pushkar.kulkarni, Canonical

Bug Summary
JDK-8320411 JFR: FlightRecorderOptions reset date format

Roy Soumadipta, Amazon

Bug Summary
JDK-8317557 Enable parallelism in vmTestbase/nsk/stress/numeric tests
JDK-8317526 Parallelize gc/stress/TestStressIHOPMultiThread.java test
JDK-8320883 Parallelize gc/stress/TestStressRSetCoarsening.java test
JDK-8317748 Parallelize java/util/concurrent/tck/JSR166TestCase.java
JDK-8317256 serviceability/sa/TestJmapCoreMetaspace.java should run with -XX:-VerifyDependencies

Ralf Schmelter, SAP

Bug Summary
JDK-8319530 jdk/jfr/jvm/TestDumpOnCrash.java fails on Linux ppc64le and Linux aarch64
JDK-8319529 JfrStructCopyFailed uses heap words instead of bytes for object sizes
JDK-8319057 Metadata for regionsRefilled of G1EvacuationStatistics event is wrong

Sergey Bylokhov, Amazon

Bug Summary
JDK-8315477 Allow warnings to be disabled on a per-file basis
JDK-8315553 GCC 7 reports compiler warning in bundled freetype 2.13.0
JDK-8315430 MidiSystem.getSoundbank() throws unexpected SecurityException

Severin Gehwolf, Red Hat

Bug Summary
JDK-8320521 Add Let's Encrypt ISRG Root X2
JDK-8319646 Add Telia Root CA v2

Aleksey Shipilev, Amazon

Bug Summary
JDK-8315480 [11u] Harmonize GHA cross-compilation block with mainline
JDK-8318287 [GHA] get-bootjdk action should return the abolute path
JDK-8316599 [GHA] Update checkout action to use v4
JDK-8316754 Better diagnostic header for CodeBlobs
JDK-8317595 Better diagnostic header for VtableStub
JDK-8315682 C2 crash due to unexpected exception control flow
JDK-8315597 GHA: Bootstrap sysroots with --variant=minbase
JDK-8315344 GHA: Bump gcc versions
JDK-8315345 GHA: Bump GCC versions for July 2023 updates
JDK-8315340 GHA: Bump to Ubuntu 22.04
JDK-8315469 GHA: Cut down cross-compilation sysroots
JDK-8315537 GHA: Cut down cross-compilation sysroots deeper
JDK-8315681 GHA: Drop libfreetype6-dev transitional package in favor of libfreetype-dev
JDK-8315342 GHA: dump config.log in case of configure failure
JDK-8315341 GHA: Harmonize GCC version handling for host and cross builds
JDK-8315470 GHA: qemu-debootstrap is deprecated, use the regular one
JDK-8315472 Minor improvements in MSYS2 Workflow handling
JDK-8315343 Run GHA manually with user-specified make and configure arguments

Volker Simonis, Amazon

Bug Summary
JDK-8315135 Memory leak in the native implementation of Pack200.Unpacker.unpack()

Sun Guoyun, Loongson

Bug Summary
JDK-8318954 CDS dumping of springboot asserts in G1ArchiveAllocator::alloc_new_region

Sonia Zaldana Calles, Red Hat

Bug Summary
JDK-8319834 (cal) Japanese calendar unit test system should avoid multiple static imports
JDK-8319833 (fs) Print size values in java/nio/file/FileStore/Basic.java when they differ by > 1GiB
JDK-8319831 [Testbug] Fix for 8144279 didn't define a test case!
JDK-8319830 [TESTBUG] Improve test configuration for shared strings
JDK-8319832 [TESTBUG] Remove defmeth tests for class file versions 50 and 51
JDK-8319511 Add sanity check for signal handler modification warning.
JDK-8319517 Enhance test/jdk/javax/net/ssl/TLSCommon/SSLEngineTestCase.java to handle default cases
JDK-8320895 Objects.requireNonNull should be ForceInline
JDK-8319512 Open source several choice AWT tests
JDK-8319836 Open source some AWT tests relating to Button and a few other classes
JDK-8319237 Provide a reason for PassFailJFrame.forceFail
JDK-8320896 sun.awt.X11.ListHelper.removeAll() should use clear()
JDK-8320326 Tests for AffirmTrust roots
JDK-8320894 Wrong font ligatures used when 2 versions of same font used

Yuri Nesterenko, Azul

Bug Summary
JDK-8317296 Arrays should be cloned in several JAAS Callback classes
JDK-8318437 Buffer clean in PasswordCallback
JDK-8318439 Exclude cleaner test failing on older releases

yibo.yl, Alibaba

Bug Summary
JDK-8319183 Socket.connect does not timeout when profiling