PUSHES REPORT: 11.0.23

This report shows who pushed the backports to the given release. This usually shows who did the backporting, testing, and review work.

Report generated: Fri Mar 01 06:02:15 CET 2024

Distribution by priority

Count Priority
1 P1
8 P2
64 P3
170 P4
3 P5

Distribution by components

Count Component
246 100% Total
87 35.4% hotspot
34 13.8% hotspot/runtime
25 10.2% hotspot/compiler
10 4.1% hotspot/gc
10 4.1% hotspot/test
3 1.2% hotspot/jvmti
2 0.8% hotspot/jfr
2 0.8% hotspot/svc
1 0.4% hotspot
64 26.0% client-libs
27 11.0% client-libs/java.awt
27 11.0% client-libs/javax.swing
5 2.0% client-libs/2d
3 1.2% client-libs
2 0.8% client-libs/javax.sound
30 12.2% core-libs
6 2.4% core-libs/java.net
5 2.0% core-libs/java.io
4 1.6% core-libs/java.nio
3 1.2% core-libs/java.time
2 0.8% core-libs/java.util.logging
2 0.8% core-libs
2 0.8% core-libs/javax.naming
2 0.8% core-libs/java.lang
1 0.4% core-libs/javax.script
1 0.4% core-libs/java.util
1 0.4% core-libs/java.lang.invoke
1 0.4% core-libs/java.util:i18n
21 8.5% security-libs
10 4.1% security-libs/java.security
3 1.2% security-libs/javax.xml.crypto
3 1.2% security-libs
1 0.4% security-libs/javax.smartcardio
1 0.4% security-libs/jdk.security
1 0.4% security-libs/javax.security
1 0.4% security-libs/javax.net.ssl
1 0.4% security-libs/org.ietf.jgss:krb5
17 6.9% core-svc
7 2.8% core-svc/debugger
5 2.0% core-svc/java.lang.management
2 0.8% core-svc/javax.management
2 0.8% core-svc/java.lang.instrument
1 0.4% core-svc/tools
11 4.5% tools
8 3.3% tools/javac
1 0.4% tools/javap
1 0.4% tools/javadoc(tool)
1 0.4% tools/jar
10 4.1% infrastructure
8 3.3% infrastructure/build
1 0.4% infrastructure/release_eng
1 0.4% infrastructure
4 1.6% xml
3 1.2% xml/jaxp
1 0.4% xml/javax.xml.stream
2 0.8% other-libs
2 0.8% other-libs/other

Distribution by affiliation

This Release Pushes

Original Pushes

Count Committer
245 100% Total
197 80.4% SAP
90 36.7% Amos SHI
80 32.7% Andrew Lu
15 6.1% Goetz Lindenmaier
6 2.4% Matthias Baesken
3 1.2% Christoph Langer
2 0.8% Johannes Bechberger
1 0.4% Martin Doerr
19 7.8% Amazon
7 2.9% Sergey Bylokhov
6 2.4% Aleksey Shipilev
2 0.8% Paul Hohensee
2 0.8% Dan Lutker
2 0.8% Elif Aslan
11 4.5% Red Hat
4 1.6% Sonia Zaldana Calles
4 1.6% Jonathan Dowland
3 1.2% Andrew Hughes
5 2.0% Unknown
4 1.6% abobrov
1 0.4% syan
3 1.2% Fujitsu
2 0.8% tabata.daishi
1 0.4% Kimura Yukihiro
3 1.2% IBM
2 0.8% Shruthi Acharya
1 0.4% Ichiroh Takiguchi
2 0.8% Azul
2 0.8% Alexey Bakhtin
2 0.8% DataDog
2 0.8% Jaroslav Bachorík
2 0.8% Google
2 0.8% Liam Miller-Cushon
1 0.4% Alibaba
1 0.4% Liang Mao
Count Committer
246 100% Total
187 76.0% Oracle
20 8.1% Igor Ignatyev
14 5.7% Prasanta Sadhukhan
8 3.3% Damon Nguyen
5 2.0% Abhishek Kumar
4 1.6% Harshitha Onkar
4 1.6% Weijun Wang
4 1.6% Sibabrata Sahoo
4 1.6% Brian Burkhalter
4 1.6% Calvin Cheung
4 1.6% Kevin Walls
4 1.6% Alexander Zvegintsev
4 1.6% Leonid Mesnik
4 1.6% Jonathan Gibbons
3 1.2% Tejesh R
3 1.2% Evgeny Nikitin
3 1.2% Daniel Fuchs
3 1.2% Thomas Schatzl
3 1.2% Daniel Daugherty
3 1.2% Emanuel Peter
3 1.2% David Holmes
3 1.2% Chris Plummer
3 1.2% Ioi Lam
3 1.2% Rajan Halade
3 1.2% Renjith Kannath Pariyangad
3 1.2% Harold Seigel
3 1.2% Joe Darcy
3 1.2% Alisen Chung
2 0.8% Jayathirth D V
2 0.8% Leo Korinth
2 0.8% Darragh Clarke
2 0.8% Rajat Mahajan
2 0.8% Bill Huang
2 0.8% johny.jose
2 0.8% Gary Adams
2 0.8% Lawrence Andrews
2 0.8% Aleksandre Iline
2 0.8% Coleen Phillimore
2 0.8% Alexey Ivanov
2 0.8% Weibing Xiao
2 0.8% Justin Lu
1 0.4% Frank Yuan
1 0.4% Ludvig Janiuk
1 0.4% Sean Mullan
1 0.4% Yoshiki Sato
1 0.4% Albert Yang
1 0.4% Mark Powers
1 0.4% Joe Wang
1 0.4% Ravi Reddy
1 0.4% Gerard Ziemski
1 0.4% Douglas Simon
1 0.4% Stefan Johansson
1 0.4% Sean Coffey
1 0.4% Roger Riggs
1 0.4% Christian Tornqvist
1 0.4% Valerie Peng
1 0.4% Stefan Karlsson
1 0.4% Gergö Barany
1 0.4% Tobias Hartmann
1 0.4% Erik Österlund
1 0.4% Alex Menkov
1 0.4% David Leopoldseder
1 0.4% Ekaterina Pavlova
1 0.4% Erik Gahlin
1 0.4% Fernando Guallini
1 0.4% Vicente Arturo Romero Zaldivar
1 0.4% Christian Stein
1 0.4% Mikhailo Seledtsov
1 0.4% Ravi Gupta
1 0.4% Aleksej Efimov
1 0.4% Axel Boldt-Christmas
1 0.4% Daniil Titov
1 0.4% Naoto Sato
1 0.4% Jaikiran Pai
1 0.4% Ramkumar Sunderbabu
1 0.4% Christian Hagedorn
1 0.4% Philip Race
18 7.3% SAP
8 3.3% Matthias Baesken
3 1.2% Goetz Lindenmaier
2 0.8% Christoph Langer
2 0.8% Martin Doerr
2 0.8% Johannes Bechberger
1 0.4% Amos SHI
13 5.3% Amazon
5 2.0% Aleksey Shipilev
4 1.6% Sergey Bylokhov
2 0.8% Paul Hohensee
2 0.8% Elif Aslan
5 2.0% Independent
2 0.8% Rahul Raghavan
1 0.4% ae40515
1 0.4% darraghclarke98
1 0.4% gregor
4 1.6% Red Hat
2 0.8% Andrew Hughes
1 0.4% Jonathan Dowland
1 0.4% Severin Gehwolf
3 1.2% Tencent
1 0.4% Jie Fu
1 0.4% Xuelei Fan
1 0.4% John Jiang
2 0.8% Alibaba
2 0.8% yansendao.ysd
2 0.8% DataDog
2 0.8% Jaroslav Bachorík
2 0.8% Fujitsu
1 0.4% Kimura Yukihiro
1 0.4% Masanori Yano
2 0.8% Google
1 0.4% Jean Christophe Beyler
1 0.4% Liam Miller-Cushon
2 0.8% IBM
1 0.4% Ichiroh Takiguchi
1 0.4% gaurav.chaudhari
1 0.4% ARM
1 0.4% Bhavana Kilambi
1 0.4% Huawei
1 0.4% Hamlin Li
1 0.4% Intel
1 0.4% Sandhya Viswanathan
1 0.4% Loongson
1 0.4% Sun Yaqi
1 0.4% Rivos
1 0.4% Robbin Ehn
1 0.4% Unknown
1 0.4% abobrov

Chronological push log:

UTC Time This Release Push By Original Push By Bug Summary
Name Affiliation Name Affiliation
2024/02/27 12:21 abobrov Unknown Darragh Clarke Oracle JDK-8326826 java/net/HttpURLConnection/HttpURLConnectionExpectContinueTest.java fails intermittently in timeout
2024/02/27 10:28 Aleksey Shipilev Amazon Christian Stein Oracle JDK-8326822 [TESTLIB] Enhance JAXPPolicyManager to setup required permissions for jtreg version 7 jar
2024/02/27 10:20 Aleksey Shipilev Amazon Jonathan Gibbons Oracle JDK-8326821 clean up use of bad arguments for `@clean` in langtools tests
2024/02/27 09:53 Amos SHI SAP Brian Burkhalter Oracle JDK-8326777 java/io/File/createTempFile/SpecialTempFile.java fails in Windows 11
2024/02/27 09:37 Aleksey Shipilev Amazon Christian Tornqvist Oracle JDK-8326767 Make applications/jcstress invoke tests in batches
2024/02/27 09:26 abobrov Unknown Darragh Clarke Oracle JDK-8326766 Test java/net/HttpURLConnection/HttpURLConnectionExpectContinueTest.java failed: java.net.BindException: Address already in use
2024/02/26 18:20 Sergey Bylokhov Amazon Rajat Mahajan Oracle JDK-8326697 JDK-8294427 breaks Windows L&F on all older Windows versions
2024/02/26 15:50 abobrov Unknown (same) (same) JDK-8326503 [11u] java/net/HttpURLConnection/HttpURLConnectionExpectContinueTest.java fail because of package org.junit.jupiter.api does not exist
2024/02/26 08:53 Aleksey Shipilev Amazon (same) (same) JDK-8326640 Create test alias "all" for all test roots
2024/02/26 07:07 Andrew Lu SAP Alexey Ivanov Oracle JDK-8326633 HTML formatting for PassFailJFrame instructions
2024/02/23 17:20 Andrew Hughes Red Hat Justin Lu Oracle JDK-8326593 ISO 4217 Amendment 176 Update
2024/02/23 09:06 Andrew Lu SAP Lawrence Andrews Oracle JDK-8326563 Add screen capture functionality to PassFailJFrame
2024/02/23 08:46 Goetz Lindenmaier SAP Rajan Halade Oracle JDK-8326560 Add Certainly roots R1 and E1
2024/02/23 07:54 Andrew Lu SAP Alisen Chung Oracle JDK-8326556 Move more DnD tests to open
2024/02/23 02:29 Andrew Lu SAP Damon Nguyen Oracle JDK-8326539 Open source more AWT DnD related tests
2024/02/22 18:04 syan Unknown yansendao.ysd Alibaba JDK-8326520 [TESTBUG]testMemoryFailCount in jdk/internal/platform/docker/TestDockerMemoryMetrics.java always fail because OOM killed
2024/02/22 09:53 abobrov Unknown darraghclarke98 Independent JDK-8326480 HttpURLConnection timeouts with Expect: 100-Continue and no chunking
2024/02/22 07:53 Amos SHI SAP Prasanta Sadhukhan Oracle JDK-8326466 Open source swing security manager test
2024/02/22 02:59 Andrew Lu SAP Tejesh R Oracle JDK-8326445 Open source several AWT Miscellaneous tests
2024/02/22 02:56 Andrew Lu SAP Tejesh R Oracle JDK-8326444 Open source several AWT TextArea related tests
2024/02/22 02:55 Andrew Lu SAP Alexander Zvegintsev Oracle JDK-8326443 Open source several container and component AWT tests
2024/02/22 02:55 Andrew Lu SAP Prasanta Sadhukhan Oracle JDK-8326442 Open source few Swing JComponent and AbstractButton tests
2024/02/21 16:44 Andrew Hughes Red Hat (same) (same) JDK-8326109 GCC 13 reports maybe-uninitialized warnings for jni.cpp with dtrace enabled
2024/02/19 09:34 Andrew Lu SAP Tobias Hartmann Oracle JDK-8326153 compiler/tiered/LevelTransitionTest.java fails with -XX:CompileThreshold=100 -XX:TieredStopAtLevel=1
2024/02/19 08:45 Amos SHI SAP gregor Independent JDK-8326148 Fix comment typo in PKCS12Passwd.java
2024/02/19 08:44 Amos SHI SAP Matthias Baesken SAP JDK-8326147 test/jdk/com/sun/jndi/ldap/LdapPoolTimeoutTest.java fails with ConnectException: Connection timed out: no further information
2024/02/19 08:43 Amos SHI SAP gaurav.chaudhari IBM JDK-8326144 Fixup of jar filename typo in BadFactoryTest.sh
2024/02/19 08:41 Amos SHI SAP Gergö Barany Oracle JDK-8326142 java/lang/ref/ReachabilityFenceTest.java should run with -Xbatch
2024/02/19 08:41 Amos SHI SAP Thomas Schatzl Oracle JDK-8326141 jdk/jfr/event/gc/collection/TestGCCauseWith[Serial|Parallel].java : GC cause 'GCLocker Initiated GC' not in the valid causes
2024/02/19 08:37 Johannes Bechberger SAP (same) (same) JDK-8326138 com/sun/jdi/JdwpOnThrowTest.java failed with "transport error 202: bind failed: Address already in use"
2024/02/19 08:36 Amos SHI SAP Leo Korinth Oracle JDK-8326137 GC: Make TestArrayAllocatorMallocLimit use createTestJvm
2024/02/19 08:35 Amos SHI SAP Jonathan Gibbons Oracle JDK-8326136 Fix deprecation warnings in DPrinter
2024/02/17 11:26 Sergey Bylokhov Amazon (same) (same) JDK-8326098 Enable "maybe-uninitialized" warning for FreeType 2.13.1
2024/02/16 09:56 Goetz Lindenmaier SAP Leonid Mesnik Oracle JDK-8326036 StackWalkTest.java fails after CODETOOLS-7903373
2024/02/16 04:49 Sergey Bylokhov Amazon (same) (same) JDK-8326017 Parallelize sun/java2d/marlin/ClipShapeTest.java
2024/02/15 21:50 Jonathan Dowland Red Hat (same) (same) JDK-8324307 [11u] hotspot fails to build with GCC 12 and newer (non-static data member initializers)
2024/02/15 21:50 Jonathan Dowland Red Hat Ioi Lam Oracle JDK-8325997 Always initialize _body[0..1] in Symbol constructor
2024/02/15 17:08 Johannes Bechberger SAP (same) (same) JDK-8325985 AsyncGetCallTrace can cause SIGBUS on M1
2024/02/15 09:06 Jonathan Dowland Red Hat Ioi Lam Oracle JDK-8325931 GCC 10 warning stringop-overflow with symbol code
2024/02/09 18:52 Dan Lutker Amazon johny.jose Oracle JDK-8325571 (tz) Update Timezone Data to 2024a
2024/02/07 07:42 Elif Aslan Amazon (same) (same) JDK-8325388 Enable parallelism in vmTestbase/nsk/stress/threads tests
2024/02/07 07:42 Elif Aslan Amazon (same) (same) JDK-8325387 Enable parallelism in vmTestbase/nsk/stress/jni tests
2024/02/07 07:37 Aleksey Shipilev Amazon Sean Coffey Oracle JDK-8325385 Test java/security/cert/CertPathBuilder/akiExt/AKISerialNumber.java is failing
2024/02/06 08:07 Amos SHI SAP Erik Gahlin Oracle JDK-8325308 JFR: Periodic task thread uses period for method sampling events
2024/02/06 02:03 Andrew Lu SAP David Holmes Oracle JDK-8325276 JNI invocation of an abstract instance method corrupts the stack
2024/02/06 02:01 Andrew Lu SAP Alexander Zvegintsev Oracle JDK-8325275 Open source several clipboard and color AWT tests
2024/02/06 02:01 Andrew Lu SAP Leonid Mesnik Oracle JDK-8325274 OutputAnalyzer.shouldMatchByLine() fails in some cases
2024/02/05 14:46 Jonathan Dowland Red Hat Harshitha Onkar Oracle JDK-8325250 Open source several Swing Text related tests
2024/02/01 08:15 Amos SHI SAP Prasanta Sadhukhan Oracle JDK-8325101 Open source swing text/html and tree test
2024/02/01 08:13 Amos SHI SAP David Leopoldseder Oracle JDK-8325100 [JVMCI] compiler/unsafe/UnsafeGetStableArrayElement test asserts wrong values with Graal
2024/01/31 13:09 Amos SHI SAP Evgeny Nikitin Oracle JDK-8325051 vmTestbase/../stress/compiler/deoptimize/Test.java fails with OOME due to CodeCache exhaustion.
2024/01/31 02:15 Andrew Lu SAP Thomas Schatzl Oracle JDK-8325008 gc/g1/ihop/TestIHOPStatic.java fails due to extra concurrent mark with -Xcomp
2024/01/31 02:15 Andrew Lu SAP Sun Yaqi Loongson JDK-8325007 java/nio/file/Files/CopyAndMove.java fails when using second test directory
2024/01/31 02:15 Andrew Lu SAP Rajan Halade Oracle JDK-8325006 ListKeychainStore.sh fails in some virtualized environments
2024/01/31 02:13 Andrew Lu SAP Joe Darcy Oracle JDK-8325005 Using -proc:full should be considered requesting explicit annotation processing
2024/01/30 13:03 Amos SHI SAP Prasanta Sadhukhan Oracle JDK-8324963 [macos14] javax/swing/JMenuItem/4654927/bug4654927.java: component must be showing on the screen to determine its location
2024/01/30 13:03 Amos SHI SAP Daniel Fuchs Oracle JDK-8324962 java/nio/channels/DatagramChannel/Connect.java timed out
2024/01/30 13:01 Amos SHI SAP Abhishek Kumar Oracle JDK-8324959 Open source few swing JInternalFrame and JMenuBar tests
2024/01/30 13:00 Amos SHI SAP Kevin Walls Oracle JDK-8324958 MonitorVmStartTerminate.java timed out
2024/01/30 12:59 Amos SHI SAP Justin Lu Oracle JDK-8324957 KeytoolReaderP12Test.java fail on localized Windows platform
2024/01/30 12:59 Amos SHI SAP Prasanta Sadhukhan Oracle JDK-8324956 Open source few more headless Swing misc tests
2024/01/30 12:57 Amos SHI SAP Ramkumar Sunderbabu Oracle JDK-8324955 gc/lock tests failed with "OutOfMemoryError: Java heap space: failed reallocation of scalar replaced objects"
2024/01/30 12:57 Amos SHI SAP Igor Ignatyev Oracle JDK-8324954 mark hotspot runtime/cds tests which ignore external VM flags
2024/01/30 12:55 Amos SHI SAP Igor Ignatyev Oracle JDK-8324953 runtime/cds/appcds/MoveJDKTest.java doesn't check exit codes
2024/01/30 12:54 Amos SHI SAP Joe Darcy Oracle JDK-8324951 Rename javac test T6395981.java to be more informative
2024/01/30 12:00 Goetz Lindenmaier SAP Weibing Xiao Oracle JDK-8324947 File.mkdirs() occasionally fails to create folders on Windows shared folder
2024/01/29 14:13 Andrew Hughes Red Hat (same) (same) JDK-8324843 Windows VS2010 build failed with "error C2275: 'int64_t'"
2024/01/29 09:12 Aleksey Shipilev Amazon (same) (same) JDK-8324825 GHA: Generic jtreg errors are not reported
2024/01/29 08:24 Andrew Lu SAP Abhishek Kumar Oracle JDK-8324821 Open source few swing JList and JMenuBar tests
2024/01/29 07:46 Goetz Lindenmaier SAP Weibing Xiao Oracle JDK-8324818 Better Error Handling for Jar Tool When Processing Non-existent Files
2024/01/29 02:03 Andrew Lu SAP Joe Darcy Oracle JDK-8324804 Add -proc:full to describe current default annotation processing policy
2024/01/26 02:17 Andrew Lu SAP Ravi Gupta Oracle JDK-8324744 Write a test to check textArea triggers MouseEntered/MouseExited events properly
2024/01/25 15:54 Christoph Langer SAP Jayathirth D V Oracle JDK-8324726 java/awt/image/MultiResolutionImage/MultiResolutionImageObserverTest.java fails
2024/01/25 10:18 Goetz Lindenmaier SAP Robbin Ehn Rivos JDK-8324716 JVM/TI GetCurrentContendedMonitor/contmon001 failed due to "(IsSameObject#3) unexpected monitor object: 0x000000562336DBA8"
2024/01/25 02:25 Andrew Lu SAP Philip Race Oracle JDK-8324669 [test bug] javax/swing/JTableHeader/6889007/bug6889007.java fails
2024/01/24 14:03 Kimura Yukihiro Fujitsu (same) (same) JDK-8324633 jdk/java/lang/instrument/BootClassPath/BootClassPathTest.sh fails on Japanese Windows
2024/01/23 09:04 Goetz Lindenmaier SAP Weijun Wang Oracle JDK-8324493 Update XML Security for Java to 3.0.3
2024/01/22 08:42 Andrew Lu SAP Renjith Kannath Pariyangad Oracle JDK-8324282 WheelModifier.java fails by timeout
2024/01/19 15:47 Goetz Lindenmaier SAP Weijun Wang Oracle JDK-8324215 Update XML Security for Java to 3.0.2
2024/01/18 15:12 Goetz Lindenmaier SAP Matthias Baesken SAP JDK-8324146 filter out harmful -std* flags added by autoconf from CXX
2024/01/18 08:03 Matthias Baesken SAP (same) (same) JDK-8324112 Add ReleaseIntArrayElements in Java_sun_awt_X11_XlibWrapper_SetBitmapShape XlbWrapper.c to early return
2024/01/18 07:52 Andrew Lu SAP Prasanta Sadhukhan Oracle JDK-8324111 Open source few headless Swing misc tests
2024/01/17 08:53 Andrew Lu SAP Sibabrata Sahoo Oracle JDK-8323971 Add a new test library API to execute kinit in SecurityTools.java
2024/01/17 08:52 Andrew Lu SAP Stefan Karlsson Oracle JDK-8323970 TestSystemGC uses "require vm.gc.G1" for large pages subtest
2024/01/17 08:52 Andrew Lu SAP Aleksey Shipilev Amazon JDK-8323969 gc/TestSystemGC.java large pages subtest fails with ZGC
2024/01/17 08:46 Andrew Lu SAP Renjith Kannath Pariyangad Oracle JDK-8323967 Improve stability of WheelModifier.java test
2024/01/16 09:59 Andrew Lu SAP Weijun Wang Oracle JDK-8323783 Update Public Suffix List to b5bf572
2024/01/16 09:03 Goetz Lindenmaier SAP Ravi Reddy Oracle JDK-8323778 [BACKOUT] 8225377: type annotations are not visible to javac plugins across compilation boundaries
2024/01/16 04:47 Sergey Bylokhov Amazon Martin Doerr SAP JDK-8323758 [AIX] vmTestbase/nsk/jvmti/RunAgentThread/agentthr001/TestDescription.java crashing due to empty while loop
2024/01/15 09:25 Andrew Lu SAP Harshitha Onkar Oracle JDK-8323714 Open Source JFrame, JIF related Swing Tests
2024/01/15 09:24 Andrew Lu SAP Damon Nguyen Oracle JDK-8323713 Open source more AWT Drag & Drop tests
2024/01/12 13:07 Liang Mao Alibaba Bhavana Kilambi ARM JDK-8323665 Enable Neoverse N1 optimizations for Arm Neoverse V1 & N2
2024/01/12 02:02 Andrew Lu SAP Prasanta Sadhukhan Oracle JDK-8323639 Open source AWT misc tests
2024/01/11 16:11 Goetz Lindenmaier SAP Sean Mullan Oracle JDK-8323604 Enable XML Signature secure validation mode by default
2024/01/10 08:33 Andrew Lu SAP Kevin Walls Oracle JDK-8323493 MemoryPoolMBean/isUsageThresholdExceeded tests failed with "isUsageThresholdExceeded() returned false, and is still false, while threshold = MMMMMMM and used peak = NNNNNNN"
2024/01/10 08:32 Andrew Lu SAP Abhishek Kumar Oracle JDK-8323492 Open source AWT MenuItem related tests
2024/01/10 08:32 Andrew Lu SAP Abhishek Kumar Oracle JDK-8323491 Open source AWT KeyBoardFocusManger, LightWeightComponent related tests
2024/01/10 08:31 Andrew Lu SAP Alex Menkov Oracle JDK-8323490 NullPointerException because listenAddress[0] is null
2024/01/10 08:29 Andrew Lu SAP Alexander Zvegintsev Oracle JDK-8323489 Open source several container AWT tests
2024/01/10 01:08 Ichiroh Takiguchi IBM (same) (same) JDK-8323434 Chinese characters in RTF are not decoded
2024/01/09 22:19 Christoph Langer SAP (same) (same) JDK-8324108 [11u] Remove designator DEFAULT_PROMOTED_VERSION_PRE=ea for release 11.0.22
2024/01/09 21:44 Christoph Langer SAP (same) (same) JDK-8323426 Clean up code after JDK-8322417
2024/01/09 17:24 Dan Lutker Amazon johny.jose Oracle JDK-8323342 (tz) Update Timezone Data to 2023d
2024/01/09 15:38 Goetz Lindenmaier SAP Sandhya Viswanathan Intel JDK-8323326 Incorrect x86 instruction encoding for VSIB addressing mode
2024/01/09 15:32 Goetz Lindenmaier SAP (same) (same) JDK-8323324 [17u/11u] Redo JDK-8297951: C2: Create skeleton predicates for all If nodes in loop predication
2024/01/09 15:30 Amos SHI SAP Harshitha Onkar Oracle JDK-8323322 Update HarfBuzz to 8.2.2
2024/01/08 10:55 Amos SHI SAP Kevin Walls Oracle JDK-8323168 Remove vmTestbase/nsk/monitoring/ThreadMXBean/ThreadInfo/Deadlock/JavaDeadlock001/TestDescription.java from problemlist.
2024/01/08 10:50 Amos SHI SAP Mikhailo Seledtsov Oracle JDK-8323165 Add diagnostic logging to VMProps.checkDockerSupport
2024/01/08 10:45 Amos SHI SAP Prasanta Sadhukhan Oracle JDK-8323164 javax/swing/JTree/6263446/bug6263446.java fails intermittently on a VM
2024/01/08 10:43 Amos SHI SAP Alisen Chung Oracle JDK-8323163 DnD test DisposeFrameOnDragTest.java does not clean up
2024/01/08 09:19 Goetz Lindenmaier SAP (same) (same) JDK-8323150 Console read line with zero out should zero out when throwing exception
2024/01/08 08:51 Andrew Lu SAP Sergey Bylokhov Amazon JDK-8323141 [macos] java/awt/Focus/UnaccessibleChoice/AccessibleChoiceTest.java fails
2024/01/08 08:51 Andrew Lu SAP Damon Nguyen Oracle JDK-8323140 [macos] java/awt/Focus/UnaccessibleChoice/AccessibleChoiceTest.java fails
2024/01/08 02:12 Andrew Lu SAP Chris Plummer Oracle JDK-8323109 vmTestbase/nsk/jdb/interrupt/interrupt001/interrupt001.java timed out due to missing prompt
2024/01/06 11:04 Amos SHI SAP Igor Ignatyev Oracle JDK-8323097 vmTestbase/gc/lock/jni/jnilock002/TestDescription.java fails in jdk/hs nightly
2024/01/05 08:04 Andrew Lu SAP Rajat Mahajan Oracle JDK-8323040 Add JRadioButtonMenuItem to bug8031573.java
2024/01/05 07:58 Andrew Lu SAP Damon Nguyen Oracle JDK-8323038 [macos] java/awt/Choice/ChoicePopupLocation/ChoicePopupLocation.java fails
2024/01/05 02:50 Sergey Bylokhov Amazon Mark Powers Oracle JDK-8323030 NPE in PKCS7.parseOldSignedData
2024/01/03 16:24 Matthias Baesken SAP (same) (same) JDK-8322960 build using devkit on Linux ppc64le RHEL puts path to devkit into libsplashscreen
2024/01/03 13:32 Andrew Lu SAP Igor Ignatyev Oracle JDK-8322952 mark hotspot runtime/Throwable tests which ignore external VM flags
2024/01/03 13:31 Andrew Lu SAP Igor Ignatyev Oracle JDK-8322951 mark hotspot runtime/classFileParserBug tests which ignore external VM flags
2024/01/03 13:31 Andrew Lu SAP Igor Ignatyev Oracle JDK-8322950 mark hotspot runtime/Dictionary tests which ignore external VM flags
2024/01/03 13:31 Andrew Lu SAP Evgeny Nikitin Oracle JDK-8322949 [mlvm] tests should not allow code cache exhaustion
2024/01/03 13:30 Andrew Lu SAP Douglas Simon Oracle JDK-8322948 UnsafeGetStableArrayElement should account for different JIT implementation details
2024/01/03 13:28 Andrew Lu SAP Rahul Raghavan Independent JDK-8322947 MLVM deoptimize stress test timed out
2024/01/03 13:28 Andrew Lu SAP Ekaterina Pavlova Oracle JDK-8322946 vm/mlvm/meth/stress/compiler/deoptimize keeps timeouting
2024/01/02 20:19 Sergey Bylokhov Amazon (same) (same) JDK-8322867 support latest VS2022 MSC_VER in abstract_vm_version.cpp
2023/12/30 11:03 Amos SHI SAP Axel Boldt-Christmas Oracle JDK-8322789 jdk.test.lib.compiler.InMemoryJavaCompiler.compile does not close files
2023/12/30 08:54 Amos SHI SAP Daniel Daugherty Oracle JDK-8322788 adjust timeouts in three more M&M tests
2023/12/30 08:54 Amos SHI SAP Daniel Daugherty Oracle JDK-8322787 increase timeout for ContinuousCallSiteTargetChange.java
2023/12/30 08:54 Amos SHI SAP Daniel Daugherty Oracle JDK-8322786 adjust timeout for JLI GetObjectSizeIntrinsicsTest.java subtest again
2023/12/30 08:53 Amos SHI SAP Renjith Kannath Pariyangad Oracle JDK-8322785 Invalid TargetDataLine after screen lock when using JFileChooser or COM library
2023/12/29 17:47 Jaroslav Bachorík DataDog (same) (same) JDK-8322752 [11u] GetStackTraceAndRetransformTest.java is failing assert
2023/12/29 11:05 Amos SHI SAP Erik Österlund Oracle JDK-8322771 Deadlock in TestCSLocker.java due to blocking GC while allocating
2023/12/29 02:22 Andrew Lu SAP Igor Ignatyev Oracle JDK-8322764 jsig/Testjsig.java doesn't check exit code
2023/12/29 02:22 Andrew Lu SAP Igor Ignatyev Oracle JDK-8322763 runtime/duplAttributes/DuplAttributesTest.java doesn't check exit code
2023/12/29 02:22 Andrew Lu SAP Igor Ignatyev Oracle JDK-8322762 runtime/EnclosingMethodAttr/EnclMethodAttr.java doesn't check exit code
2023/12/29 02:20 Andrew Lu SAP Alisen Chung Oracle JDK-8322761 Update FreeType to 2.13.2
2023/12/29 02:20 Andrew Lu SAP Aleksandre Iline Oracle JDK-8322760 Save test images and dumps with timestamps from client sanity suite
2023/12/26 11:27 Amos SHI SAP Kevin Walls Oracle JDK-8322746 MemoryPoolMBean/isUsageThresholdExceeded/isexceeded001/TestDescription.java still failing
2023/12/26 11:24 Amos SHI SAP Lawrence Andrews Oracle JDK-8322745 Convert applet manual tests SelectionVisible.java to Frame and automate
2023/12/26 03:17 Andrew Lu SAP Aleksandre Iline Oracle JDK-8322742 sanity/client/SwingSet/src/ButtonDemoScreenshotTest.java failed with "AssertionError: All pixels are not black"
2023/12/25 18:16 Amos SHI SAP Chris Plummer Oracle JDK-8322740 JDI AfterThreadDeathTest.java failed due to "FAILED: Did not get expected IllegalThreadStateException on a StepRequest.enable()"
2023/12/25 18:14 Amos SHI SAP Alexander Zvegintsev Oracle JDK-8322739 Regression automated test '/open/test/jdk/java/awt/TrayIcon/SystemTrayInstance/SystemTrayInstanceTest.java' fails
2023/12/25 18:14 Amos SHI SAP Igor Ignatyev Oracle JDK-8322738 mark hotspot runtime/modules tests which ignore external VM flags
2023/12/25 18:12 Amos SHI SAP Igor Ignatyev Oracle JDK-8322737 mark hotspot runtime/logging tests which ignore external VM flags
2023/12/25 18:11 Amos SHI SAP Igor Ignatyev Oracle JDK-8322736 make it possible to use jtreg's -match via run-test framework
2023/12/24 10:22 Amos SHI SAP David Holmes Oracle JDK-8322727 [mlvm] [TESTBUG] vm.mlvm.mixed.stress.java.findDeadlock.INDIFY_Test Deadlocked threads are not always detected
2023/12/23 11:16 Amos SHI SAP Emanuel Peter Oracle JDK-8322724 C2: add bailout after assert Bad graph detected in build_loop_late
2023/12/23 11:14 Amos SHI SAP Ludvig Janiuk Oracle JDK-8322723 Remove JT_JAVA dead code in jib-profiles.js
2023/12/23 11:14 Amos SHI SAP Chris Plummer Oracle JDK-8322722 nsk/jdb tests don't pass -verbose flag to the debuggee
2023/12/23 11:12 Amos SHI SAP Leonid Mesnik Oracle JDK-8322721 failure handler missed jcmd.vm.info command
2023/12/23 11:12 Amos SHI SAP Alexey Ivanov Oracle JDK-8322720 java/awt/List/ListGarbageCollectionTest/AwtListGarbageCollectionTest.java failed with "List wasn't garbage collected"
2023/12/23 11:10 Amos SHI SAP Coleen Phillimore Oracle JDK-8322719 Trivial fixes to btree tests
2023/12/23 11:09 Amos SHI SAP Bill Huang Oracle JDK-8322718 Improve test coverage for XPath functions: Node Set Functions
2023/12/22 11:18 Jaroslav Bachorík DataDog (same) (same) JDK-8322690 Accessing jmethodID might lead to spurious crashes
2023/12/21 16:56 Amos SHI SAP Igor Ignatyev Oracle JDK-8322646 LevelTransitionTest.java, fix trivial methods levels logic
2023/12/21 10:50 Andrew Lu SAP Leonid Mesnik Oracle JDK-8322609 Enable CreateCoredumpOnCrash for testing in makefiles
2023/12/21 10:50 Andrew Lu SAP Evgeny Nikitin Oracle JDK-8322608 Avoid compilation blocking in OverloadCompileQueueTest.java
2023/12/21 10:46 Andrew Lu SAP Stefan Johansson Oracle JDK-8322606 nsk/share/test/StressOptions stressTime is scaled in getter but not when printed
2023/12/21 10:46 Andrew Lu SAP Aleksey Shipilev Amazon JDK-8322605 Relax SIGFPE match in in runtime/ErrorHandling/SecondaryErrorTest.java
2023/12/18 23:19 Amos SHI SAP Sibabrata Sahoo Oracle JDK-8322337 Convert sun/security/provider/KeyStore/DKSTest.sh to Java Jtreg Test
2023/12/18 23:13 Amos SHI SAP Calvin Cheung Oracle JDK-8322335 [TESTBUG] Remove excessive output from CDS/AppCDS tests
2023/12/18 23:04 Liam Miller-Cushon Google Vicente Arturo Romero Zaldivar Oracle JDK-8322331 javac crashes while adding type annotations to the return type of a constructor
2023/12/18 22:58 tabata.daishi Fujitsu Aleksej Efimov Oracle JDK-8322329 com/sun/jndi/ldap/LdapDnsProviderTest.java failing with LDAP response read timeout
2023/12/18 11:27 Goetz Lindenmaier SAP Naoto Sato Oracle JDK-8322280 Console read line with zero out should zero out underlying buffer
2023/12/16 19:05 Amos SHI SAP (same) (same) JDK-8322178 Error. can't find jdk.testlibrary.SimpleSSLContext in test directory or libraries
2023/12/15 22:30 Alexey Bakhtin Azul Weijun Wang Oracle JDK-8322238 RSA signature verification fails on signed data that does not encode params correctly
2023/12/15 15:06 Liam Miller-Cushon Google (same) (same) JDK-8322203 type annotations are not visible to javac plugins across compilation boundaries
2023/12/15 15:04 Amos SHI SAP Jayathirth D V Oracle JDK-8322202 Additional negative value check in JPEG decoding
2023/12/15 15:02 Amos SHI SAP Prasanta Sadhukhan Oracle JDK-8322201 Timeouts on one macOS 12.6.1 host of two Swing JTableHeader tests
2023/12/15 14:57 Amos SHI SAP Abhishek Kumar Oracle JDK-8322200 Open source Swing MenuItem related tests
2023/12/15 14:55 Amos SHI SAP Damon Nguyen Oracle JDK-8322199 Open source few Swing JMenu tests
2023/12/15 14:53 Amos SHI SAP Yoshiki Sato Oracle JDK-8322198 NPE in javazic compiler
2023/12/15 14:51 Amos SHI SAP Tejesh R Oracle JDK-8322197 Open source several AWT MouseInfo related tests
2023/12/15 14:39 Amos SHI SAP Emanuel Peter Oracle JDK-8322196 Speed up compiler/jsr292/methodHandleExceptions/TestAMEnotNPE.java
2023/12/15 14:36 Amos SHI SAP yansendao.ysd Alibaba JDK-8322194 [TESTBUG] sun/security/provider/SecureRandom/AbstractDrbg/SpecTest.java intermittently timeout
2023/12/15 14:34 Amos SHI SAP Daniel Fuchs Oracle JDK-8322193 sun/util/logging/PlatformLoggerTest.java failed with "RuntimeException: Retrieved backing PlatformLogger level null is not the expected CONFIG"
2023/12/15 14:30 Amos SHI SAP Xuelei Fan Tencent JDK-8322192 CheckCleanerBound test fails with PasswordCallback object is not released
2023/12/15 14:22 Amos SHI SAP Igor Ignatyev Oracle JDK-8322191 Add TestCaseImpl to OverloadCompileQueueTest.java's build dependencies
2023/12/15 14:20 Amos SHI SAP Daniil Titov Oracle JDK-8322190 java/lang/management/ThreadMXBean/MaxDepthForThreadInfoTest.java fails with java.lang.NullPointerException
2023/12/15 14:18 Amos SHI SAP Joe Wang Oracle JDK-8322189 XMLStreamWriter setDefaultNamespace(null) throws NullPointerException
2023/12/15 14:16 Amos SHI SAP Thomas Schatzl Oracle JDK-8322188 G1 ignores AlwaysPreTouch when UseTransparentHugePages is enabled
2023/12/15 11:39 Amos SHI SAP John Jiang Tencent JDK-8322176 Move testlibrary/jdk/testlibrary/SimpleSSLContext.java and testkeys to network testlibrary
2023/12/15 08:35 Andrew Lu SAP Damon Nguyen Oracle JDK-8322165 [macOS] javax/swing/plaf/aqua/CustomComboBoxFocusTest.java failure
2023/12/15 04:26 Alexey Bakhtin Azul Valerie Peng Oracle JDK-8322156 Allocate BadPaddingException only if it will be thrown
2023/12/14 09:44 Amos SHI SAP Harold Seigel Oracle JDK-8322080 [Testbug] runtime/XCheckJniJsig/XCheckJSig.java looks for libjsig in wrong location
2023/12/14 08:06 Amos SHI SAP Ioi Lam Oracle JDK-8322076 [TESTBUG] CDS tests should use "@run driver"
2023/12/14 08:05 Amos SHI SAP Igor Ignatyev Oracle JDK-8322075 remove VMPropsExt from TEST.ROOT
2023/12/14 01:54 Andrew Lu SAP Christian Hagedorn Oracle JDK-8322061 Loop Predication should not hoist range checks with trap on success projection by negating their condition
2023/12/13 17:22 Amos SHI SAP Leo Korinth Oracle JDK-8322009 Fix: make test outputs TEST SUCCESS after unsuccessful exit
2023/12/13 17:22 Amos SHI SAP David Holmes Oracle JDK-8322007 [TESTBUG] runtime/LoadClass/LongBCP.java fails in AUFS file system
2023/12/13 16:01 Amos SHI SAP Calvin Cheung Oracle JDK-8322001 [TESTBUG] appcds TestCommon.makeCommandLineForAppCDS() can be removed
2023/12/13 09:13 Andrew Lu SAP Severin Gehwolf Red Hat JDK-8321963 [TESTBUG] sun/management/jmxremote/bootstrap/JMXInterfaceBindingTest.java passes trivially when it shouldn't
2023/12/13 09:13 Andrew Lu SAP Damon Nguyen Oracle JDK-8321962 The selected item in an editable JComboBox with titled border is not visible in Aqua LAF
2023/12/13 09:13 Andrew Lu SAP Prasanta Sadhukhan Oracle JDK-8321961 test/jdk/javax/swing/plaf/aqua/CustomComboBoxFocusTest.java fails on mac aarch64
2023/12/12 18:58 tabata.daishi Fujitsu Masanori Yano Fujitsu JDK-8321929 (sctp) JDK-7118373 is not fixed for SctpChannel
2023/12/12 08:56 Andrew Lu SAP Coleen Phillimore Oracle JDK-8321883 Test vmTestbase/nsk/stress/except/except011.java failed: ExceptionInInitializerError: target class not found
2023/12/12 08:53 Andrew Lu SAP Damon Nguyen Oracle JDK-8321878 [macosx] JComboBox paints the border incorrectly
2023/12/11 11:59 Matthias Baesken SAP (same) (same) JDK-8321730 Java_java_util_prefs_FileSystemPreferences_lockFile0 write result errno in missing case
2023/12/11 07:55 Andrew Lu SAP Prasanta Sadhukhan Oracle JDK-8321710 [macosx] closed/javax/swing/JComboBox/4517214/bug4517214.java fails on MacOS
2023/12/11 07:55 Andrew Lu SAP Prasanta Sadhukhan Oracle JDK-8321709 [macosx] When Alt+down arrow key is pressed, the combobox popup does not appear.
2023/12/11 07:53 Andrew Lu SAP Prasanta Sadhukhan Oracle JDK-8321708 [macos] Aqua LAF does not fire an action event if combo box menu is displayed
2023/12/11 07:53 Andrew Lu SAP Jaikiran Pai Oracle JDK-8321707 sun.security.ssl.SSLHandshake.getHandshakeProducer() incorrectly checks handshakeConsumers
2023/12/08 18:04 Sergey Bylokhov Amazon ae40515 Independent JDK-8321608 The SendRawSysexMessage test may cause a JVM crash
2023/12/08 08:48 Andrew Lu SAP Albert Yang Oracle JDK-8321580 GC lock/jni/jnilock001 test failed "assert(gch->gc_cause() == GCCause::_scavenge_alot || !gch->incremental_collection_failed()) failed: Twice in a row"
2023/12/08 08:46 Andrew Lu SAP Gary Adams Oracle JDK-8321579 nsk/jdi/EventQueue/remove_l/remove_l005 intermittently times out
2023/12/08 02:10 Andrew Lu SAP Roger Riggs Oracle JDK-8321566 Unexpected StackOverflowError in "process reaper" thread
2023/12/07 21:16 Paul Hohensee Amazon (same) (same) JDK-8321548 MonitoringSupport_lock should be unconditionally initialized after 8304074
2023/12/07 16:20 Paul Hohensee Amazon (same) (same) JDK-8321536 [JMX] Add an approximation of total bytes allocated on the Java heap by the JVM
2023/12/07 11:48 Amos SHI SAP Jie Fu Tencent JDK-8321525 com/sun/security/auth/module/AllPlatforms.java fails to compile
2023/12/07 11:48 Amos SHI SAP Sibabrata Sahoo Oracle JDK-8321524 Cover logout method for several LoginModule
2023/12/07 11:46 Amos SHI SAP Igor Ignatyev Oracle JDK-8321523 unproblem list applications/ctw/modules/* tests on windows
2023/12/07 08:10 Amos SHI SAP Harold Seigel Oracle JDK-8321503 vmTestbase/nsk/sysdict/vm/stress/btree/btree010/btree010.java fails with ClassNotFoundException: nsk.sysdict.share.BTree0LLRLRLRRLR
2023/12/07 08:07 Amos SHI SAP Brian Burkhalter Oracle JDK-8321502 Test utility jdk.test.lib.util.FileUtils.areAllMountPointsAccessible needs to tolerate duplicates
2023/12/07 01:55 Andrew Lu SAP Gerard Ziemski Oracle JDK-8321497 "Dumping core ..." is shown despite claiming that "# No core dump will be written."
2023/12/07 01:54 Andrew Lu SAP Harshitha Onkar Oracle JDK-8321496 Update Libpng to 1.6.40
2023/12/06 23:55 Sonia Zaldana Calles Red Hat Brian Burkhalter Oracle JDK-8321493 (fs) java/nio/file/FileStore/Basic.java fails with java.lang.RuntimeException: values differ by more than 1GB
2023/12/06 11:51 Shruthi Acharya IBM Jonathan Gibbons Oracle JDK-8321462 Broken links in JDK API serialized-form page
2023/12/06 02:00 Andrew Lu SAP Sibabrata Sahoo Oracle JDK-8321427 LFGarbageCollectedTest.java fails with parse Exception
2023/12/06 02:00 Andrew Lu SAP Rahul Raghavan Independent JDK-8321426 [TESTBUG] compiler.codecache.stress.Helper.TestCaseImpl can't be defined in different runtime package as its nest host
2023/12/06 01:59 Andrew Lu SAP Hamlin Li Huawei JDK-8321425 move ModuleUtils to top-level testlibrary
2023/12/06 01:57 Andrew Lu SAP Gary Adams Oracle JDK-8321424 JDK-8068225 regression in JDIBreakpointTest
2023/12/05 17:58 Sonia Zaldana Calles Red Hat Aleksey Shipilev Amazon JDK-8321405 Zero: Handle "zero" variant in CommandLineOptionTest.java
2023/12/04 15:02 Amos SHI SAP Brian Burkhalter Oracle JDK-8321277 (se) Reduce the number of outer loop iterations on Windows in java/nio/channels/Selector/RacyDeregister.java
2023/12/04 11:27 Amos SHI SAP Emanuel Peter Oracle JDK-8321264 [REDO] ByteBufferTest.java: replace endless recursion with RuntimeException in void ck(double x, double y)
2023/12/04 11:01 Amos SHI SAP Daniel Fuchs Oracle JDK-8321261 randomDelay in DrainDeadlockT and LoggingDeadlock do not randomly delay
2023/12/04 10:58 Amos SHI SAP Fernando Guallini Oracle JDK-8321260 Missing coverage for javax.smartcardio.CardPermission and ResponseAPDU
2023/12/04 10:56 Amos SHI SAP Igor Ignatyev Oracle JDK-8321259 WB_EnqueueInitializerForCompilation requests compilation for NULL
2023/12/04 10:54 Amos SHI SAP Jean Christophe Beyler Google JDK-8321257 Windows VS2013 build failure - "'snprintf': identifier not found"
2023/12/04 10:49 Amos SHI SAP Harold Seigel Oracle JDK-8321256 defmeth tests can hide failures
2023/12/04 10:46 Amos SHI SAP Calvin Cheung Oracle JDK-8321255 [TESTBUG] The -Xlog:cds,cds+hashtables vm option is not always required for appcds tests
2023/12/04 10:44 Amos SHI SAP Calvin Cheung Oracle JDK-8321254 runtime/appcds/MultiReleaseJars.java timed out often in hs-tier7 testing
2023/12/04 08:26 Matthias Baesken SAP (same) (same) JDK-8321235 Improve description of NativeLibrary JFR event
2023/12/04 08:24 Matthias Baesken SAP (same) (same) JDK-8321234 src/java.desktop/windows/native/libawt/windows/awt_Robot.cpp GetRGBPixels adjust releasing of resources
2023/12/04 08:24 Matthias Baesken SAP (same) (same) JDK-8321233 Java_sun_awt_windows_ThemeReader_paintBackground release resources in early returns
2023/12/01 08:44 Martin Doerr SAP (same) (same) JDK-8321160 ppc64 TypeEntries::type_unknown logic looks wrong, missed optimization opportunity
2023/11/30 19:20 Amos SHI SAP Igor Ignatyev Oracle JDK-8321142 remove unneeded imports from runtime tests
2023/11/30 11:18 Andrew Lu SAP Rajan Halade Oracle JDK-8321450 Add three eMudhra emSign roots
2023/11/29 15:34 Sonia Zaldana Calles Red Hat Prasanta Sadhukhan Oracle JDK-8321028 Open source few swing text/html tests
2023/11/29 15:33 Sonia Zaldana Calles Red Hat Bill Huang Oracle JDK-8321027 Improve test coverage for XPath Axes: child
2023/11/29 12:41 Andrew Lu SAP Frank Yuan Oracle JDK-8320976 [TESTLIB] Determine if file exists by Files.exists in function FileUtils.deleteFileIfExistsWithRetry
2023/11/29 12:38 Andrew Lu SAP Igor Ignatyev Oracle JDK-8320975 CtwRunner misses export for jdk.internal.access
2023/11/29 12:36 Andrew Lu SAP Igor Ignatyev Oracle JDK-8320974 add ctw tests for jdk.jfr and jdk.management.jfr modules
2023/11/29 10:52 Shruthi Acharya IBM Jonathan Gibbons Oracle JDK-8320970 javap man page needs to be updated
2023/11/29 07:47 Goetz Lindenmaier SAP (same) (same) JDK-8320884 Bump update version for OpenJDK: jdk-11.0.23

No changesets log

Committer push log

Shruthi Acharya, IBM

Bug Summary
JDK-8321462 Broken links in JDK API serialized-form page
JDK-8320970 javap man page needs to be updated

Alexey Bakhtin, Azul

Bug Summary
JDK-8322156 Allocate BadPaddingException only if it will be thrown
JDK-8322238 RSA signature verification fails on signed data that does not encode params correctly

abobrov, Unknown

Bug Summary
JDK-8326503 [11u] java/net/HttpURLConnection/HttpURLConnectionExpectContinueTest.java fail because of package org.junit.jupiter.api does not exist
JDK-8326480 HttpURLConnection timeouts with Expect: 100-Continue and no chunking
JDK-8326826 java/net/HttpURLConnection/HttpURLConnectionExpectContinueTest.java fails intermittently in timeout
JDK-8326766 Test java/net/HttpURLConnection/HttpURLConnectionExpectContinueTest.java failed: java.net.BindException: Address already in use

Andrew Hughes, Red Hat

Bug Summary
JDK-8326109 GCC 13 reports maybe-uninitialized warnings for jni.cpp with dtrace enabled
JDK-8326593 ISO 4217 Amendment 176 Update
JDK-8324843 Windows VS2010 build failed with "error C2275: 'int64_t'"

Andrew Lu, SAP

Bug Summary
JDK-8321497 "Dumping core ..." is shown despite claiming that "# No core dump will be written."
JDK-8321708 [macos] Aqua LAF does not fire an action event if combo box menu is displayed
JDK-8323038 [macos] java/awt/Choice/ChoicePopupLocation/ChoicePopupLocation.java fails
JDK-8323141 [macos] java/awt/Focus/UnaccessibleChoice/AccessibleChoiceTest.java fails
JDK-8322165 [macOS] javax/swing/plaf/aqua/CustomComboBoxFocusTest.java failure
JDK-8321710 [macosx] closed/javax/swing/JComboBox/4517214/bug4517214.java fails on MacOS
JDK-8321878 [macosx] JComboBox paints the border incorrectly
JDK-8321709 [macosx] When Alt+down arrow key is pressed, the combobox popup does not appear.
JDK-8322949 [mlvm] tests should not allow code cache exhaustion
JDK-8324669 [test bug] javax/swing/JTableHeader/6889007/bug6889007.java fails
JDK-8321426 [TESTBUG] compiler.codecache.stress.Helper.TestCaseImpl can't be defined in different runtime package as its nest host
JDK-8321963 [TESTBUG] sun/management/jmxremote/bootstrap/JMXInterfaceBindingTest.java passes trivially when it shouldn't
JDK-8320976 [TESTLIB] Determine if file exists by Files.exists in function FileUtils.deleteFileIfExistsWithRetry
JDK-8324804 Add -proc:full to describe current default annotation processing policy
JDK-8323971 Add a new test library API to execute kinit in SecurityTools.java
JDK-8320974 add ctw tests for jdk.jfr and jdk.management.jfr modules
JDK-8323040 Add JRadioButtonMenuItem to bug8031573.java
JDK-8326563 Add screen capture functionality to PassFailJFrame
JDK-8321450 Add three eMudhra emSign roots
JDK-8322608 Avoid compilation blocking in OverloadCompileQueueTest.java
JDK-8326153 compiler/tiered/LevelTransitionTest.java fails with -XX:CompileThreshold=100 -XX:TieredStopAtLevel=1
JDK-8320975 CtwRunner misses export for jdk.internal.access
JDK-8322609 Enable CreateCoredumpOnCrash for testing in makefiles
JDK-8321580 GC lock/jni/jnilock001 test failed "assert(gch->gc_cause() == GCCause::_scavenge_alot || !gch->incremental_collection_failed()) failed: Twice in a row"
JDK-8325008 gc/g1/ihop/TestIHOPStatic.java fails due to extra concurrent mark with -Xcomp
JDK-8323969 gc/TestSystemGC.java large pages subtest fails with ZGC
JDK-8326633 HTML formatting for PassFailJFrame instructions
JDK-8323967 Improve stability of WheelModifier.java test
JDK-8325007 java/nio/file/Files/CopyAndMove.java fails when using second test directory
JDK-8321424 JDK-8068225 regression in JDIBreakpointTest
JDK-8325276 JNI invocation of an abstract instance method corrupts the stack
JDK-8322764 jsig/Testjsig.java doesn't check exit code
JDK-8321427 LFGarbageCollectedTest.java fails with parse Exception
JDK-8325006 ListKeychainStore.sh fails in some virtualized environments
JDK-8322061 Loop Predication should not hoist range checks with trap on success projection by negating their condition
JDK-8322951 mark hotspot runtime/classFileParserBug tests which ignore external VM flags
JDK-8322950 mark hotspot runtime/Dictionary tests which ignore external VM flags
JDK-8322952 mark hotspot runtime/Throwable tests which ignore external VM flags
JDK-8323493 MemoryPoolMBean/isUsageThresholdExceeded tests failed with "isUsageThresholdExceeded() returned false, and is still false, while threshold = MMMMMMM and used peak = NNNNNNN"
JDK-8322947 MLVM deoptimize stress test timed out
JDK-8321425 move ModuleUtils to top-level testlibrary
JDK-8326556 Move more DnD tests to open
JDK-8321579 nsk/jdi/EventQueue/remove_l/remove_l005 intermittently times out
JDK-8322606 nsk/share/test/StressOptions stressTime is scaled in getter but not when printed
JDK-8323490 NullPointerException because listenAddress[0] is null
JDK-8323491 Open source AWT KeyBoardFocusManger, LightWeightComponent related tests
JDK-8323492 Open source AWT MenuItem related tests
JDK-8323639 Open source AWT misc tests
JDK-8324111 Open source few headless Swing misc tests
JDK-8326442 Open source few Swing JComponent and AbstractButton tests
JDK-8324821 Open source few swing JList and JMenuBar tests
JDK-8323714 Open Source JFrame, JIF related Swing Tests
JDK-8326539 Open source more AWT DnD related tests
JDK-8323713 Open source more AWT Drag & Drop tests
JDK-8326445 Open source several AWT Miscellaneous tests
JDK-8326444 Open source several AWT TextArea related tests
JDK-8325275 Open source several clipboard and color AWT tests
JDK-8326443 Open source several container and component AWT tests
JDK-8323489 Open source several container AWT tests
JDK-8325274 OutputAnalyzer.shouldMatchByLine() fails in some cases
JDK-8322605 Relax SIGFPE match in in runtime/ErrorHandling/SecondaryErrorTest.java
JDK-8322763 runtime/duplAttributes/DuplAttributesTest.java doesn't check exit code
JDK-8322762 runtime/EnclosingMethodAttr/EnclMethodAttr.java doesn't check exit code
JDK-8322742 sanity/client/SwingSet/src/ButtonDemoScreenshotTest.java failed with "AssertionError: All pixels are not black"
JDK-8322760 Save test images and dumps with timestamps from client sanity suite
JDK-8321707 sun.security.ssl.SSLHandshake.getHandshakeProducer() incorrectly checks handshakeConsumers
JDK-8321883 Test vmTestbase/nsk/stress/except/except011.java failed: ExceptionInInitializerError: target class not found
JDK-8321961 test/jdk/javax/swing/plaf/aqua/CustomComboBoxFocusTest.java fails on mac aarch64
JDK-8323970 TestSystemGC uses "require vm.gc.G1" for large pages subtest
JDK-8321962 The selected item in an editable JComboBox with titled border is not visible in Aqua LAF
JDK-8321566 Unexpected StackOverflowError in "process reaper" thread
JDK-8322948 UnsafeGetStableArrayElement should account for different JIT implementation details
JDK-8322761 Update FreeType to 2.13.2
JDK-8321496 Update Libpng to 1.6.40
JDK-8323783 Update Public Suffix List to b5bf572
JDK-8325005 Using -proc:full should be considered requesting explicit annotation processing
JDK-8322946 vm/mlvm/meth/stress/compiler/deoptimize keeps timeouting
JDK-8323109 vmTestbase/nsk/jdb/interrupt/interrupt001/interrupt001.java timed out due to missing prompt
JDK-8324282 WheelModifier.java fails by timeout
JDK-8324744 Write a test to check textArea triggers MouseEntered/MouseExited events properly

Amos SHI, SAP

Bug Summary
JDK-8321277 (se) Reduce the number of outer loop iterations on Windows in java/nio/channels/Selector/RacyDeregister.java
JDK-8325100 [JVMCI] compiler/unsafe/UnsafeGetStableArrayElement test asserts wrong values with Graal
JDK-8324963 [macos14] javax/swing/JMenuItem/4654927/bug4654927.java: component must be showing on the screen to determine its location
JDK-8322727 [mlvm] [TESTBUG] vm.mlvm.mixed.stress.java.findDeadlock.INDIFY_Test Deadlocked threads are not always detected
JDK-8321264 [REDO] ByteBufferTest.java: replace endless recursion with RuntimeException in void ck(double x, double y)
JDK-8322001 [TESTBUG] appcds TestCommon.makeCommandLineForAppCDS() can be removed
JDK-8322076 [TESTBUG] CDS tests should use "@run driver"
JDK-8322335 [TESTBUG] Remove excessive output from CDS/AppCDS tests
JDK-8322007 [TESTBUG] runtime/LoadClass/LongBCP.java fails in AUFS file system
JDK-8322080 [Testbug] runtime/XCheckJniJsig/XCheckJSig.java looks for libjsig in wrong location
JDK-8322194 [TESTBUG] sun/security/provider/SecureRandom/AbstractDrbg/SpecTest.java intermittently timeout
JDK-8321255 [TESTBUG] The -Xlog:cds,cds+hashtables vm option is not always required for appcds tests
JDK-8323165 Add diagnostic logging to VMProps.checkDockerSupport
JDK-8322191 Add TestCaseImpl to OverloadCompileQueueTest.java's build dependencies
JDK-8322202 Additional negative value check in JPEG decoding
JDK-8322786 adjust timeout for JLI GetObjectSizeIntrinsicsTest.java subtest again
JDK-8322788 adjust timeouts in three more M&M tests
JDK-8322724 C2: add bailout after assert Bad graph detected in build_loop_late
JDK-8322192 CheckCleanerBound test fails with PasswordCallback object is not released
JDK-8321525 com/sun/security/auth/module/AllPlatforms.java fails to compile
JDK-8322745 Convert applet manual tests SelectionVisible.java to Frame and automate
JDK-8322337 Convert sun/security/provider/KeyStore/DKSTest.sh to Java Jtreg Test
JDK-8321524 Cover logout method for several LoginModule
JDK-8322771 Deadlock in TestCSLocker.java due to blocking GC while allocating
JDK-8321256 defmeth tests can hide failures
JDK-8323163 DnD test DisposeFrameOnDragTest.java does not clean up
JDK-8322178 Error. can't find jdk.testlibrary.SimpleSSLContext in test directory or libraries
JDK-8322721 failure handler missed jcmd.vm.info command
JDK-8326148 Fix comment typo in PKCS12Passwd.java
JDK-8326136 Fix deprecation warnings in DPrinter
JDK-8322009 Fix: make test outputs TEST SUCCESS after unsuccessful exit
JDK-8326144 Fixup of jar filename typo in BadFactoryTest.sh
JDK-8322188 G1 ignores AlwaysPreTouch when UseTransparentHugePages is enabled
JDK-8324955 gc/lock tests failed with "OutOfMemoryError: Java heap space: failed reallocation of scalar replaced objects"
JDK-8326137 GC: Make TestArrayAllocatorMallocLimit use createTestJvm
JDK-8322718 Improve test coverage for XPath functions: Node Set Functions
JDK-8322787 increase timeout for ContinuousCallSiteTargetChange.java
JDK-8322785 Invalid TargetDataLine after screen lock when using JFileChooser or COM library
JDK-8322720 java/awt/List/ListGarbageCollectionTest/AwtListGarbageCollectionTest.java failed with "List wasn't garbage collected"
JDK-8326777 java/io/File/createTempFile/SpecialTempFile.java fails in Windows 11
JDK-8322190 java/lang/management/ThreadMXBean/MaxDepthForThreadInfoTest.java fails with java.lang.NullPointerException
JDK-8326142 java/lang/ref/ReachabilityFenceTest.java should run with -Xbatch
JDK-8324962 java/nio/channels/DatagramChannel/Connect.java timed out
JDK-8323164 javax/swing/JTree/6263446/bug6263446.java fails intermittently on a VM
JDK-8322740 JDI AfterThreadDeathTest.java failed due to "FAILED: Did not get expected IllegalThreadStateException on a StepRequest.enable()"
JDK-8322789 jdk.test.lib.compiler.InMemoryJavaCompiler.compile does not close files
JDK-8326141 jdk/jfr/event/gc/collection/TestGCCauseWith[Serial|Parallel].java : GC cause 'GCLocker Initiated GC' not in the valid causes
JDK-8325308 JFR: Periodic task thread uses period for method sampling events
JDK-8324957 KeytoolReaderP12Test.java fail on localized Windows platform
JDK-8322646 LevelTransitionTest.java, fix trivial methods levels logic
JDK-8322736 make it possible to use jtreg's -match via run-test framework
JDK-8324954 mark hotspot runtime/cds tests which ignore external VM flags
JDK-8322737 mark hotspot runtime/logging tests which ignore external VM flags
JDK-8322738 mark hotspot runtime/modules tests which ignore external VM flags
JDK-8322746 MemoryPoolMBean/isUsageThresholdExceeded/isexceeded001/TestDescription.java still failing
JDK-8321260 Missing coverage for javax.smartcardio.CardPermission and ResponseAPDU
JDK-8324958 MonitorVmStartTerminate.java timed out
JDK-8322176 Move testlibrary/jdk/testlibrary/SimpleSSLContext.java and testkeys to network testlibrary
JDK-8322198 NPE in javazic compiler
JDK-8322722 nsk/jdb tests don't pass -verbose flag to the debuggee
JDK-8324956 Open source few more headless Swing misc tests
JDK-8324959 Open source few swing JInternalFrame and JMenuBar tests
JDK-8322199 Open source few Swing JMenu tests
JDK-8322197 Open source several AWT MouseInfo related tests
JDK-8322200 Open source Swing MenuItem related tests
JDK-8326466 Open source swing security manager test
JDK-8325101 Open source swing text/html and tree test
JDK-8321261 randomDelay in DrainDeadlockT and LoggingDeadlock do not randomly delay
JDK-8322739 Regression automated test '/open/test/jdk/java/awt/TrayIcon/SystemTrayInstance/SystemTrayInstanceTest.java' fails
JDK-8322723 Remove JT_JAVA dead code in jib-profiles.js
JDK-8321142 remove unneeded imports from runtime tests
JDK-8322075 remove VMPropsExt from TEST.ROOT
JDK-8323168 Remove vmTestbase/nsk/monitoring/ThreadMXBean/ThreadInfo/Deadlock/JavaDeadlock001/TestDescription.java from problemlist.
JDK-8324951 Rename javac test T6395981.java to be more informative
JDK-8321254 runtime/appcds/MultiReleaseJars.java timed out often in hs-tier7 testing
JDK-8324953 runtime/cds/appcds/MoveJDKTest.java doesn't check exit codes
JDK-8322196 Speed up compiler/jsr292/methodHandleExceptions/TestAMEnotNPE.java
JDK-8322193 sun/util/logging/PlatformLoggerTest.java failed with "RuntimeException: Retrieved backing PlatformLogger level null is not the expected CONFIG"
JDK-8321502 Test utility jdk.test.lib.util.FileUtils.areAllMountPointsAccessible needs to tolerate duplicates
JDK-8326147 test/jdk/com/sun/jndi/ldap/LdapPoolTimeoutTest.java fails with ConnectException: Connection timed out: no further information
JDK-8322201 Timeouts on one macOS 12.6.1 host of two Swing JTableHeader tests
JDK-8322719 Trivial fixes to btree tests
JDK-8321523 unproblem list applications/ctw/modules/* tests on windows
JDK-8323322 Update HarfBuzz to 8.2.2
JDK-8325051 vmTestbase/../stress/compiler/deoptimize/Test.java fails with OOME due to CodeCache exhaustion.
JDK-8323097 vmTestbase/gc/lock/jni/jnilock002/TestDescription.java fails in jdk/hs nightly
JDK-8321503 vmTestbase/nsk/sysdict/vm/stress/btree/btree010/btree010.java fails with ClassNotFoundException: nsk.sysdict.share.BTree0LLRLRLRRLR
JDK-8321259 WB_EnqueueInitializerForCompilation requests compilation for NULL
JDK-8321257 Windows VS2013 build failure - "'snprintf': identifier not found"
JDK-8322189 XMLStreamWriter setDefaultNamespace(null) throws NullPointerException

Christoph Langer, SAP

Bug Summary
JDK-8324108 [11u] Remove designator DEFAULT_PROMOTED_VERSION_PRE=ea for release 11.0.22

Christoph Langer, SAP

Bug Summary
JDK-8323426 Clean up code after JDK-8322417
JDK-8324726 java/awt/image/MultiResolutionImage/MultiResolutionImageObserverTest.java fails

Liam Miller-Cushon, Google

Bug Summary
JDK-8322331 javac crashes while adding type annotations to the return type of a constructor
JDK-8322203 type annotations are not visible to javac plugins across compilation boundaries

Dan Lutker, Amazon

Bug Summary
JDK-8323342 (tz) Update Timezone Data to 2023d
JDK-8325571 (tz) Update Timezone Data to 2024a

Elif Aslan, Amazon

Bug Summary
JDK-8325387 Enable parallelism in vmTestbase/nsk/stress/jni tests
JDK-8325388 Enable parallelism in vmTestbase/nsk/stress/threads tests

Goetz Lindenmaier, SAP

Bug Summary
JDK-8323324 [17u/11u] Redo JDK-8297951: C2: Create skeleton predicates for all If nodes in loop predication
JDK-8323778 [BACKOUT] 8225377: type annotations are not visible to javac plugins across compilation boundaries
JDK-8326560 Add Certainly roots R1 and E1
JDK-8324818 Better Error Handling for Jar Tool When Processing Non-existent Files
JDK-8320884 Bump update version for OpenJDK: jdk-11.0.23
JDK-8322280 Console read line with zero out should zero out underlying buffer
JDK-8323150 Console read line with zero out should zero out when throwing exception
JDK-8323604 Enable XML Signature secure validation mode by default
JDK-8324947 File.mkdirs() occasionally fails to create folders on Windows shared folder
JDK-8324146 filter out harmful -std* flags added by autoconf from CXX
JDK-8323326 Incorrect x86 instruction encoding for VSIB addressing mode
JDK-8324716 JVM/TI GetCurrentContendedMonitor/contmon001 failed due to "(IsSameObject#3) unexpected monitor object: 0x000000562336DBA8"
JDK-8326036 StackWalkTest.java fails after CODETOOLS-7903373
JDK-8324215 Update XML Security for Java to 3.0.2
JDK-8324493 Update XML Security for Java to 3.0.3

Ichiroh Takiguchi, IBM

Bug Summary
JDK-8323434 Chinese characters in RTF are not decoded

Jaroslav Bachorík, DataDog

Bug Summary
JDK-8322752 [11u] GetStackTraceAndRetransformTest.java is failing assert
JDK-8322690 Accessing jmethodID might lead to spurious crashes

Johannes Bechberger, SAP

Bug Summary
JDK-8325985 AsyncGetCallTrace can cause SIGBUS on M1
JDK-8326138 com/sun/jdi/JdwpOnThrowTest.java failed with "transport error 202: bind failed: Address already in use"

Jonathan Dowland, Red Hat

Bug Summary
JDK-8324307 [11u] hotspot fails to build with GCC 12 and newer (non-static data member initializers)
JDK-8325997 Always initialize _body[0..1] in Symbol constructor
JDK-8325931 GCC 10 warning stringop-overflow with symbol code
JDK-8325250 Open source several Swing Text related tests

Kimura Yukihiro, Fujitsu

Bug Summary
JDK-8324633 jdk/java/lang/instrument/BootClassPath/BootClassPathTest.sh fails on Japanese Windows

Liang Mao, Alibaba

Bug Summary
JDK-8323665 Enable Neoverse N1 optimizations for Arm Neoverse V1 & N2

Matthias Baesken, SAP

Bug Summary
JDK-8324112 Add ReleaseIntArrayElements in Java_sun_awt_X11_XlibWrapper_SetBitmapShape XlbWrapper.c to early return
JDK-8322960 build using devkit on Linux ppc64le RHEL puts path to devkit into libsplashscreen
JDK-8321235 Improve description of NativeLibrary JFR event
JDK-8321730 Java_java_util_prefs_FileSystemPreferences_lockFile0 write result errno in missing case
JDK-8321233 Java_sun_awt_windows_ThemeReader_paintBackground release resources in early returns
JDK-8321234 src/java.desktop/windows/native/libawt/windows/awt_Robot.cpp GetRGBPixels adjust releasing of resources

Martin Doerr, SAP

Bug Summary
JDK-8321160 ppc64 TypeEntries::type_unknown logic looks wrong, missed optimization opportunity

Paul Hohensee, Amazon

Bug Summary
JDK-8321536 [JMX] Add an approximation of total bytes allocated on the Java heap by the JVM
JDK-8321548 MonitoringSupport_lock should be unconditionally initialized after 8304074

Sergey Bylokhov, Amazon

Bug Summary
JDK-8323758 [AIX] vmTestbase/nsk/jvmti/RunAgentThread/agentthr001/TestDescription.java crashing due to empty while loop
JDK-8326098 Enable "maybe-uninitialized" warning for FreeType 2.13.1
JDK-8326697 JDK-8294427 breaks Windows L&F on all older Windows versions
JDK-8323030 NPE in PKCS7.parseOldSignedData
JDK-8326017 Parallelize sun/java2d/marlin/ClipShapeTest.java
JDK-8322867 support latest VS2022 MSC_VER in abstract_vm_version.cpp
JDK-8321608 The SendRawSysexMessage test may cause a JVM crash

Aleksey Shipilev, Amazon

Bug Summary
JDK-8326822 [TESTLIB] Enhance JAXPPolicyManager to setup required permissions for jtreg version 7 jar
JDK-8326821 clean up use of bad arguments for `@clean` in langtools tests
JDK-8326640 Create test alias "all" for all test roots
JDK-8324825 GHA: Generic jtreg errors are not reported
JDK-8326767 Make applications/jcstress invoke tests in batches
JDK-8325385 Test java/security/cert/CertPathBuilder/akiExt/AKISerialNumber.java is failing

syan, Unknown

Bug Summary
JDK-8326520 [TESTBUG]testMemoryFailCount in jdk/internal/platform/docker/TestDockerMemoryMetrics.java always fail because OOM killed

Sonia Zaldana Calles, Red Hat

Bug Summary
JDK-8321493 (fs) java/nio/file/FileStore/Basic.java fails with java.lang.RuntimeException: values differ by more than 1GB
JDK-8321027 Improve test coverage for XPath Axes: child
JDK-8321028 Open source few swing text/html tests
JDK-8321405 Zero: Handle "zero" variant in CommandLineOptionTest.java

tabata.daishi, Fujitsu

Bug Summary
JDK-8321929 (sctp) JDK-7118373 is not fixed for SctpChannel
JDK-8322329 com/sun/jndi/ldap/LdapDnsProviderTest.java failing with LDAP response read timeout