PUSHES REPORT: 11.0.4

This report shows who pushed the backports to the given release. This usually shows who did the backporting, testing, and review work.

Report generated: Wed Sep 01 03:20:23 CEST 2021

Distribution by priority

Count Priority
4 P1
38 P2
116 P3
88 P4

Distribution by components

Count Component
246 Total
99 (40.2%) hotspot
38 (15.4%) hotspot/runtime
30 (12.2%) hotspot/compiler
9 (3.7%) hotspot/svc-agent
6 (2.4%) hotspot/jfr
6 (2.4%) hotspot/gc
3 (1.2%) hotspot/svc
3 (1.2%) hotspot/test
2 (0.8%) hotspot/jvmti
2 (0.8%) hotspot
48 (19.5%) client-libs
16 (6.5%) client-libs/java.awt
12 (4.9%) client-libs/javax.swing
10 (4.1%) client-libs/2d
8 (3.3%) client-libs
1 (0.4%) client-libs/java.beans
1 (0.4%) client-libs/java.awt:i18n
42 (17.1%) core-libs
11 (4.5%) core-libs/java.util:i18n
7 (2.8%) core-libs/java.nio.charsets
7 (2.8%) core-libs/java.nio
4 (1.6%) core-libs/java.net
3 (1.2%) core-libs/java.lang
2 (0.8%) core-libs
1 (0.4%) core-libs/java.util.concurrent
1 (0.4%) core-libs/java.io:serialization
1 (0.4%) core-libs/java.util
1 (0.4%) core-libs/java.lang.invoke
1 (0.4%) core-libs/java.util.logging
1 (0.4%) core-libs/java.util:collections
1 (0.4%) core-libs/java.math
1 (0.4%) core-libs/java.time
32 (13.0%) security-libs
15 (6.1%) security-libs/java.security
7 (2.8%) security-libs/javax.crypto
4 (1.6%) security-libs/javax.net.ssl
4 (1.6%) security-libs/javax.crypto:pkcs11
2 (0.8%) security-libs/javax.xml.crypto
11 (4.5%) infrastructure
11 (4.5%) infrastructure/build
11 (4.5%) tools
7 (2.8%) tools/javac
2 (0.8%) tools/javadoc(tool)
2 (0.8%) tools/jlink
2 (0.8%) xml
2 (0.8%) xml/javax.xml.transform
1 (0.4%) core-svc
1 (0.4%) core-svc/debugger

Distribution by affiliation

Count Committer
246 Total
123 (50.0%) SAP
69 (28.0%) Christoph Langer
27 (11.0%) Goetz Lindenmaier
14 (5.7%) Matthias Baesken
13 (5.3%) Martin Doerr
93 (37.8%) Red Hat
85 (34.6%) Aleksey Shipilev
4 (1.6%) Andrew Hughes
4 (1.6%) Severin Gehwolf
8 (3.3%) NTT DATA
8 (3.3%) Yasumasa Suenaga
7 (2.8%) Amazon
7 (2.8%) Paul Hohensee
7 (2.8%) Azul
6 (2.4%) Dmitry Cherepanov
1 (0.4%) Andrew Brygin
3 (1.2%) @littlepinkcloud.com
3 (1.2%) Andrew Haley
2 (0.8%) Google
1 (0.4%) Martin Buchholz
1 (0.4%) Jiangli Zhou
2 (0.8%) Oracle
1 (0.4%) Stuart Marks
1 (0.4%) Sean Coffey
1 (0.4%) Huawei
1 (0.4%) Fei Yang

Chronological push log:

Days Ago Committer Affiliation Bug Summary
792 Christoph Langer SAP JDK-8227015 Assertion in sun/util/locale/provider/CalendarDataUtility on Windows after JDK-8218960
792 Christoph Langer SAP JDK-8226880 Backport of JDK-8208698 (Improved ECC Implementation) should not bring parts of JDK-8205476 (KeyAgreement#generateSecret is not reset for ECDH based algorithm)
798 Matthias Baesken SAP JDK-8226728 events logging in deoptimization.cpp should go to deopt-log
798 Matthias Baesken SAP JDK-8226727 replace open by os::open in hotspot coding
803 Andrew Haley @littlepinkcloud.com JDK-8226481 G1 GC: Undefined behaviour in G1BlockOffsetTablePart::block_at_or_preceding
810 Christoph Langer SAP JDK-8225727 Add Jib support for VERSION_EXTRA*
810 Fei Yang Huawei JDK-8225721 aarch64: rflags is not correct after safepoint poll
815 Christoph Langer SAP JDK-8225500 Improved ECC Implementation
819 Christoph Langer SAP JDK-8225241 Deadlock in JFR string pool
823 Aleksey Shipilev Red Hat JDK-8225119 Unsafe write after primitive array creation may result in array length change
824 Christoph Langer SAP JDK-8225088 Add libXrandr-devel to the Linux devkits
824 Christoph Langer SAP JDK-8225087 To remove lib/security from test/jdk/TEST.groups
824 Christoph Langer SAP JDK-8225086 Problem list test security/infra/java/security/cert/CertPathValidator/certification/ActalisCA.java
824 Christoph Langer SAP JDK-8225085 Test ComodoCA.java fails
826 Andrew Haley @littlepinkcloud.com JDK-8224888 AArch64: java/javac error with AllocatePrefetchDistance
826 Andrew Haley @littlepinkcloud.com JDK-8224887 AArch64: mauve System.arraycopy test failure
826 Yasumasa Suenaga NTT DATA JDK-8224884 hotspot/test/serviceability/sa/sadebugd/SADebugDTest.java failed with timed out
826 Yasumasa Suenaga NTT DATA JDK-8224883 SA: debugd options should follow jhsdb style
826 Aleksey Shipilev Red Hat JDK-8224872 JNICALL declaration breaks Splash screen functions
827 Sean Coffey Oracle JDK-8224832 Localized names for Japanese Era Reiwa in COMPAT provider
828 Goetz Lindenmaier SAP JDK-8224797 Print methods in exception messages in java-like Syntax.
830 Christoph Langer SAP JDK-8224757 [testbug] sun/nio/cs/OLD/TestIBMDB.java does not compile (aix)
830 Christoph Langer SAP JDK-8224755 DnD operation change feature does not work with 64bit big endian CPU
830 Christoph Langer SAP JDK-8224754 X11 Time stamp data should be unsigned
830 Christoph Langer SAP JDK-8224753 X11 icon window color handing bug
830 Matthias Baesken SAP JDK-8224726 cleanup ticks related coding in os_perf_aix.cpp [aix]
831 Aleksey Shipilev Red Hat JDK-8224697 Wrapper Key may get deleted when closing sessions in SunPKCS11 crypto provider
831 Aleksey Shipilev Red Hat JDK-8224696 SIGBUS in Java_sun_security_pkcs11_wrapper_PKCS11_getNativeKeyInfo after JDK-6913047
831 Aleksey Shipilev Red Hat JDK-8224695 Disable JDK-6913047 fix (SunPKCS11 memory leak) after JDK-8216597 (SIGBUS error in getNativeKeyInfo)
831 Aleksey Shipilev Red Hat JDK-8224694 Long term memory leak when using PKCS11 and JCE exceeds 32 bit process address space
832 Dmitry Cherepanov Azul JDK-8224587 Inconsistent settings between JFR.configure and -XX:FlightRecorderOptions
832 Dmitry Cherepanov Azul JDK-8224586 JFR should record the PID of the recorded process
832 Dmitry Cherepanov Azul JDK-8224585 Reduce noise induced by periodic task getFileSize()
833 Severin Gehwolf Red Hat JDK-8224474 harfbuzz 2.3.1 code fails to compile with gcc 4.4.7
833 Matthias Baesken SAP JDK-8224470 add steal tick related information to hs_error file [linux]
833 Matthias Baesken SAP JDK-8224469 linux-s390 : os::get_summary_cpu_info gives bad output
833 Christoph Langer SAP JDK-8224366 Remove two DocuSign root certificates that are expiring
833 Christoph Langer SAP JDK-8224271 StringIndexOutOfBoundsException happens via GetStringUTFRegion()
833 Christoph Langer SAP JDK-8224270 Unix/X11 setCompositionEnableNative issue
833 Christoph Langer SAP JDK-8224269 AWT SystemColor setting on CDE
834 Christoph Langer SAP JDK-8223973 Remove two Comodo root CA certificates that are expiring
834 Christoph Langer SAP JDK-8224229 Update public suffix version
834 Christoph Langer SAP JDK-8224227 [TEST_BUG] RemotePrinterStatusRefresh test is hard to use
834 Christoph Langer SAP JDK-8224226 CONFIG level logging statements printed in CLDRCalendarDataProviderImpl.java even when default log Level is INFO
834 Christoph Langer SAP JDK-8224224 Upgrade IANA LSR data
834 Christoph Langer SAP JDK-8224223 All TrayIcon MessageType icons does not show up with gtk3 option set
834 Christoph Langer SAP JDK-8224220 jQuery UI upgrade from 1.11.4 to 1.12.1
834 Christoph Langer SAP JDK-8224219 Remove src/java.desktop/unix/classes/sun/awt/X11/keysym2ucs.h
834 Christoph Langer SAP JDK-8224218 (zipfs) jdk/nio/zipfs/ZipFSTester.java RuntimeException: CHECK_FAILED! (getAttribute.crc failed 6af4413c vs 0 ...)
834 Yasumasa Suenaga NTT DATA JDK-8224209 Minimal VM build failure after JDK-8219414
834 Yasumasa Suenaga NTT DATA JDK-8224208 SA: jhsdb jsnap throws UnmappedAddressException with core generated by gcore
834 Yasumasa Suenaga NTT DATA JDK-8224207 [Zero] Build fails after JDK-8200613
834 Yasumasa Suenaga NTT DATA JDK-8224206 SA: jstack throws UnmappedAddressException with a CDS core file
834 Yasumasa Suenaga NTT DATA JDK-8224205 Incorrect amount of memory unmapped with ImageFileReader::close()
834 Martin Doerr SAP JDK-8224196 32-bit build failures after JDK-8181143 (Introduce diagnostic flag to abort VM on too long VM operations)
834 Martin Doerr SAP JDK-8224195 Introduce diagnostic flag to abort VM on too long VM operations
834 Martin Doerr SAP JDK-8224194 PPC64: Fix uninitialized variable in C1 LIR assembler code
834 Aleksey Shipilev Red Hat JDK-8224192 Performance regression in deserialization (4-6% in SPECjbb)
839 Aleksey Shipilev Red Hat JDK-8223963 X11 default visual support for IM status window on VNC
840 Dmitry Cherepanov Azul JDK-8223855 Unexpected behavior of PropertyDescription.getReadMethod for boolean properties
840 Dmitry Cherepanov Azul JDK-8223854 Remove references in xwindows.md to non-existent files.
840 Dmitry Cherepanov Azul JDK-8223853 Update GIFlib library to the 5.1.8
840 Christoph Langer SAP JDK-8223832 lookupPrintServices() does not always update the list of Windows remote printers
840 Christoph Langer SAP JDK-8223830 [Windows] Exception if no printers are installed.
840 Christoph Langer SAP JDK-8223829 Fix AIX build after the removal of Xrandr.h and add a configure check for it
840 Christoph Langer SAP JDK-8223828 Remove Xrandr include files from JDK sources
840 Christoph Langer SAP JDK-8223824 Upgrade HarfBuzz to the latest 2.3.1
840 Christoph Langer SAP JDK-8223816 Cleanups in cacerts tests
841 Jiangli Zhou Google JDK-8223792 (zipfs) Performance regression when writing ZipFileSystem entries in parallel
841 Paul Hohensee Amazon JDK-8223791 HTML Tooltip with "img src=" on component doesn't show
846 Christoph Langer SAP JDK-8223578 [javac] fails and exits with no error if a bad annotation processor provided
847 Yasumasa Suenaga NTT DATA JDK-8223535 JFR did not collect call stacks when MaxJavaStackTraceDepth is set to zero
847 Christoph Langer SAP JDK-8223517 Remove T-Systems root CA certificate
847 Andrew Brygin Azul JDK-8223503 Wrong fontMetrics when printing in Landscape (OpenJDK)
847 Martin Buchholz Google JDK-8223497 ConcurrentSkipListMap.clone() shares size variable between original and clone
847 Aleksey Shipilev Red Hat JDK-8223486 split-if update_uses accesses stale idom data
847 Aleksey Shipilev Red Hat JDK-8223485 C2: PhaseIdealLoop::create_new_if_for_predicate() computes wrong IDOM
847 Aleksey Shipilev Red Hat JDK-8223484 Remove HPKeysym.h from JDK sources
847 Aleksey Shipilev Red Hat JDK-8223483 assert(java_lang_invoke_ResolvedMethodName::vmtarget(resolved_method()) == m()) failed: Should not change after link resolution
847 Severin Gehwolf Red Hat JDK-8223480 SA: serviceability/sa/TestInstanceKlassSize*.java fails when running in CDS mode
847 Severin Gehwolf Red Hat JDK-8223479 [i386] expand_exec_shield_cs_limit workaround is undefined code after JDK-8199717
847 Christoph Langer SAP JDK-8223474 Input freezes after MacOS key-selector (press&hold) usage on macOS Mojave
847 Christoph Langer SAP JDK-8223473 Add GlobalSign's R6 Root certificate
847 Goetz Lindenmaier SAP JDK-8223460 PPC64: Improve comments in the JVM signal handler to match ISA text
847 Goetz Lindenmaier SAP JDK-8223459 Fix bad function case for controlled JVM crash on PPC64 big-endian
847 Martin Doerr SAP JDK-8223458 Unnecessary liveness computation with JVMTI
847 Martin Doerr SAP JDK-8223266 PPC64: Check for branch to illegal address before checking for mem serialization
847 Goetz Lindenmaier SAP JDK-8223440 Improve the wording of LinkageErrors to include module and class loader information
853 Aleksey Shipilev Red Hat JDK-8223192 Windows IME related patch
858 Severin Gehwolf Red Hat JDK-8223023 TEST_BUG: java/util/logging/LogManager/TestLoggerNames.java generates intermittent ClassCastException
859 Aleksey Shipilev Red Hat JDK-8222982 IBM-858 alias name is missing on IBM00858 charset
859 Christoph Langer SAP JDK-8221990 Program fails when using JDK addressed by UNC path and using Security Manager
860 Stuart Marks Oracle JDK-8222954 get(null) on single-entry unmodifiable Map returns null instead of throwing NPE
861 Paul Hohensee Amazon JDK-8222890 MethodHandleProxies.asInterfaceInstance does not support default methods
861 Aleksey Shipilev Red Hat JDK-8222887 Problem list java/awt/FontMetrics/MaxAdvanceIsMax.java
861 Aleksey Shipilev Red Hat JDK-8222886 FontMetrics.getMaxAdvance may be less than the maximum FontMetrics.charWidth
861 Aleksey Shipilev Red Hat JDK-8222885 Cannot use italic font style if the font has embedded bitmap
861 Christoph Langer SAP JDK-8222879 Add configure options for Mac Bundle creation
861 Christoph Langer SAP JDK-8222878 Better customization for Windows RC properties FileDescription and ProductName
861 Christoph Langer SAP JDK-8222877 Add temporary exceptions for root certs that are due to expire soon
861 Christoph Langer SAP JDK-8222876 [TESTBUG] sun/security/lib/cacerts/VerifyCACerts.java fails due to cert within 90-day expiry window
861 Christoph Langer SAP JDK-8222875 JNI exception pending in PlainDatagramSocketImpl.c
861 Aleksey Shipilev Red Hat JDK-8222873 hs_err should print more instructions in hex dump
861 Aleksey Shipilev Red Hat JDK-8222872 java/nio/file/attribute/BasicFileAttributeView/UnixSocketFile hangs when "nc" does not accept "-U"
861 Aleksey Shipilev Red Hat JDK-8222871 x86_32 tests with UseSHA1Intrinsics SEGV due to garbled registers
861 Aleksey Shipilev Red Hat JDK-8222870 javadoc search sometimes generates bad URIs
861 Aleksey Shipilev Red Hat JDK-8222869 Fix version number in mesa.md 3rd party legal file
861 Aleksey Shipilev Red Hat JDK-8222868 C2: Static field accesses in clinit can trigger deoptimizations
861 Aleksey Shipilev Red Hat JDK-8222867 (zipfs) Cleanups in implementation classes of jdk.zipfs and tests
861 Aleksey Shipilev Red Hat JDK-8222866 (zipfs) [TESTBUG] ZipFSTester.java failed intermittently in ZipFSTester.checkRead(): bound must be positive
861 Aleksey Shipilev Red Hat JDK-8222865 (zipfs) ZipFileSystem.EntryOutputStreamCRC32 mistakenly set the crc32 value into size field
861 Aleksey Shipilev Red Hat JDK-8222864 JFR: recordings on 32-bit systems unreadable
861 Aleksey Shipilev Red Hat JDK-8222863 condy causes JVM crash
861 Aleksey Shipilev Red Hat JDK-8222862 x86_32 fails with "wrong size of mach node" on AVX-512 machine
861 Aleksey Shipilev Red Hat JDK-8222861 serviceability/sa/TestPrintMdo.java fails on 32-bit platforms
861 Aleksey Shipilev Red Hat JDK-8222860 The fix done for JDK-8214253 have caused issues in JTree behaviour
861 Martin Doerr SAP JDK-8222848 Readability check in Symbol::is_valid not performed for some addresses
861 Martin Doerr SAP JDK-8222847 [PPC64] Clobber memory effect missing for memory barriers in atomics
861 Martin Doerr SAP JDK-8222846 s390: Add intrinsic for GHASH algorithm
861 Martin Doerr SAP JDK-8222845 tools/javac/classreader/8171132/BadConstantValue.java failed with "did not see expected error"
876 Christoph Langer SAP JDK-8222119 Resurrect (legacy) JRE bundle target
876 Christoph Langer SAP JDK-8222118 build/releaseFile/CheckSource.java failed additional sources found
876 Christoph Langer SAP JDK-8222117 Support git as an SCM alternative in the build
876 Christoph Langer SAP JDK-8222116 custom extension for make/SourceRevision.gmk
876 Goetz Lindenmaier SAP JDK-8222109 ProblemList hotspot tests failing in SAP testing.
879 Christoph Langer SAP JDK-8222055 Improve Exception thrown when MulticastSocket.setInterface fails on AIX(Unix)
879 Aleksey Shipilev Red Hat JDK-8222017 use driver to run CtwRunner in applications/ctw tests
879 Aleksey Shipilev Red Hat JDK-8222016 [TESTBUG] Fix test langtools/tools/javac/processing/model/completionfailure/SymbolsDontCumulate.java in standalone mode
880 Goetz Lindenmaier SAP JDK-8221976 Revert JDK-8221767 mistakenly pushed to jdk11u 11.0.3
880 Goetz Lindenmaier SAP JDK-8221975 hotspot C1 issue with comparing long numbers on x86 32-bit
881 Andrew Hughes Red Hat JDK-8221933 Replace the placeholder Japanese era name
881 Andrew Hughes Red Hat JDK-8221928 Calendar.getDisplayName() returns empty string for new Japanese Era on some locales
881 Andrew Hughes Red Hat JDK-8221927 Cannot parse JapaneseDate string with DateTimeFormatterBuilder Mapped-values
881 Andrew Hughes Red Hat JDK-8221926 Move java/util/Calendar/CalendarTestScripts tests into OpenJDK
881 Paul Hohensee Amazon JDK-8221923 (fs) UnixNativeDispatcher close and readdir usages should be fixed
881 Paul Hohensee Amazon JDK-8221920 Fix for 8202794 breaks tier1 builds
881 Paul Hohensee Amazon JDK-8221919 Native Unix code should use readdir rather than readdir_r
881 Christoph Langer SAP JDK-8221912 [TESTBUG] serviceability/sa/TestHeapDumpForLargeArray.java fails with jtreg -vmoption:-Xmx < 8g
881 Martin Doerr SAP JDK-8221898 [s390] Fix JFR profiling
882 Paul Hohensee Amazon JDK-8221874 os::readdir should use readdir instead of readdir_r
882 Paul Hohensee Amazon JDK-8221843 SAXException: Invalid UTF-16 surrogate detected: d83c ?
882 Christoph Langer SAP JDK-8221840 TestOopCmp.java fails due to "Multiple garbage collectors selected"
882 Christoph Langer SAP JDK-8221839 [ppc64] Wrong oop compare in C1-generated code
882 Goetz Lindenmaier SAP JDK-8221834 PPC64: Fix signal handler for SIGSEGV on branch to illegal address
882 Aleksey Shipilev Red Hat JDK-8221832 java/lang/String/StringRepeat.java test requests too much heap
882 Aleksey Shipilev Red Hat JDK-8221831 java/math/BigInteger/LargeValueExceptions.java test should be disabled on 32-bit platforms
882 Aleksey Shipilev Red Hat JDK-8221830 Lots of com/sun/crypto/provider/Cipher tests fail on x86_32 due to missing SHA512 stubs
882 Aleksey Shipilev Red Hat JDK-8221829 C2 Compilation failure when accessing off-heap memory using Unsafe
882 Matthias Baesken SAP JDK-8221318 [11u] do not disable c99 on Solaris
883 Aleksey Shipilev Red Hat JDK-8221740 C2: LoopStripMining doesn't strip as expected
887 Goetz Lindenmaier SAP JDK-8221608 (scanner) java/util/Scanner/ScanTest.java fails
889 Aleksey Shipilev Red Hat JDK-8221469 AArch64: Register corruption in slow subtype check
889 Christoph Langer SAP JDK-8221468 (testbug) MOptionTest test fails with java.lang.AssertionError: Classfiles too old!
889 Aleksey Shipilev Red Hat JDK-8221464 AArch64: method handle invocation does not respect JVMTI interp_only mode
889 Aleksey Shipilev Red Hat JDK-8221463 Implement MacroAssembler::warn method on AArch64
889 Aleksey Shipilev Red Hat JDK-8221462 idempotent protection missing in crc32c.h
890 Matthias Baesken SAP JDK-8221391 [macosx] fix pthread_getschedparam and pthread_setschedparam calls
893 Aleksey Shipilev Red Hat JDK-8221337 "failed: unexpected type" assert failure in ConnectionGraph::split_unique_types() with unsafe accesses
893 Matthias Baesken SAP JDK-8221322 Provide virtualization related info in the hs_error file on linux ppc64 / ppc64le
893 Christoph Langer SAP JDK-8220360 (process) Provide a way for Runtime.exec to use posix_spawn on linux
893 Christoph Langer SAP JDK-8212991 VM asserts after CDS archive has been unmapped
894 Aleksey Shipilev Red Hat JDK-8221295 Automate DashOffset test
894 Aleksey Shipilev Red Hat JDK-8221240 JVM crash in ResolvedMethodTable::add_method(Handle)
894 Aleksey Shipilev Red Hat JDK-8221239 Fix JVMTI test failure HS202
894 Matthias Baesken SAP JDK-8221225 JDK-8218060 breaks build for S390
894 Matthias Baesken SAP JDK-8221224 JDK-8217786 breaks build due to remaining unused function
894 Matthias Baesken SAP JDK-8221223 Provide virtualization related info in the hs_error file on linux s390x
894 Goetz Lindenmaier SAP JDK-8221217 [AArch64] Interpreter and c1 don't correctly handle jboolean results in native calls
894 Goetz Lindenmaier SAP JDK-8221216 AArch64: jtreg test vmTestbase/nsk/jvmti/PopFrame/popframe005 segfaults
894 Goetz Lindenmaier SAP JDK-8221215 AArch64: monitor unlock fast path not called
894 Goetz Lindenmaier SAP JDK-8221214 AArch64: unsafe.compareAndSetByte() and unsafe.compareAndSetShort() c2 intrinsics broken with negative expected value
894 Goetz Lindenmaier SAP JDK-8221213 ZGC fails to build on GCC 4.4.7: Type parameter issue
895 Aleksey Shipilev Red Hat JDK-8221167 JavaFX crashes on Ubuntu 18.04 with Wayland while using Swing-FX interop
895 Matthias Baesken SAP JDK-8221152 missing NULL checks in libnet in interface iteration and potential resource leak in getMacAddress
895 Matthias Baesken SAP JDK-8221151 name_and_sig_as_C_string usages in frame_s390 miss ResourceMark
895 Matthias Baesken SAP JDK-8221150 ppc: adjust NativeGeneralJump::insert_unconditional to stack allocated MacroAssembler
896 Aleksey Shipilev Red Hat JDK-8221116 The whole text in target JPasswordField image are not selected.
896 Aleksey Shipilev Red Hat JDK-8221115 Problematic sparc intrinsic: com.sun.crypto.provider.CipherBlockChaining
896 Aleksey Shipilev Red Hat JDK-8221114 There is no icon in all JOptionPane target image
896 Aleksey Shipilev Red Hat JDK-8221113 ECC Field Arithmetic Enhancements
896 Aleksey Shipilev Red Hat JDK-8221112 Upgrade IANA LSR data
896 Aleksey Shipilev Red Hat JDK-8221111 XToolkit is not correctly displayed color on 16-bit high color setting
896 Aleksey Shipilev Red Hat JDK-8221110 Expanded & Collapsed nodes of a JTree look the same on GTK3
896 Aleksey Shipilev Red Hat JDK-8221109 Tooltip is transparent rather than having a black background
896 Aleksey Shipilev Red Hat JDK-8221108 Swing applications with JRadioButton and JCheckbox fail to render correctly when using GTK3 and the GTK L&F
896 Aleksey Shipilev Red Hat JDK-8221107 JProgressBar display issue with GTKLookAndFeel
896 Aleksey Shipilev Red Hat JDK-8221106 JScrollBar display issue with GTKLookAndFeel
896 Aleksey Shipilev Red Hat JDK-8221105 JSlider display issue with slider for GTKLookAndFeel
896 Aleksey Shipilev Red Hat JDK-8221104 JOptionPane display issue with GTKLookAndFeel
896 Aleksey Shipilev Red Hat JDK-8221103 JTextPane display issue with GTKLookAndFeel
896 Aleksey Shipilev Red Hat JDK-8220718 Missing ResourceMark in nmethod::metadata_do
897 Martin Doerr SAP JDK-8220779 [TESTBUG] TestRegisterRestoring uses SafepointALot without UnlockDiagnosticVMOptions
897 Martin Doerr SAP JDK-8220778 Try to dump error file by thread which causes safepoint timeout
899 Aleksey Shipilev Red Hat JDK-8220760 XML Digital Signature throws NAMESPACE_ERR exception on OpenJDK 11, works 8/9/10
899 Aleksey Shipilev Red Hat JDK-8220759 ENVELOPING XML signature no longer works
899 Aleksey Shipilev Red Hat JDK-8220758 The size of key_exchange may be wrong on FFDHE
899 Aleksey Shipilev Red Hat JDK-8220757 HttpClient SSL race if a socket IOException is raised before ALPN is available
899 Aleksey Shipilev Red Hat JDK-8220756 Calling JSpinner's setFont with null throws NullPointerException
899 Aleksey Shipilev Red Hat JDK-8220755 X25519/X448 code improvements
901 Goetz Lindenmaier SAP JDK-8220655 ZGC fails to build on GCC 4.4.7: ATTRIBUTE_ALIGNED compatibility issue
901 Goetz Lindenmaier SAP JDK-8220654 [TESTBUG] Fix crashes in new test hotspot gtest "test_print_hex_dump"
901 Goetz Lindenmaier SAP JDK-8220653 compiler/ciReplay/TestServerVM.java is failing on windows
901 Goetz Lindenmaier SAP JDK-8220652 [TESTBUG] TestOptionsWithRanges.java produces hs_err_pidXXXXX.log file for VMThreadStackSize=9007199254740991
901 Goetz Lindenmaier SAP JDK-8220651 New era placeholder not recognized by java.text.SimpleDateFormat
902 Christoph Langer SAP JDK-8220578 javac can't tell during speculative attribution if a diamond expression is creating an anonymous inner class or not
902 Aleksey Shipilev Red Hat JDK-8220574 Delegated task created by SSLEngine throws BufferUnderflowException
902 Aleksey Shipilev Red Hat JDK-8220573 Delegated task created by SSLEngine throws java.nio.BufferUnderflowException
902 Aleksey Shipilev Red Hat JDK-8220572 The use of TransportContext.fatal() leads to bad coding style
902 Aleksey Shipilev Red Hat JDK-8220571 SA: CollectedHeap provides broken implementation for used() and capacity()
903 Aleksey Shipilev Red Hat JDK-8220535 aarch64: SIGILL triggered when specifying unsupported hardware features
903 Aleksey Shipilev Red Hat JDK-8220534 Encryption using GCM results in RuntimeException: input length out of bound
903 Goetz Lindenmaier SAP JDK-8220482 javax/swing/reliability/HangDuringStaticInitialization.java may hang on macos
904 Aleksey Shipilev Red Hat JDK-8220448 Internal Error (javaCalls.cpp:61) guarantee(thread->can_call_java()) failed
904 Aleksey Shipilev Red Hat JDK-8220447 assert(false) failed: Non-balanced monitor enter/exit! Likely JNI locking
904 Christoph Langer SAP JDK-8220440 Crash in runtime image built with jlink --compress=2
904 Christoph Langer SAP JDK-8220439 SA: Attach/detach might fail on Linux if debugee application create/destroy threads during attaching
904 Christoph Langer SAP JDK-8220438 Remove GTE CyberTrust Global Root
904 Martin Doerr SAP JDK-8220437 PPC: Crash after C1 checkcast patched and GC
904 Christoph Langer SAP JDK-8220436 Move security/cacerts/VerifyCACerts.java and security/CheckBlacklistedCerts.java
904 Christoph Langer SAP JDK-8220435 test/jdk/lib/security/CheckBlacklistedCerts.java searching for wrong paths
904 Christoph Langer SAP JDK-8220434 Remove jprt support
907 Christoph Langer SAP JDK-8220361 Improve freetype detection on linux/ppc64/ppc64le/s390x
907 Christoph Langer SAP JDK-8220358 Compilation failure in codeBlob.cpp for Windows 32-bit
908 Christoph Langer SAP JDK-8220289 AIX build issue after JDK-8214533
908 Christoph Langer SAP JDK-8220288 IBM-29626C is required for AIX default charset
908 Christoph Langer SAP JDK-8220287 IBM-964 is required for AIX default charset
908 Christoph Langer SAP JDK-8220286 IBM970 charset has missing entry and remove unexpected entries
908 Christoph Langer SAP JDK-8220285 Add x-IBM-1129 charset
908 Christoph Langer SAP JDK-8220284 Memory leak issue on awt_InputMethod.c
908 Goetz Lindenmaier SAP JDK-8220279 [testbug] com/sun/jdi/RedefineNestmateAttr/TestNestmateAttr.java must pass classpath to subprocess
908 Goetz Lindenmaier SAP JDK-8220278 Hsperf counter ParNew::CMS should be ParNew:CMS
908 Goetz Lindenmaier SAP JDK-8220277 JDWP is broken on 32 bit Windows: transport library missing onLoad entry
908 Goetz Lindenmaier SAP JDK-8220276 Change isJavaIdentifierStart and isJavaIdentifierPart to handle new code points
908 Goetz Lindenmaier SAP JDK-8220275 Square character support for the Japanese new era
908 Goetz Lindenmaier SAP JDK-8220274 Add test cases for lenient Japanese era parsing
911 Aleksey Shipilev Red Hat JDK-8220055 Incorrect version info in jaccessinspector.exe and jaccesswalker.exe
911 Aleksey Shipilev Red Hat JDK-8220054 Exception in thread "AWT-EventQueue-1" java.lang.IllegalArgumentException: null source
912 Aleksey Shipilev Red Hat JDK-8220035 Problems with AES-GCM native acceleration
912 Aleksey Shipilev Red Hat JDK-8220034 Crypto AES/ECB encryption/decryption performance regression (introduced in jdk9b73)
912 Aleksey Shipilev Red Hat JDK-8220033 -Xlog option usage => Invalid decorator '\temp\app_cds.log'.
914 Christoph Langer SAP JDK-8219984 [TESTBUG] A number of native hotspot unit tests fail when executed in stand-alone mode
915 Aleksey Shipilev Red Hat JDK-8219943 AssertionError in DeferredAttr at setOverloadKind caused by JDK-8203679
915 Aleksey Shipilev Red Hat JDK-8219942 Crash in C2 compiled code during execution of double array heavy processing code
915 Aleksey Shipilev Red Hat JDK-8219941 c.s.t.javac.code.DeferredCompletionFailureHandler seems to use WeakHashMap incorrectly
915 Aleksey Shipilev Red Hat JDK-8219940 [TESTBUG] gc/epsilon/TestMemoryMXBeans should retry on failure
915 Goetz Lindenmaier SAP JDK-8219924 Loop predication "assert(f <= 1 && f >= 0) failed Incorrect frequency"

No changesets log

JDK-8228779 jfr/event/os/TestSystemProcess.java fails on missing events
JDK-8222809 Error in jdeps documentation

Committer push log

Andrew Hughes, Red Hat

Bug Summary
JDK-8221928 Calendar.getDisplayName() returns empty string for new Japanese Era on some locales
JDK-8221927 Cannot parse JapaneseDate string with DateTimeFormatterBuilder Mapped-values
JDK-8221926 Move java/util/Calendar/CalendarTestScripts tests into OpenJDK
JDK-8221933 Replace the placeholder Japanese era name

Andrew Haley, @littlepinkcloud.com

Bug Summary
JDK-8224888 AArch64: java/javac error with AllocatePrefetchDistance
JDK-8224887 AArch64: mauve System.arraycopy test failure
JDK-8226481 G1 GC: Undefined behaviour in G1BlockOffsetTablePart::block_at_or_preceding

Andrew Brygin, Azul

Bug Summary
JDK-8223503 Wrong fontMetrics when printing in Landscape (OpenJDK)

Christoph Langer, SAP

Bug Summary
JDK-8220360 (process) Provide a way for Runtime.exec to use posix_spawn on linux
JDK-8221468 (testbug) MOptionTest test fails with java.lang.AssertionError: Classfiles too old!
JDK-8224218 (zipfs) jdk/nio/zipfs/ZipFSTester.java RuntimeException: CHECK_FAILED! (getAttribute.crc failed 6af4413c vs 0 ...)
JDK-8223578 [javac] fails and exits with no error if a bad annotation processor provided
JDK-8221839 [ppc64] Wrong oop compare in C1-generated code
JDK-8224227 [TEST_BUG] RemotePrinterStatusRefresh test is hard to use
JDK-8219984 [TESTBUG] A number of native hotspot unit tests fail when executed in stand-alone mode
JDK-8221912 [TESTBUG] serviceability/sa/TestHeapDumpForLargeArray.java fails with jtreg -vmoption:-Xmx < 8g
JDK-8224757 [testbug] sun/nio/cs/OLD/TestIBMDB.java does not compile (aix)
JDK-8222876 [TESTBUG] sun/security/lib/cacerts/VerifyCACerts.java fails due to cert within 90-day expiry window
JDK-8223830 [Windows] Exception if no printers are installed.
JDK-8222879 Add configure options for Mac Bundle creation
JDK-8223473 Add GlobalSign's R6 Root certificate
JDK-8225727 Add Jib support for VERSION_EXTRA*
JDK-8225088 Add libXrandr-devel to the Linux devkits
JDK-8222877 Add temporary exceptions for root certs that are due to expire soon
JDK-8220285 Add x-IBM-1129 charset
JDK-8220289 AIX build issue after JDK-8214533
JDK-8224223 All TrayIcon MessageType icons does not show up with gtk3 option set
JDK-8227015 Assertion in sun/util/locale/provider/CalendarDataUtility on Windows after JDK-8218960
JDK-8224269 AWT SystemColor setting on CDE
JDK-8226880 Backport of JDK-8208698 (Improved ECC Implementation) should not bring parts of JDK-8205476 (KeyAgreement#generateSecret is not reset for ECDH based algorithm)
JDK-8222878 Better customization for Windows RC properties FileDescription and ProductName
JDK-8222118 build/releaseFile/CheckSource.java failed additional sources found
JDK-8223816 Cleanups in cacerts tests
JDK-8220358 Compilation failure in codeBlob.cpp for Windows 32-bit
JDK-8224226 CONFIG level logging statements printed in CLDRCalendarDataProviderImpl.java even when default log Level is INFO
JDK-8220440 Crash in runtime image built with jlink --compress=2
JDK-8222116 custom extension for make/SourceRevision.gmk
JDK-8225241 Deadlock in JFR string pool
JDK-8224755 DnD operation change feature does not work with 64bit big endian CPU
JDK-8223829 Fix AIX build after the removal of Xrandr.h and add a configure check for it
JDK-8220288 IBM-29626C is required for AIX default charset
JDK-8220287 IBM-964 is required for AIX default charset
JDK-8220286 IBM970 charset has missing entry and remove unexpected entries
JDK-8222055 Improve Exception thrown when MulticastSocket.setInterface fails on AIX(Unix)
JDK-8220361 Improve freetype detection on linux/ppc64/ppc64le/s390x
JDK-8225500 Improved ECC Implementation
JDK-8223474 Input freezes after MacOS key-selector (press&hold) usage on macOS Mojave
JDK-8220578 javac can't tell during speculative attribution if a diamond expression is creating an anonymous inner class or not
JDK-8222875 JNI exception pending in PlainDatagramSocketImpl.c
JDK-8224220 jQuery UI upgrade from 1.11.4 to 1.12.1
JDK-8223832 lookupPrintServices() does not always update the list of Windows remote printers
JDK-8220284 Memory leak issue on awt_InputMethod.c
JDK-8220436 Move security/cacerts/VerifyCACerts.java and security/CheckBlacklistedCerts.java
JDK-8225086 Problem list test security/infra/java/security/cert/CertPathValidator/certification/ActalisCA.java
JDK-8221990 Program fails when using JDK addressed by UNC path and using Security Manager
JDK-8220438 Remove GTE CyberTrust Global Root
JDK-8220434 Remove jprt support
JDK-8224219 Remove src/java.desktop/unix/classes/sun/awt/X11/keysym2ucs.h
JDK-8223517 Remove T-Systems root CA certificate
JDK-8223973 Remove two Comodo root CA certificates that are expiring
JDK-8224366 Remove two DocuSign root certificates that are expiring
JDK-8223828 Remove Xrandr include files from JDK sources
JDK-8222119 Resurrect (legacy) JRE bundle target
JDK-8220439 SA: Attach/detach might fail on Linux if debugee application create/destroy threads during attaching
JDK-8224271 StringIndexOutOfBoundsException happens via GetStringUTFRegion()
JDK-8222117 Support git as an SCM alternative in the build
JDK-8225085 Test ComodoCA.java fails
JDK-8220435 test/jdk/lib/security/CheckBlacklistedCerts.java searching for wrong paths
JDK-8221840 TestOopCmp.java fails due to "Multiple garbage collectors selected"
JDK-8225087 To remove lib/security from test/jdk/TEST.groups
JDK-8224270 Unix/X11 setCompositionEnableNative issue
JDK-8224229 Update public suffix version
JDK-8223824 Upgrade HarfBuzz to the latest 2.3.1
JDK-8224224 Upgrade IANA LSR data
JDK-8212991 VM asserts after CDS archive has been unmapped
JDK-8224753 X11 icon window color handing bug
JDK-8224754 X11 Time stamp data should be unsigned

Sean Coffey, Oracle

Bug Summary
JDK-8224832 Localized names for Japanese Era Reiwa in COMPAT provider

Dmitry Cherepanov, Azul

Bug Summary
JDK-8224587 Inconsistent settings between JFR.configure and -XX:FlightRecorderOptions
JDK-8224586 JFR should record the PID of the recorded process
JDK-8224585 Reduce noise induced by periodic task getFileSize()
JDK-8223854 Remove references in xwindows.md to non-existent files.
JDK-8223855 Unexpected behavior of PropertyDescription.getReadMethod for boolean properties
JDK-8223853 Update GIFlib library to the 5.1.8

Fei Yang, Huawei

Bug Summary
JDK-8225721 aarch64: rflags is not correct after safepoint poll

Goetz Lindenmaier, SAP

Bug Summary
JDK-8221608 (scanner) java/util/Scanner/ScanTest.java fails
JDK-8221217 [AArch64] Interpreter and c1 don't correctly handle jboolean results in native calls
JDK-8220279 [testbug] com/sun/jdi/RedefineNestmateAttr/TestNestmateAttr.java must pass classpath to subprocess
JDK-8220654 [TESTBUG] Fix crashes in new test hotspot gtest "test_print_hex_dump"
JDK-8220652 [TESTBUG] TestOptionsWithRanges.java produces hs_err_pidXXXXX.log file for VMThreadStackSize=9007199254740991
JDK-8221216 AArch64: jtreg test vmTestbase/nsk/jvmti/PopFrame/popframe005 segfaults
JDK-8221215 AArch64: monitor unlock fast path not called
JDK-8221214 AArch64: unsafe.compareAndSetByte() and unsafe.compareAndSetShort() c2 intrinsics broken with negative expected value
JDK-8220274 Add test cases for lenient Japanese era parsing
JDK-8220276 Change isJavaIdentifierStart and isJavaIdentifierPart to handle new code points
JDK-8220653 compiler/ciReplay/TestServerVM.java is failing on windows
JDK-8223459 Fix bad function case for controlled JVM crash on PPC64 big-endian
JDK-8221975 hotspot C1 issue with comparing long numbers on x86 32-bit
JDK-8220278 Hsperf counter ParNew::CMS should be ParNew:CMS
JDK-8223440 Improve the wording of LinkageErrors to include module and class loader information
JDK-8220482 javax/swing/reliability/HangDuringStaticInitialization.java may hang on macos
JDK-8220277 JDWP is broken on 32 bit Windows: transport library missing onLoad entry
JDK-8219924 Loop predication "assert(f <= 1 && f >= 0) failed Incorrect frequency"
JDK-8220651 New era placeholder not recognized by java.text.SimpleDateFormat
JDK-8221834 PPC64: Fix signal handler for SIGSEGV on branch to illegal address
JDK-8223460 PPC64: Improve comments in the JVM signal handler to match ISA text
JDK-8224797 Print methods in exception messages in java-like Syntax.
JDK-8222109 ProblemList hotspot tests failing in SAP testing.
JDK-8221976 Revert JDK-8221767 mistakenly pushed to jdk11u 11.0.3
JDK-8220275 Square character support for the Japanese new era
JDK-8220655 ZGC fails to build on GCC 4.4.7: ATTRIBUTE_ALIGNED compatibility issue
JDK-8221213 ZGC fails to build on GCC 4.4.7: Type parameter issue

Jiangli Zhou, Google

Bug Summary
JDK-8223792 (zipfs) Performance regression when writing ZipFileSystem entries in parallel

Martin Buchholz, Google

Bug Summary
JDK-8223497 ConcurrentSkipListMap.clone() shares size variable between original and clone

Matthias Baesken, SAP

Bug Summary
JDK-8221318 [11u] do not disable c99 on Solaris
JDK-8221391 [macosx] fix pthread_getschedparam and pthread_setschedparam calls
JDK-8224470 add steal tick related information to hs_error file [linux]
JDK-8224726 cleanup ticks related coding in os_perf_aix.cpp [aix]
JDK-8226728 events logging in deoptimization.cpp should go to deopt-log
JDK-8221224 JDK-8217786 breaks build due to remaining unused function
JDK-8221225 JDK-8218060 breaks build for S390
JDK-8224469 linux-s390 : os::get_summary_cpu_info gives bad output
JDK-8221152 missing NULL checks in libnet in interface iteration and potential resource leak in getMacAddress
JDK-8221151 name_and_sig_as_C_string usages in frame_s390 miss ResourceMark
JDK-8221150 ppc: adjust NativeGeneralJump::insert_unconditional to stack allocated MacroAssembler
JDK-8221322 Provide virtualization related info in the hs_error file on linux ppc64 / ppc64le
JDK-8221223 Provide virtualization related info in the hs_error file on linux s390x
JDK-8226727 replace open by os::open in hotspot coding

Martin Doerr, SAP

Bug Summary
JDK-8224196 32-bit build failures after JDK-8181143 (Introduce diagnostic flag to abort VM on too long VM operations)
JDK-8222847 [PPC64] Clobber memory effect missing for memory barriers in atomics
JDK-8221898 [s390] Fix JFR profiling
JDK-8220779 [TESTBUG] TestRegisterRestoring uses SafepointALot without UnlockDiagnosticVMOptions
JDK-8224195 Introduce diagnostic flag to abort VM on too long VM operations
JDK-8223266 PPC64: Check for branch to illegal address before checking for mem serialization
JDK-8224194 PPC64: Fix uninitialized variable in C1 LIR assembler code
JDK-8220437 PPC: Crash after C1 checkcast patched and GC
JDK-8222848 Readability check in Symbol::is_valid not performed for some addresses
JDK-8222846 s390: Add intrinsic for GHASH algorithm
JDK-8222845 tools/javac/classreader/8171132/BadConstantValue.java failed with "did not see expected error"
JDK-8220778 Try to dump error file by thread which causes safepoint timeout
JDK-8223458 Unnecessary liveness computation with JVMTI

Paul Hohensee, Amazon

Bug Summary
JDK-8221923 (fs) UnixNativeDispatcher close and readdir usages should be fixed
JDK-8221920 Fix for 8202794 breaks tier1 builds
JDK-8223791 HTML Tooltip with "img src=" on component doesn't show
JDK-8222890 MethodHandleProxies.asInterfaceInstance does not support default methods
JDK-8221919 Native Unix code should use readdir rather than readdir_r
JDK-8221874 os::readdir should use readdir instead of readdir_r
JDK-8221843 SAXException: Invalid UTF-16 surrogate detected: d83c ?

Severin Gehwolf, Red Hat

Bug Summary
JDK-8223479 [i386] expand_exec_shield_cs_limit workaround is undefined code after JDK-8199717
JDK-8224474 harfbuzz 2.3.1 code fails to compile with gcc 4.4.7
JDK-8223480 SA: serviceability/sa/TestInstanceKlassSize*.java fails when running in CDS mode
JDK-8223023 TEST_BUG: java/util/logging/LogManager/TestLoggerNames.java generates intermittent ClassCastException

Aleksey Shipilev, Red Hat

Bug Summary
JDK-8221337 "failed: unexpected type" assert failure in ConnectionGraph::split_unique_types() with unsafe accesses
JDK-8222866 (zipfs) [TESTBUG] ZipFSTester.java failed intermittently in ZipFSTester.checkRead(): bound must be positive
JDK-8222867 (zipfs) Cleanups in implementation classes of jdk.zipfs and tests
JDK-8222865 (zipfs) ZipFileSystem.EntryOutputStreamCRC32 mistakenly set the crc32 value into size field
JDK-8220033 -Xlog option usage => Invalid decorator '\temp\app_cds.log'.
JDK-8222016 [TESTBUG] Fix test langtools/tools/javac/processing/model/completionfailure/SymbolsDontCumulate.java in standalone mode
JDK-8219940 [TESTBUG] gc/epsilon/TestMemoryMXBeans should retry on failure
JDK-8221464 AArch64: method handle invocation does not respect JVMTI interp_only mode
JDK-8221469 AArch64: Register corruption in slow subtype check
JDK-8220535 aarch64: SIGILL triggered when specifying unsupported hardware features
JDK-8220447 assert(false) failed: Non-balanced monitor enter/exit! Likely JNI locking
JDK-8223483 assert(java_lang_invoke_ResolvedMethodName::vmtarget(resolved_method()) == m()) failed: Should not change after link resolution
JDK-8219943 AssertionError in DeferredAttr at setOverloadKind caused by JDK-8203679
JDK-8221295 Automate DashOffset test
JDK-8219941 c.s.t.javac.code.DeferredCompletionFailureHandler seems to use WeakHashMap incorrectly
JDK-8221829 C2 Compilation failure when accessing off-heap memory using Unsafe
JDK-8221740 C2: LoopStripMining doesn't strip as expected
JDK-8223485 C2: PhaseIdealLoop::create_new_if_for_predicate() computes wrong IDOM
JDK-8222868 C2: Static field accesses in clinit can trigger deoptimizations
JDK-8220756 Calling JSpinner's setFont with null throws NullPointerException
JDK-8222885 Cannot use italic font style if the font has embedded bitmap
JDK-8222863 condy causes JVM crash
JDK-8219942 Crash in C2 compiled code during execution of double array heavy processing code
JDK-8220034 Crypto AES/ECB encryption/decryption performance regression (introduced in jdk9b73)
JDK-8220574 Delegated task created by SSLEngine throws BufferUnderflowException
JDK-8220573 Delegated task created by SSLEngine throws java.nio.BufferUnderflowException
JDK-8224695 Disable JDK-6913047 fix (SunPKCS11 memory leak) after JDK-8216597 (SIGBUS error in getNativeKeyInfo)
JDK-8221113 ECC Field Arithmetic Enhancements
JDK-8220534 Encryption using GCM results in RuntimeException: input length out of bound
JDK-8220759 ENVELOPING XML signature no longer works
JDK-8220054 Exception in thread "AWT-EventQueue-1" java.lang.IllegalArgumentException: null source
JDK-8221110 Expanded & Collapsed nodes of a JTree look the same on GTK3
JDK-8221239 Fix JVMTI test failure HS202
JDK-8222869 Fix version number in mesa.md 3rd party legal file
JDK-8222886 FontMetrics.getMaxAdvance may be less than the maximum FontMetrics.charWidth
JDK-8222873 hs_err should print more instructions in hex dump
JDK-8220757 HttpClient SSL race if a socket IOException is raised before ALPN is available
JDK-8222982 IBM-858 alias name is missing on IBM00858 charset
JDK-8221462 idempotent protection missing in crc32c.h
JDK-8221463 Implement MacroAssembler::warn method on AArch64
JDK-8220055 Incorrect version info in jaccessinspector.exe and jaccesswalker.exe
JDK-8220448 Internal Error (javaCalls.cpp:61) guarantee(thread->can_call_java()) failed
JDK-8221832 java/lang/String/StringRepeat.java test requests too much heap
JDK-8221831 java/math/BigInteger/LargeValueExceptions.java test should be disabled on 32-bit platforms
JDK-8222872 java/nio/file/attribute/BasicFileAttributeView/UnixSocketFile hangs when "nc" does not accept "-U"
JDK-8222870 javadoc search sometimes generates bad URIs
JDK-8221167 JavaFX crashes on Ubuntu 18.04 with Wayland while using Swing-FX interop
JDK-8222864 JFR: recordings on 32-bit systems unreadable
JDK-8224872 JNICALL declaration breaks Splash screen functions
JDK-8221104 JOptionPane display issue with GTKLookAndFeel
JDK-8221107 JProgressBar display issue with GTKLookAndFeel
JDK-8221106 JScrollBar display issue with GTKLookAndFeel
JDK-8221105 JSlider display issue with slider for GTKLookAndFeel
JDK-8221103 JTextPane display issue with GTKLookAndFeel
JDK-8221240 JVM crash in ResolvedMethodTable::add_method(Handle)
JDK-8224694 Long term memory leak when using PKCS11 and JCE exceeds 32 bit process address space
JDK-8221830 Lots of com/sun/crypto/provider/Cipher tests fail on x86_32 due to missing SHA512 stubs
JDK-8220718 Missing ResourceMark in nmethod::metadata_do
JDK-8224192 Performance regression in deserialization (4-6% in SPECjbb)
JDK-8222887 Problem list java/awt/FontMetrics/MaxAdvanceIsMax.java
JDK-8221115 Problematic sparc intrinsic: com.sun.crypto.provider.CipherBlockChaining
JDK-8220035 Problems with AES-GCM native acceleration
JDK-8223484 Remove HPKeysym.h from JDK sources
JDK-8220571 SA: CollectedHeap provides broken implementation for used() and capacity()
JDK-8222861 serviceability/sa/TestPrintMdo.java fails on 32-bit platforms
JDK-8224696 SIGBUS in Java_sun_security_pkcs11_wrapper_PKCS11_getNativeKeyInfo after JDK-6913047
JDK-8223486 split-if update_uses accesses stale idom data
JDK-8221108 Swing applications with JRadioButton and JCheckbox fail to render correctly when using GTK3 and the GTK L&F
JDK-8222860 The fix done for JDK-8214253 have caused issues in JTree behaviour
JDK-8220758 The size of key_exchange may be wrong on FFDHE
JDK-8220572 The use of TransportContext.fatal() leads to bad coding style
JDK-8221116 The whole text in target JPasswordField image are not selected.
JDK-8221114 There is no icon in all JOptionPane target image
JDK-8221109 Tooltip is transparent rather than having a black background
JDK-8225119 Unsafe write after primitive array creation may result in array length change
JDK-8221112 Upgrade IANA LSR data
JDK-8222017 use driver to run CtwRunner in applications/ctw tests
JDK-8223192 Windows IME related patch
JDK-8224697 Wrapper Key may get deleted when closing sessions in SunPKCS11 crypto provider
JDK-8223963 X11 default visual support for IM status window on VNC
JDK-8220755 X25519/X448 code improvements
JDK-8222862 x86_32 fails with "wrong size of mach node" on AVX-512 machine
JDK-8222871 x86_32 tests with UseSHA1Intrinsics SEGV due to garbled registers
JDK-8220760 XML Digital Signature throws NAMESPACE_ERR exception on OpenJDK 11, works 8/9/10
JDK-8221111 XToolkit is not correctly displayed color on 16-bit high color setting

Stuart Marks, Oracle

Bug Summary
JDK-8222954 get(null) on single-entry unmodifiable Map returns null instead of throwing NPE

Yasumasa Suenaga, NTT DATA

Bug Summary
JDK-8224207 [Zero] Build fails after JDK-8200613
JDK-8224884 hotspot/test/serviceability/sa/sadebugd/SADebugDTest.java failed with timed out
JDK-8224205 Incorrect amount of memory unmapped with ImageFileReader::close()
JDK-8223535 JFR did not collect call stacks when MaxJavaStackTraceDepth is set to zero
JDK-8224209 Minimal VM build failure after JDK-8219414
JDK-8224883 SA: debugd options should follow jhsdb style
JDK-8224208 SA: jhsdb jsnap throws UnmappedAddressException with core generated by gcore
JDK-8224206 SA: jstack throws UnmappedAddressException with a CDS core file