PUSHES REPORT: 11.0.5

This report shows who pushed the backports to the given release. This usually shows who did the backporting, testing, and review work.

Report generated: Wed Sep 01 03:21:55 CEST 2021

Distribution by priority

Count Priority
5 P1
44 P2
109 P3
146 P4
1 P5

Distribution by components

Count Component
305 Total
170 (55.7%) hotspot
65 (21.3%) hotspot/runtime
59 (19.3%) hotspot/compiler
8 (2.6%) hotspot/jfr
8 (2.6%) hotspot/svc
8 (2.6%) hotspot/gc
7 (2.3%) hotspot/svc-agent
6 (2.0%) hotspot
5 (1.6%) hotspot/jvmti
4 (1.3%) hotspot/test
49 (16.1%) core-libs
8 (2.6%) core-libs
6 (2.0%) core-libs/java.net
6 (2.0%) core-libs/java.time
6 (2.0%) core-libs/java.util:i18n
5 (1.6%) core-libs/java.nio
5 (1.6%) core-libs/java.lang
3 (1.0%) core-libs/java.util.concurrent
3 (1.0%) core-libs/java.util.jar
2 (0.7%) core-libs/java.util
1 (0.3%) core-libs/java.rmi
1 (0.3%) core-libs/java.io:serialization
1 (0.3%) core-libs/java.util:collections
1 (0.3%) core-libs/java.io
1 (0.3%) core-libs/javax.naming
35 (11.5%) security-libs
13 (4.3%) security-libs/java.security
7 (2.3%) security-libs/javax.net.ssl
6 (2.0%) security-libs/javax.crypto
2 (0.7%) security-libs/javax.smartcardio
2 (0.7%) security-libs/javax.security
2 (0.7%) security-libs/javax.crypto:pkcs11
2 (0.7%) security-libs
1 (0.3%) security-libs/javax.xml.crypto
21 (6.9%) client-libs
9 (3.0%) client-libs/2d
4 (1.3%) client-libs/java.awt
3 (1.0%) client-libs/javax.swing
2 (0.7%) client-libs
2 (0.7%) client-libs/javax.accessibility
1 (0.3%) client-libs/java.beans
12 (3.9%) infrastructure
10 (3.3%) infrastructure/build
2 (0.7%) infrastructure
7 (2.3%) xml
4 (1.3%) xml/jaxp
1 (0.3%) xml/javax.xml.transform
1 (0.3%) xml/org.w3c.dom
1 (0.3%) xml/org.xml.sax
5 (1.6%) core-svc
2 (0.7%) core-svc
1 (0.3%) core-svc/tools
1 (0.3%) core-svc/java.lang.instrument
1 (0.3%) core-svc/debugger
5 (1.6%) tools
2 (0.7%) tools/launcher
1 (0.3%) tools/javap
1 (0.3%) tools/javac
1 (0.3%) tools/javadoc(tool)
1 (0.3%) globalization
1 (0.3%) globalization/locale-data

Distribution by affiliation

Count Committer
305 Total
154 (50.5%) Red Hat
85 (27.9%) Aleksey Shipilev
30 (9.8%) Severin Gehwolf
16 (5.2%) Zhengyu Gu
9 (3.0%) Andrew Dinn
7 (2.3%) Roland Westrelin
5 (1.6%) Roman Kennke
1 (0.3%) Andrew Hughes
1 (0.3%) Mario Torre
136 (44.6%) SAP
91 (29.8%) Christoph Langer
22 (7.2%) Goetz Lindenmaier
10 (3.3%) Matthias Baesken
8 (2.6%) Martin Doerr
5 (1.6%) Thomas Stuefe
4 (1.3%) NTT DATA
4 (1.3%) Yasumasa Suenaga
3 (1.0%) Amazon
3 (1.0%) Paul Hohensee
3 (1.0%) Independent
1 (0.3%) Dmitriy Samersoff
1 (0.3%) Laurent Bourgès
1 (0.3%) Gustavo Romero
2 (0.7%) BellSoft
2 (0.7%) Dmitrij Pochepko
2 (0.7%) Google
2 (0.7%) Jiangli Zhou
1 (0.3%) Azul
1 (0.3%) Vladimir Kempik

Chronological push log:

Days Ago Committer Affiliation Bug Summary
686 Andrew Hughes Red Hat JDK-8232304 Change the environment variable for Java Access Bridge logging to have a directory
700 Laurent Bourgès Independent JDK-8231693 Backout "8230728: Thin stroked shapes are not rendered if affine transform has flip bit" from jdk11u
707 Christoph Langer SAP JDK-8231407 (fs) FileStore::isReadOnly is always true on macOS Catalina
711 Christoph Langer SAP JDK-8231301 Test sun/tools/jcmd/TestProcessHelper.java fails intermittently
711 Christoph Langer SAP JDK-8231300 Resolve permissions for code source URLs lazily
711 Christoph Langer SAP JDK-8231299 (tz) Upgrade time-zone data to tzdata2019b
711 Christoph Langer SAP JDK-8231298 TZ database in "vanguard" format support
715 Christoph Langer SAP JDK-8231061 problemList failing/ignored manual tests in security-libs
715 Christoph Langer SAP JDK-8231060 upgrade gtest to 1.8.1
722 Christoph Langer SAP JDK-8230757 (zipfs) zip file corruption when replacing an existing STORED entry
722 Christoph Langer SAP JDK-8230755 ProblemList sun/security/pkcs11/sslecc/ClientJSSEServerJSSE.java due to JDK-8161536
722 Christoph Langer SAP JDK-8230754 Many pkcs11 tests failed in Provider initialization, after compiler on Windows changed
725 Christoph Langer SAP JDK-8230710 Update Apache Santuario (XML Signature) to version 2.1.3
727 Aleksey Shipilev Red Hat JDK-8230573 java.lang.UnsatisfiedLinkError: net.dll: Can't find dependent libraries
727 Christoph Langer SAP JDK-8230537 Windows 32bit build error in libsunmscapi/security.cpp
727 Christoph Langer SAP JDK-8230535 (fs) More than one instance of built-in FileSystem observed in heap
729 Christoph Langer SAP JDK-8230432 Improve startup behavior of SecurityProperties
734 Goetz Lindenmaier SAP JDK-8230099 AArch64: Prepare for backport of JDK-8217368
735 Andrew Dinn Red Hat JDK-8230239 Aarch64: ReservedStackAccess may leave stack guard in inconsistent state
735 Aleksey Shipilev Red Hat JDK-8230210 [TESTBUG] serviceability/sa/ClhsdbFindPC fails on AArch64
735 Aleksey Shipilev Red Hat JDK-8230209 Xerces 2.12.0: License file
735 Aleksey Shipilev Red Hat JDK-8230208 Xerces 2.12.0: Validation
735 Aleksey Shipilev Red Hat JDK-8230207 Xerces 2.12.0: DOM Implementation
735 Aleksey Shipilev Red Hat JDK-8230206 Xerces 2.12.0: Parsing Configuration
735 Andrew Dinn Red Hat JDK-8230205 AArch64: Compiled CI stubs are unsafely modified
735 Andrew Dinn Red Hat JDK-8230204 CardTableBarrierSetAssembler::gen_write_ref_array_post_barrier() does not check for zero length on AARCH64
736 Severin Gehwolf Red Hat JDK-8230178 Windows build failure after JDK-8214777 (Avoid some GCC 8.X strncpy() errors in HotSpot)
736 Severin Gehwolf Red Hat JDK-8230177 Avoid some GCC 8.X strncpy() errors in HotSpot
736 Severin Gehwolf Red Hat JDK-8230176 Fix errors in LittleCMS 2.9 reported by GCC 8
736 Severin Gehwolf Red Hat JDK-8230175 GCC 8.3 reports errors in java.base
736 Severin Gehwolf Red Hat JDK-8230174 ByteArrayPublisher is not thread-safe resulting in broken re-use of HttpRequests
736 Severin Gehwolf Red Hat JDK-8230173 Memory leaks in the AWT on macOS
736 Aleksey Shipilev Red Hat JDK-8230171 C2-only debug build fails
736 Aleksey Shipilev Red Hat JDK-8230170 test for JDK-8216261 fails in Windows
736 Aleksey Shipilev Red Hat JDK-8230169 Javap ignores default modifier on interfaces
736 Aleksey Shipilev Red Hat JDK-8230167 Typo in java.security: Sasl.createClient and Sasl.createServer
736 Aleksey Shipilev Red Hat JDK-8230166 Enhance keystore load debug output
736 Aleksey Shipilev Red Hat JDK-8230165 Allow Sasl mechanisms to be restricted
736 Zhengyu Gu Red Hat JDK-8230164 Reduce minRefreshTime for updating remote printer list on Windows
736 Severin Gehwolf Red Hat JDK-8230163 LineNumberReader throws "Mark invalid" exception if CRLF straddles buffer.
736 Severin Gehwolf Red Hat JDK-8230157 Limit default test jobs based on memory size
736 Severin Gehwolf Red Hat JDK-8230156 Adjust default concurrency settings for running tests on Sparc
736 Martin Doerr SAP JDK-8230154 [s390, PPC64] Exception check missing in interpreter
736 Aleksey Shipilev Red Hat JDK-8230153 Speed up Properties.load
736 Christoph Langer SAP JDK-8230151 add memprotect calls to event log
736 Dmitrij Pochepko BellSoft JDK-8230149 AArch64: String.compareTo() can read memory after string
736 Christoph Langer SAP JDK-8230148 adjust format specifiers in loadlib_aix.cpp
736 Christoph Langer SAP JDK-8230147 fix wrong format specifiers in os_aix.cpp
736 Christoph Langer SAP JDK-8230146 test GetTotalSafepointTime.java fails on fast Linux machines with Total safepoint time 0 ms
736 Aleksey Shipilev Red Hat JDK-8230145 test/jdk/java/rmi/transport/runtimeThreadInheritanceLeak/RuntimeThreadInheritanceLeak.java failing with Xcomp
736 Aleksey Shipilev Red Hat JDK-8230144 test/jdk/java/beans/PropertyEditor/Test6397609.java failing
736 Yasumasa Suenaga NTT DATA JDK-8230143 SA: jhsdb common help needs to be more detailed
736 Yasumasa Suenaga NTT DATA JDK-8230142 sadebugd/DebugdConnectTest.java fails due to "java.rmi.NotBoundException: SARemoteDebugger"
736 Aleksey Shipilev Red Hat JDK-8230139 C2: assert(n->outcnt() != 0 || C->top() == n || n->is_Proj()) failed: No dead instructions after post-alloc
736 Christoph Langer SAP JDK-8230138 Problemlist javax/net/ssl/ServerName/SSLEngineExplorerMatchedSNI.java
737 Dmitriy Samersoff Independent JDK-8230125 Use of an uninitialized register in 32-bit ARM template interpreter
737 Andrew Dinn Red Hat JDK-8230124 AArch64: C2 recursive stack locking optimisation not triggered
737 Andrew Dinn Red Hat JDK-8230123 AArch64: Prepare for backport of JDK-8217368
740 Andrew Dinn Red Hat JDK-8230039 AArch64: NPE in clhsdb jstack command
740 Roland Westrelin Red Hat JDK-8230038 Running jcmd Compiler.CodeHeap_Analytics all 0 cause crash.
741 Aleksey Shipilev Red Hat JDK-8229974 Unsafe access C2 compile fails with assert(flat != TypePtr::BOTTOM) failed: cannot alias-analyze an untyped ptr: adr_type = NULL
741 Aleksey Shipilev Red Hat JDK-8229973 Keep track of memory accesses originated from Unsafe
741 Dmitrij Pochepko BellSoft JDK-8230195 AArch64: String.indexOf generates incorrect result
741 Zhengyu Gu Red Hat JDK-8230194 assert(!JavaThread::current()->in_critical()) failed: Would deadlock
741 Aleksey Shipilev Red Hat JDK-8230198 Track membars for volatile accesses so they can be properly optimized
741 Aleksey Shipilev Red Hat JDK-8230197 MemBarNode::trailing_membar() and MemBarNode::leading_membar() need to handle dying subgraphs better
741 Aleksey Shipilev Red Hat JDK-8230196 "bad trailing membar" assert failure at memnode.cpp:3220
742 Aleksey Shipilev Red Hat JDK-8229943 C2: Unexpected dead nodes after matching
742 Aleksey Shipilev Red Hat JDK-8229942 ZGC: Fix incorrect statistics
742 Aleksey Shipilev Red Hat JDK-8229941 jhsdb jmap fails to write binary heap dump of a jshell process
742 Severin Gehwolf Red Hat JDK-8229929 [TESTBUG] move hotspot container tests to hotspot/containers
742 Severin Gehwolf Red Hat JDK-8229928 Add notes for docker tests in the test doc
742 Severin Gehwolf Red Hat JDK-8229927 [TESTBUG] Create test for JFR events in Docker container: CPU, Memory and Process Info
742 Severin Gehwolf Red Hat JDK-8229913 [TESTBUG] TestCPUSets should check that cpuset does not exceed available cores
742 Martin Doerr SAP JDK-8229911 [aix] NMT does not show "Safepoint" memory type
742 Martin Doerr SAP JDK-8229910 [PPC64] SA reads wrong slots from interpreter frames
742 Roland Westrelin Red Hat JDK-8229908 Incorrect exception message generation
743 Aleksey Shipilev Red Hat JDK-8229886 AArch64: Purge method call format support
743 Roland Westrelin Red Hat JDK-8229885 C2 still crashes with "assert(mode == ControlAroundStripMined && use == sfpt) failed: missed a node"
743 Roland Westrelin Red Hat JDK-8229884 C1 dumps incorrect class name in ClassCastException message
743 Roland Westrelin Red Hat JDK-8229883 Enable argument profiling for sun.misc.Unsafe.put*/get*
743 Zhengyu Gu Red Hat JDK-8229882 NMT: Move synchronization primitives from mtInternal to mtSynchronizer
743 Roland Westrelin Red Hat JDK-8229881 assert(false) failed: infinite loop in PhaseIterGVN::optimize
743 Roland Westrelin Red Hat JDK-8229880 GraphKit::make_runtime_call() sometimes attaches wrong memory state to call
743 Zhengyu Gu Red Hat JDK-8229879 [Yaru] GTK L&F: There is no difference between menu selected and de-selected
743 Aleksey Shipilev Red Hat JDK-8229878 AArch64: Fix interpreter code at JVMCI deoptimization entry
746 Aleksey Shipilev Red Hat JDK-8229830 Path rendered incorrectly when it goes outside the clipping region
746 Mario Torre Red Hat JDK-8229826 JFR.dump does not work when filename is set
747 Zhengyu Gu Red Hat JDK-8229777 Allow "file:" URLs in Class-Path of local JARs
748 Andrew Dinn Red Hat JDK-8229719 AArch64: vector shift failed with MaxVectorSize=8
748 Aleksey Shipilev Red Hat JDK-8229698 ZipFile reads wrong entry size from ZIP64 entries
750 Goetz Lindenmaier SAP JDK-8229415 Host Locale Provider getDisplayCountry returns error message under non-English Win10
750 Matthias Baesken SAP JDK-8229409 build.log output from failing commands : include the hs_error file path in case of crashes in build
750 Matthias Baesken SAP JDK-8229405 java_props_macosx.c - provide missing CFRelease for CFLocaleCopyCurrent
750 Matthias Baesken SAP JDK-8229404 fix CFData object leak in macosx KeystoreImpl.m
750 Aleksey Shipilev Red Hat JDK-8229403 Make better use of LCPUs when building on AIX
750 Aleksey Shipilev Red Hat JDK-8229402 Remove built-in AArch64 simulator
750 Matthias Baesken SAP JDK-8229400 New library dependencies due to JDK-8222720
753 Christoph Langer SAP JDK-8229365 [testbug][ppc] Test SafepointPollingPages fails after 8208499 with UseSIGTRAP on.
753 Aleksey Shipilev Red Hat JDK-8229356 8213232 causes crashes on solaris sparc64
754 Jiangli Zhou Google JDK-8229329 Archive the set of ModuleDescriptor and ModuleReference objects for observable system modules with unnamed initial module
754 Severin Gehwolf Red Hat JDK-8229325 [TESTBUG] Docker tests produce excessive output
754 Severin Gehwolf Red Hat JDK-8229324 [TESTBUG] more configurable parameters for docker testing
754 Andrew Dinn Red Hat JDK-8229322 AARCH64: StubCodeMark should be placed after alignment
754 Christoph Langer SAP JDK-8229308 jdk/internal/platform/cgroup/TestCgroupMetrics.java - NumberFormatException because of large long values (memory limit_in_bytes)
754 Zhengyu Gu Red Hat JDK-8229307 NMT: Missing memory tag for Safepoint polling page
754 Zhengyu Gu Red Hat JDK-8229306 NMT: Change ThreadSafepointState's allocation type from mtInternal to mtThread
754 Zhengyu Gu Red Hat JDK-8229305 Assert in VirtualMemoryTracker::remove_released_region when running the SharedArchiveConsistency.java test with -XX:NativeMemoryTracking=detail
754 Zhengyu Gu Red Hat JDK-8229304 Upgrade libpng to 1.6.37
754 Severin Gehwolf Red Hat JDK-8229303 [TESTBUG] TestCgroupMetrics.java fails after fix for JDK-8219562
754 Severin Gehwolf Red Hat JDK-8229302 Line of code in osContainer_linux.cpp#L102 appears unreachable
754 Severin Gehwolf Red Hat JDK-8229301 [TESTBUG] DockerBasicTest.java contains hard-coded reference to JDK 10
754 Severin Gehwolf Red Hat JDK-8229300 Wrong cgroup subsystem being used for some CPU Container Metrics
754 Severin Gehwolf Red Hat JDK-8229299 [TESTBUG] Docker tests use old/deprecated image on AArch64
754 Severin Gehwolf Red Hat JDK-8229298 [TESTBUG] Generate Dockerfile for docker testing
754 Severin Gehwolf Red Hat JDK-8229297 [TESTBUG] Update base image for Docker testing to OL 7.6
754 Severin Gehwolf Red Hat JDK-8229296 [TESTBUG] MetricsMemoryTester failcount test in docker container only works with debug JVMs
754 Severin Gehwolf Red Hat JDK-8229295 Container Support doesn't work for some Join Controllers combinations
754 Severin Gehwolf Red Hat JDK-8229294 [Containers] SubSystem.java out of sync with osContainer_linux.cpp
754 Zhengyu Gu Red Hat JDK-8229293 GTK L&F: JSplitPane: There is no divider shown
754 Zhengyu Gu Red Hat JDK-8229292 java/awt/Color/AlphaColorTest.java fails in linux-x64 system
754 Zhengyu Gu Red Hat JDK-8229291 Colors with alpha are painted incorrectly on Linux, after JDK-8214579
754 Zhengyu Gu Red Hat JDK-8229290 JVM crash in klassItable::initialize_itable_for_interface(int, InstanceKlass*, bool, Thread*)
754 Zhengyu Gu Red Hat JDK-8229289 Better handling of classes in error state by fast class initialization checks
754 Christoph Langer SAP JDK-8229287 compiler/tiered/ConstantGettersTransitionsTest.java fails to compile
754 Christoph Langer SAP JDK-8229286 Fix for JDK-8208655 causes test failures in CI tier1
754 Christoph Langer SAP JDK-8229285 use JTreg skipped status in hotspot tests
754 Goetz Lindenmaier SAP JDK-8229282 Windows 32bit build build errors/warnings in hotspot
754 Goetz Lindenmaier SAP JDK-8229281 AArch64 build failures after JDK-8221408 (Windows 32bit build build errors/warnings in hotspot)
754 Christoph Langer SAP JDK-8229276 Partial backport of JDK-8218266
754 Christoph Langer SAP JDK-8229274 UnknownBodyLength sometimes fails due to "Connection reset by peer"
754 Christoph Langer SAP JDK-8229273 java/net/httpclient/UnknownBodyLengthTest.java failed
754 Christoph Langer SAP JDK-8229272 Jcmd fails to attach to the Java process on Linux using the main class name if whitespace options were used to launch the process
754 Christoph Langer SAP JDK-8229271 jcmd process name matching broken
754 Christoph Langer SAP JDK-8229269 serviceability/dcmd/framework/HelpTest.java timed out
755 Aleksey Shipilev Red Hat JDK-8229257 Incorrect LP64 guard in x86.ad after JDK-8210764 (Update avx512 implementation)
755 Aleksey Shipilev Red Hat JDK-8229256 Class redefinition fails when condy instructions are removed
755 Aleksey Shipilev Red Hat JDK-8229255 Padding ParallelTaskTerminator::_offered_termination variable
755 Roman Kennke Red Hat JDK-8229251 Out-of-bounds access to CPU _family_id_xxx array
755 Roman Kennke Red Hat JDK-8229249 Class redefinition fails with assert(!is_unloaded()) failed: unloaded method on the stack
755 Roman Kennke Red Hat JDK-8229248 Allocation of compile task fails with assert: "Leaking compilation tasks?"
755 Roman Kennke Red Hat JDK-8229247 C2 crash in loopTransform.cpp with assert(cl->trip_count() > 0) failed: peeling a fully unrolled loop
755 Roman Kennke Red Hat JDK-8229233 Fix replicateB encoding
756 Andrew Dinn Red Hat JDK-8229172 AArch64: Stack size in tools/launcher/Settings.java needs to be adjusted
757 Aleksey Shipilev Red Hat JDK-8229144 Revert JDK-8145579 after JDK-8076988 is resolved
757 Aleksey Shipilev Red Hat JDK-8229142 reevaluate trivial method policy
757 Aleksey Shipilev Red Hat JDK-8229141 Rename SimpleThresholdPolicy to TieredThresholdPolicy
760 Martin Doerr SAP JDK-8229026 s390: c1/c2 fail to add a metadata relocation in the static call stub.
761 Severin Gehwolf Red Hat JDK-8228987 SAXParser.parse(File, ..) does not close resources when Exception occurs.
761 Severin Gehwolf Red Hat JDK-8228986 ZipFile/MultiThreadedReadTest.java timed out in tier1
761 Severin Gehwolf Red Hat JDK-8228985 ATTRIBUTE_ALIGNED requires GNU extensions enabled
761 Severin Gehwolf Red Hat JDK-8228984 Inconsistent info between pcsclite.md and MUSCLE headers
761 Severin Gehwolf Red Hat JDK-8228983 Update MUSCLE PCSC-Lite header files
761 Goetz Lindenmaier SAP JDK-8226636 Enhance the security libraries to record events of interest
761 Gustavo Romero Independent JDK-8228972 [PPC64] Fix SLP patterns for filling an array with double float literals
762 Christoph Langer SAP JDK-8228968 runtime/memory/RunUnitTestsConcurrently.java has a memory leak
762 Christoph Langer SAP JDK-8228895 [aix] loadquery failed error reported
762 Christoph Langer SAP JDK-8228893 tools/sjavac/IdleShutdown.java fails with AssertionError: Error too big on windows
762 Christoph Langer SAP JDK-8228892 compiler/codegen/aes/TestCipherBlockChainingEncrypt.java timeout on Solaris-sparc
762 Christoph Langer SAP JDK-8228891 [TESTBUG] TestCheckedEnsureLocalCapacity.java fails intermittently
762 Christoph Langer SAP JDK-8227274 (props) Properties.loadFromXML does not fully comply with the spec
762 Christoph Langer SAP JDK-8228890 Refactor java.util.ResourceBundle:i18n shell tests to plain java tests
762 Christoph Langer SAP JDK-8228889 nsk/jdi/EventRequestManager/createStepRequest/crstepreq001/TestDescription.java is timing out
762 Aleksey Shipilev Red Hat JDK-8228887 JNI IsSameObject should not keep objects alive
762 Aleksey Shipilev Red Hat JDK-8228886 Optimize Collections.nCopies().hashCode() and equals()
762 Aleksey Shipilev Red Hat JDK-8228882 RuntimeStub's name lost with PrintFrameConverterAssembly
762 Aleksey Shipilev Red Hat JDK-8228881 Rename acquire_tag_map() to tag_map_acquire() in jvmtiEnvBase
762 Aleksey Shipilev Red Hat JDK-8228880 Data race on JvmtiEnvBase::_tag_map in double-checked locking
762 Aleksey Shipilev Red Hat JDK-8228879 (aio) Closed AsynchronousSocketChannel keeps completion handler alive
762 Aleksey Shipilev Red Hat JDK-8228878 SEGV while collecting Klass statistics
762 Aleksey Shipilev Red Hat JDK-8228877 Change mirror accessor in Klass::verify_on() to use AS_NO_KEEPALIVE
762 Aleksey Shipilev Red Hat JDK-8228876 ZGC: Enable load barriers for IN_NATIVE runtime barriers
762 Aleksey Shipilev Red Hat JDK-8228875 HeapInspection::find_instances_at_safepoint walks dead objects
762 Aleksey Shipilev Red Hat JDK-8228874 Heap dumping and inspection fails with JDK-8214712
762 Aleksey Shipilev Red Hat JDK-8228873 Starting a JFR recording in response to JVMTI VMInit and / or Java agent premain corrupts memory
762 Aleksey Shipilev Red Hat JDK-8228872 normal interpreter table is not restored after single stepping with TLH
762 Aleksey Shipilev Red Hat JDK-8228871 JVM crashes when bootstrap method for condy triggers loading of class whose static initializer throws exception
762 Aleksey Shipilev Red Hat JDK-8228870 Reduce GC pressure during message digest calculations in password-based encryption
762 Aleksey Shipilev Red Hat JDK-8228869 Javadoc does not support module-info in a multi-release jar
762 Aleksey Shipilev Red Hat JDK-8228868 Intrinsics that assume some input non null should use GraphKit::must_be_not_null()
763 Zhengyu Gu Red Hat JDK-8228851 NMT: missing memory tag for assert poison page
763 Zhengyu Gu Red Hat JDK-8228849 NMT stack traces in output should show mt component for virtual memory allocations
769 Aleksey Shipilev Red Hat JDK-8228595 Unsupported ciphersuites may be offered by a TLS client
769 Aleksey Shipilev Red Hat JDK-8228586 ThreadPoolExecutor: Thread.isAlive() is not equivalent to not being startable
771 Christoph Langer SAP JDK-8228476 sun/security/tools/keytool/PSS.java timed out
771 Christoph Langer SAP JDK-8228475 (tz) Upgrade time-zone data to tzdata2018i
771 Christoph Langer SAP JDK-8228474 tzdata2018i integration causes test failures on jdk-13
771 Christoph Langer SAP JDK-8228473 (tz) Upgrade time-zone data to tzdata2019a
771 Christoph Langer SAP JDK-8228472 sun/security/tools/keytool/PSS.java times out on Solaris-SPARC
771 Christoph Langer SAP JDK-8228471 Upgrade IANA Language Subtag Registry to Version 2019-04-03
771 Christoph Langer SAP JDK-8228470 TLS with BC and RSASSA-PSS breaks ECDHServerKeyExchange
773 Christoph Langer SAP JDK-8228455 keytool cannot generate RSASSA-PSS certificates
774 Christoph Langer SAP JDK-8228427 Better messaging for PKIX path validation matching
778 Aleksey Shipilev Red Hat JDK-8227670 C1 atomic access handlers use incorrect decorators
778 Aleksey Shipilev Red Hat JDK-8227669 assert(_handle_mark_nesting > 1) failed: memory leak: allocating handle outside HandleMark
778 Aleksey Shipilev Red Hat JDK-8227668 Fix usage of ARRAYCOPY_DISJOINT decorator
782 Martin Doerr SAP JDK-8227592 [s390] Unexpected exit from stack overflow test
783 Martin Doerr SAP JDK-8227511 ~ThreadInVMForHandshake() should call handle_special_runtime_exit_condition()
783 Christoph Langer SAP JDK-8227504 Inconsistencies of generated timezone files between Windows and Linux
783 Christoph Langer SAP JDK-8227503 ZoneStrings are not populated for all the Locales
783 Christoph Langer SAP JDK-8227502 Wrong text position for whitespaced string in printing Swing text
783 Christoph Langer SAP JDK-8227501 (se) test SelectWithConsumer.testReadableAndWriteable(): failure
790 Aleksey Shipilev Red Hat JDK-8227148 jdk/jfr/event/os/TestCPUInformation.java fails on AArch64
790 Aleksey Shipilev Red Hat JDK-8227147 C2: range check elimination may allow illegal out of bound access
790 Aleksey Shipilev Red Hat JDK-8227146 Transformer.reset() resets the state only once
790 Aleksey Shipilev Red Hat JDK-8227145 C2: Disallow definition split on MachCopySpill nodes
790 Aleksey Shipilev Red Hat JDK-8227144 ciMethodData::load_data() unpacks MDOs with non-atomic copy
790 Aleksey Shipilev Red Hat JDK-8227143 ciMethodData::load_extra_data() does not always unpack the last entry
790 Aleksey Shipilev Red Hat JDK-8227142 When using -Xcheck:jni an internally allocated buffer can leak
790 Aleksey Shipilev Red Hat JDK-8227141 Matcher can cause oop field/array element to be reloaded
790 Aleksey Shipilev Red Hat JDK-8227140 C2: Continuous deoptimization w/ Reason_speculate_class_check and Action_none
790 Aleksey Shipilev Red Hat JDK-8227139 C1's CEE optimization produces safepoint poll with invalid debug information
791 Christoph Langer SAP JDK-8227098 Upgrade to Freetype 2.10.0
791 Christoph Langer SAP JDK-8227097 Custom URLStreamHandler for jrt or file protocol can override default handler.
791 Christoph Langer SAP JDK-8227096 SSLSocket stream close() does not close the associated socket
791 Christoph Langer SAP JDK-8227095 Java API documentation formatting error in System.getEnv()
791 Christoph Langer SAP JDK-8227094 C4819 warning at libfreetype sources on Windows
791 Christoph Langer SAP JDK-8227093 Off heap memory accesses should be vectorized
791 Christoph Langer SAP JDK-8227092 JFrame does not paint content in XVFB / X11vnc environment
791 Christoph Langer SAP JDK-8227091 SpecJbb2005StressModule got uncaught exception
791 Christoph Langer SAP JDK-8227088 sun.security.util.SignatureUtil passes null parameter, so JCE validation fails
791 Christoph Langer SAP JDK-8227087 adoptNode corrupts attribute values
791 Martin Doerr SAP JDK-8227082 [PPC64, s390] Support AsyncGetCallTrace
791 Goetz Lindenmaier SAP JDK-8227075 Assertion in sun/util/locale/provider/CalendarDataUtility on Windows after JDK-8218960
791 Goetz Lindenmaier SAP JDK-8227074 Backport of JDK-8208698 (Improved ECC Implementation) should not bring parts of JDK-8205476 (KeyAgreement#generateSecret is not reset for ECDH based algorithm)
795 Christoph Langer SAP JDK-8226927 Update src/java.base/share/legal/public_suffix.md
795 Christoph Langer SAP JDK-8226926 NullPointerException in RasterPrinterJob without PrinterResolution
795 Christoph Langer SAP JDK-8226637 Use SunJCE Mac in SecretKeyFactory PBKDF2 implementation
796 Thomas Stuefe SAP JDK-8226894 outputStream should not be copyable
796 Thomas Stuefe SAP JDK-8226890 jcmd VM.metaspace shall print limits in basic mode
796 Matthias Baesken SAP JDK-8226875 os::snprintf should be used in virtualizationSupport.cpp
796 Matthias Baesken SAP JDK-8226873 Provide extended VMWare/vSphere virtualization related info in the hs_error file on linux/windows x86_64
796 Goetz Lindenmaier SAP JDK-8226866 events logging in deoptimization.cpp should go to deopt-log
796 Goetz Lindenmaier SAP JDK-8226865 replace open by os::open in hotspot coding
796 Goetz Lindenmaier SAP JDK-8226864 G1 GC: Undefined behaviour in G1BlockOffsetTablePart::block_at_or_preceding
799 Christoph Langer SAP JDK-8226702 [testbug] Missing JNIEXPORT in XAbortProvoker native function
799 Christoph Langer SAP JDK-8226701 jtreg: Decouple Unsafe from RTM tests
799 Christoph Langer SAP JDK-8226685 Additional trace when native thread creation fails
799 Christoph Langer SAP JDK-8226684 Add information about swap space to print_memory_info() on MacOS
799 Christoph Langer SAP JDK-8226680 Backout accidental change to String::length
799 Christoph Langer SAP JDK-8226679 Use String.isEmpty() when applicable in java.base
799 Aleksey Shipilev Red Hat JDK-8226675 [TESTBUG] TestUseOptoBiasInliningWithoutEliminateLocks needs to unlock WhiteBoxAPI
799 Aleksey Shipilev Red Hat JDK-8226674 C2 UseOptoBiasInlining: load of markword optimized to 0 if running with -XX:-EliminateLocks
799 Aleksey Shipilev Red Hat JDK-8226673 Mismatched unsafe access to non escaping object fails
799 Aleksey Shipilev Red Hat JDK-8226671 C2 compiler triggers SIGSEGV after transformation in ConvI2LNode::Ideal
799 Aleksey Shipilev Red Hat JDK-8226670 C2: Missing symbolic info on a call from intrinsics when invoked through MethodHandle
799 Aleksey Shipilev Red Hat JDK-8226669 Failures when vmIntrinsics::_getClass is not inlined
799 Aleksey Shipilev Red Hat JDK-8226668 Local variable arg defined but never used in BCEscapeAnalyzer::compute_escape_for_intrinsic()
799 Aleksey Shipilev Red Hat JDK-8226667 CopyOnWriteArrayList.set should always have volatile write semantics
799 Aleksey Shipilev Red Hat JDK-8226665 AArch64: Add StoreStore membar explicitly for Volatile Writes in TemplateTable
799 Aleksey Shipilev Red Hat JDK-8226664 aarch64: missing LoadStore barrier in TemplateTable::fast_storefield
799 Aleksey Shipilev Red Hat JDK-8226663 aarch64: missing LoadStore barrier in TemplateTable::putfield_or_static
799 Aleksey Shipilev Red Hat JDK-8226662 Currency decimal marker incorrect for Peru
799 Aleksey Shipilev Red Hat JDK-8226661 FieldReflectorKey hash code computation can be improved
799 Aleksey Shipilev Red Hat JDK-8226660 Fix typo in lib-x11 autoconf error message about missing headers
801 Paul Hohensee Amazon JDK-8226632 testlibrary_tests/ctw/ClassesListTest.java fails with Agent timeout frequently
801 Thomas Stuefe SAP JDK-8226631 [TESTBUG] runtime/ErrorHandling/ErrorHandler.java fails intermittently for case 13 on Windows
801 Thomas Stuefe SAP JDK-8226630 On child process spawn, child may write to random file descriptor instead of the fail pipe
801 Thomas Stuefe SAP JDK-8226629 [Solaris] os::signal() should call sigaction() with SA_SIGINFO
802 Jiangli Zhou Google JDK-8226610 vmTestbase/nsk/jvmti/scenarios/allocation/AP11/ap11t001/TestDescription.java failed with JVMTI_ERROR_INVALID_CLASS in CDS mode
802 Christoph Langer SAP JDK-8226576 TestOptionsWithRanges.java of '-XX:TLABWasteTargetPercent=100' fails intermittently
802 Christoph Langer SAP JDK-8226574 [TEST_BUG] Two java2d tests are unstable in mach5
802 Christoph Langer SAP JDK-8226573 [TEST_BUG] DashOffset fails in mach5
802 Christoph Langer SAP JDK-8226572 compiler/jsr292/RedefineMethodUsedByMultipleMethodHandles.java fails trying to delete temp file
802 Christoph Langer SAP JDK-8226571 Java Access Bridge logging and debug flags dynamically controlled
802 Christoph Langer SAP JDK-8226570 [TESTBUG] some jfr test don't check @requires vm.hasJFR
802 Yasumasa Suenaga NTT DATA JDK-8226568 SA can't handle prelinked libraries
804 Christoph Langer SAP JDK-8226386 java/time/test/java/time/format/TestNonIsoFormatter.java failed in non-english locales.
804 Goetz Lindenmaier SAP JDK-8226380 Add Jib support for VERSION_EXTRA*
804 Goetz Lindenmaier SAP JDK-8226379 aarch64: rflags is not correct after safepoint poll
805 Matthias Baesken SAP JDK-8226296 Improve assertion texts and exception messages in eventHandlerVMInit
806 Matthias Baesken SAP JDK-8226218 add more thread-related system settings info to hs_error file on AIX
806 Matthias Baesken SAP JDK-8226217 Provide virtualization related info in the hs_error file on AIX
810 Christoph Langer SAP JDK-8225753 java/net/DatagramSocket/ReuseAddressTest.java failed with java.net.BindException: Address already in use: Cannot bind
810 Aleksey Shipilev Red Hat JDK-8225742 C2 crash in IfNode::up_one_dom(Node*, bool)
810 Christoph Langer SAP JDK-8225738 Support extended-length paths in parse_manifest.c on Windows
810 Christoph Langer SAP JDK-8225737 aix: fix build after JDK-8210919
810 Christoph Langer SAP JDK-8225736 Remove statically linked libjli on Windows
810 Christoph Langer SAP JDK-8225735 Clean up macosx static library handling
810 Christoph Langer SAP JDK-8225734 java.lang.IllegalAccessError: class jdk.internal.event.X509CertificateEvent (in module java.base) cannot access class jdk.jfr.internal.handlers.EventHandler (in module jdk.jfr) because module java.base does not read module jdk.jfr
810 Christoph Langer SAP JDK-8225733 CDS and JFR tests fail with assert(JdkJfrEvent::is(klass)) failed: invariant
810 Christoph Langer SAP JDK-8225732 Produce events in the JDK without a dependency on jdk.jfr
810 Christoph Langer SAP JDK-8225728 Make comparison overflow-aware in ECDHKeyAgreement.engineGenerateSecret()
810 Paul Hohensee Amazon JDK-8225722 pathological case of JIT recompilation and code cache bloat
810 Vladimir Kempik Azul JDK-8225714 TLSv1.3 may generate TLSInnerPlainText longer than 2^14+1 bytes
810 Martin Doerr SAP JDK-8225704 Tests fail due to code cache exhaustion on machines with many cores
810 Goetz Lindenmaier SAP JDK-8225697 Improved ECC Implementation
810 Matthias Baesken SAP JDK-8225696 Provide basic virtualization related info in the hs_error file on linux/windows x86_64
817 Goetz Lindenmaier SAP JDK-8225417 Deadlock in JFR string pool
817 Goetz Lindenmaier SAP JDK-8225416 Unsafe write after primitive array creation may result in array length change
817 Goetz Lindenmaier SAP JDK-8225415 Add libXrandr-devel to the Linux devkits
817 Goetz Lindenmaier SAP JDK-8225414 To remove lib/security from test/jdk/TEST.groups
817 Goetz Lindenmaier SAP JDK-8225413 Problem list test security/infra/java/security/cert/CertPathValidator/certification/ActalisCA.java
817 Goetz Lindenmaier SAP JDK-8225412 Test ComodoCA.java fails
817 Goetz Lindenmaier SAP JDK-8225411 AArch64: java/javac error with AllocatePrefetchDistance
817 Goetz Lindenmaier SAP JDK-8225410 AArch64: mauve System.arraycopy test failure
819 Christoph Langer SAP JDK-8225246 Digest is incorrectly truncated for ECDSA signatures when the bit length of n is less than the field size
819 Christoph Langer SAP JDK-8225243 Hang seen when using com.sun.jndi.ldap.search.replyQueueSize
819 Christoph Langer SAP JDK-8225242 [Linux] jsig is limited to a maximum of 64 signals
823 Yasumasa Suenaga NTT DATA JDK-8225112 [TESTBUG] hotspot/test/serviceability/sa/sadebugd/SADebugDTest.java is timing out again after fix for JDK-8163805
823 Christoph Langer SAP JDK-8225108 Fix code constructs that do not compile with the Eclipse Java Compiler
823 Aleksey Shipilev Red Hat JDK-8225107 jspawnhelper: need to handle pipe write failure when sending return code
824 Christoph Langer SAP JDK-8225090 ConcurrentSkipListMap.java does not compile with the Eclipse Java Compiler
824 Goetz Lindenmaier SAP JDK-8224838 Bump update version for OpenJDK: jdk-11.0.5
825 Paul Hohensee Amazon JDK-8224765 Update the default SSL session cache size to 20480

No changesets log

Committer push log

Andrew Dinn, Red Hat

Bug Summary
JDK-8230124 AArch64: C2 recursive stack locking optimisation not triggered
JDK-8230205 AArch64: Compiled CI stubs are unsafely modified
JDK-8230039 AArch64: NPE in clhsdb jstack command
JDK-8230123 AArch64: Prepare for backport of JDK-8217368
JDK-8230239 Aarch64: ReservedStackAccess may leave stack guard in inconsistent state
JDK-8229172 AArch64: Stack size in tools/launcher/Settings.java needs to be adjusted
JDK-8229322 AARCH64: StubCodeMark should be placed after alignment
JDK-8229719 AArch64: vector shift failed with MaxVectorSize=8
JDK-8230204 CardTableBarrierSetAssembler::gen_write_ref_array_post_barrier() does not check for zero length on AARCH64

Andrew Hughes, Red Hat

Bug Summary
JDK-8232304 Change the environment variable for Java Access Bridge logging to have a directory

Christoph Langer, SAP

Bug Summary
JDK-8231407 (fs) FileStore::isReadOnly is always true on macOS Catalina
JDK-8230535 (fs) More than one instance of built-in FileSystem observed in heap
JDK-8227274 (props) Properties.loadFromXML does not fully comply with the spec
JDK-8227501 (se) test SelectWithConsumer.testReadableAndWriteable(): failure
JDK-8228475 (tz) Upgrade time-zone data to tzdata2018i
JDK-8228473 (tz) Upgrade time-zone data to tzdata2019a
JDK-8231299 (tz) Upgrade time-zone data to tzdata2019b
JDK-8230757 (zipfs) zip file corruption when replacing an existing STORED entry
JDK-8228895 [aix] loadquery failed error reported
JDK-8225242 [Linux] jsig is limited to a maximum of 64 signals
JDK-8226573 [TEST_BUG] DashOffset fails in mach5
JDK-8226574 [TEST_BUG] Two java2d tests are unstable in mach5
JDK-8226702 [testbug] Missing JNIEXPORT in XAbortProvoker native function
JDK-8226570 [TESTBUG] some jfr test don't check @requires vm.hasJFR
JDK-8228891 [TESTBUG] TestCheckedEnsureLocalCapacity.java fails intermittently
JDK-8229365 [testbug][ppc] Test SafepointPollingPages fails after 8208499 with UseSIGTRAP on.
JDK-8226684 Add information about swap space to print_memory_info() on MacOS
JDK-8230151 add memprotect calls to event log
JDK-8226685 Additional trace when native thread creation fails
JDK-8230148 adjust format specifiers in loadlib_aix.cpp
JDK-8227087 adoptNode corrupts attribute values
JDK-8225737 aix: fix build after JDK-8210919
JDK-8226680 Backout accidental change to String::length
JDK-8228427 Better messaging for PKIX path validation matching
JDK-8227094 C4819 warning at libfreetype sources on Windows
JDK-8225733 CDS and JFR tests fail with assert(JdkJfrEvent::is(klass)) failed: invariant
JDK-8225735 Clean up macosx static library handling
JDK-8228892 compiler/codegen/aes/TestCipherBlockChainingEncrypt.java timeout on Solaris-sparc
JDK-8226572 compiler/jsr292/RedefineMethodUsedByMultipleMethodHandles.java fails trying to delete temp file
JDK-8229287 compiler/tiered/ConstantGettersTransitionsTest.java fails to compile
JDK-8225090 ConcurrentSkipListMap.java does not compile with the Eclipse Java Compiler
JDK-8227097 Custom URLStreamHandler for jrt or file protocol can override default handler.
JDK-8225246 Digest is incorrectly truncated for ECDSA signatures when the bit length of n is less than the field size
JDK-8225108 Fix code constructs that do not compile with the Eclipse Java Compiler
JDK-8229286 Fix for JDK-8208655 causes test failures in CI tier1
JDK-8230147 fix wrong format specifiers in os_aix.cpp
JDK-8225243 Hang seen when using com.sun.jndi.ldap.search.replyQueueSize
JDK-8230432 Improve startup behavior of SecurityProperties
JDK-8227504 Inconsistencies of generated timezone files between Windows and Linux
JDK-8226571 Java Access Bridge logging and debug flags dynamically controlled
JDK-8227095 Java API documentation formatting error in System.getEnv()
JDK-8225734 java.lang.IllegalAccessError: class jdk.internal.event.X509CertificateEvent (in module java.base) cannot access class jdk.jfr.internal.handlers.EventHandler (in module jdk.jfr) because module java.base does not read module jdk.jfr
JDK-8225753 java/net/DatagramSocket/ReuseAddressTest.java failed with java.net.BindException: Address already in use: Cannot bind
JDK-8229273 java/net/httpclient/UnknownBodyLengthTest.java failed
JDK-8226386 java/time/test/java/time/format/TestNonIsoFormatter.java failed in non-english locales.
JDK-8229272 Jcmd fails to attach to the Java process on Linux using the main class name if whitespace options were used to launch the process
JDK-8229271 jcmd process name matching broken
JDK-8229308 jdk/internal/platform/cgroup/TestCgroupMetrics.java - NumberFormatException because of large long values (memory limit_in_bytes)
JDK-8227092 JFrame does not paint content in XVFB / X11vnc environment
JDK-8226701 jtreg: Decouple Unsafe from RTM tests
JDK-8228455 keytool cannot generate RSASSA-PSS certificates
JDK-8225728 Make comparison overflow-aware in ECDHKeyAgreement.engineGenerateSecret()
JDK-8230754 Many pkcs11 tests failed in Provider initialization, after compiler on Windows changed
JDK-8228889 nsk/jdi/EventRequestManager/createStepRequest/crstepreq001/TestDescription.java is timing out
JDK-8226926 NullPointerException in RasterPrinterJob without PrinterResolution
JDK-8227093 Off heap memory accesses should be vectorized
JDK-8229276 Partial backport of JDK-8218266
JDK-8231061 problemList failing/ignored manual tests in security-libs
JDK-8230138 Problemlist javax/net/ssl/ServerName/SSLEngineExplorerMatchedSNI.java
JDK-8230755 ProblemList sun/security/pkcs11/sslecc/ClientJSSEServerJSSE.java due to JDK-8161536
JDK-8225732 Produce events in the JDK without a dependency on jdk.jfr
JDK-8228890 Refactor java.util.ResourceBundle:i18n shell tests to plain java tests
JDK-8225736 Remove statically linked libjli on Windows
JDK-8231300 Resolve permissions for code source URLs lazily
JDK-8228968 runtime/memory/RunUnitTestsConcurrently.java has a memory leak
JDK-8229269 serviceability/dcmd/framework/HelpTest.java timed out
JDK-8227091 SpecJbb2005StressModule got uncaught exception
JDK-8227096 SSLSocket stream close() does not close the associated socket
JDK-8227088 sun.security.util.SignatureUtil passes null parameter, so JCE validation fails
JDK-8228476 sun/security/tools/keytool/PSS.java timed out
JDK-8228472 sun/security/tools/keytool/PSS.java times out on Solaris-SPARC
JDK-8225738 Support extended-length paths in parse_manifest.c on Windows
JDK-8230146 test GetTotalSafepointTime.java fails on fast Linux machines with Total safepoint time 0 ms
JDK-8231301 Test sun/tools/jcmd/TestProcessHelper.java fails intermittently
JDK-8226576 TestOptionsWithRanges.java of '-XX:TLABWasteTargetPercent=100' fails intermittently
JDK-8228470 TLS with BC and RSASSA-PSS breaks ECDHServerKeyExchange
JDK-8228893 tools/sjavac/IdleShutdown.java fails with AssertionError: Error too big on windows
JDK-8231298 TZ database in "vanguard" format support
JDK-8228474 tzdata2018i integration causes test failures on jdk-13
JDK-8229274 UnknownBodyLength sometimes fails due to "Connection reset by peer"
JDK-8230710 Update Apache Santuario (XML Signature) to version 2.1.3
JDK-8226927 Update src/java.base/share/legal/public_suffix.md
JDK-8231060 upgrade gtest to 1.8.1
JDK-8228471 Upgrade IANA Language Subtag Registry to Version 2019-04-03
JDK-8227098 Upgrade to Freetype 2.10.0
JDK-8229285 use JTreg skipped status in hotspot tests
JDK-8226679 Use String.isEmpty() when applicable in java.base
JDK-8226637 Use SunJCE Mac in SecretKeyFactory PBKDF2 implementation
JDK-8230537 Windows 32bit build error in libsunmscapi/security.cpp
JDK-8227502 Wrong text position for whitespaced string in printing Swing text
JDK-8227503 ZoneStrings are not populated for all the Locales

Dmitrij Pochepko, BellSoft

Bug Summary
JDK-8230149 AArch64: String.compareTo() can read memory after string
JDK-8230195 AArch64: String.indexOf generates incorrect result

Dmitriy Samersoff, Independent

Bug Summary
JDK-8230125 Use of an uninitialized register in 32-bit ARM template interpreter

Goetz Lindenmaier, SAP

Bug Summary
JDK-8229281 AArch64 build failures after JDK-8221408 (Windows 32bit build build errors/warnings in hotspot)
JDK-8225411 AArch64: java/javac error with AllocatePrefetchDistance
JDK-8225410 AArch64: mauve System.arraycopy test failure
JDK-8230099 AArch64: Prepare for backport of JDK-8217368
JDK-8226379 aarch64: rflags is not correct after safepoint poll
JDK-8226380 Add Jib support for VERSION_EXTRA*
JDK-8225415 Add libXrandr-devel to the Linux devkits
JDK-8227075 Assertion in sun/util/locale/provider/CalendarDataUtility on Windows after JDK-8218960
JDK-8227074 Backport of JDK-8208698 (Improved ECC Implementation) should not bring parts of JDK-8205476 (KeyAgreement#generateSecret is not reset for ECDH based algorithm)
JDK-8224838 Bump update version for OpenJDK: jdk-11.0.5
JDK-8225417 Deadlock in JFR string pool
JDK-8226636 Enhance the security libraries to record events of interest
JDK-8226866 events logging in deoptimization.cpp should go to deopt-log
JDK-8226864 G1 GC: Undefined behaviour in G1BlockOffsetTablePart::block_at_or_preceding
JDK-8229415 Host Locale Provider getDisplayCountry returns error message under non-English Win10
JDK-8225697 Improved ECC Implementation
JDK-8225413 Problem list test security/infra/java/security/cert/CertPathValidator/certification/ActalisCA.java
JDK-8226865 replace open by os::open in hotspot coding
JDK-8225412 Test ComodoCA.java fails
JDK-8225414 To remove lib/security from test/jdk/TEST.groups
JDK-8225416 Unsafe write after primitive array creation may result in array length change
JDK-8229282 Windows 32bit build build errors/warnings in hotspot

Gustavo Romero, Independent

Bug Summary
JDK-8228972 [PPC64] Fix SLP patterns for filling an array with double float literals

Jiangli Zhou, Google

Bug Summary
JDK-8229329 Archive the set of ModuleDescriptor and ModuleReference objects for observable system modules with unnamed initial module
JDK-8226610 vmTestbase/nsk/jvmti/scenarios/allocation/AP11/ap11t001/TestDescription.java failed with JVMTI_ERROR_INVALID_CLASS in CDS mode

Laurent Bourgès, Independent

Bug Summary
JDK-8231693 Backout "8230728: Thin stroked shapes are not rendered if affine transform has flip bit" from jdk11u

Matthias Baesken, SAP

Bug Summary
JDK-8226218 add more thread-related system settings info to hs_error file on AIX
JDK-8229409 build.log output from failing commands : include the hs_error file path in case of crashes in build
JDK-8229404 fix CFData object leak in macosx KeystoreImpl.m
JDK-8226296 Improve assertion texts and exception messages in eventHandlerVMInit
JDK-8229405 java_props_macosx.c - provide missing CFRelease for CFLocaleCopyCurrent
JDK-8229400 New library dependencies due to JDK-8222720
JDK-8226875 os::snprintf should be used in virtualizationSupport.cpp
JDK-8225696 Provide basic virtualization related info in the hs_error file on linux/windows x86_64
JDK-8226873 Provide extended VMWare/vSphere virtualization related info in the hs_error file on linux/windows x86_64
JDK-8226217 Provide virtualization related info in the hs_error file on AIX

Martin Doerr, SAP

Bug Summary
JDK-8229911 [aix] NMT does not show "Safepoint" memory type
JDK-8227082 [PPC64, s390] Support AsyncGetCallTrace
JDK-8229910 [PPC64] SA reads wrong slots from interpreter frames
JDK-8230154 [s390, PPC64] Exception check missing in interpreter
JDK-8227592 [s390] Unexpected exit from stack overflow test
JDK-8229026 s390: c1/c2 fail to add a metadata relocation in the static call stub.
JDK-8225704 Tests fail due to code cache exhaustion on machines with many cores
JDK-8227511 ~ThreadInVMForHandshake() should call handle_special_runtime_exit_condition()

Mario Torre, Red Hat

Bug Summary
JDK-8229826 JFR.dump does not work when filename is set

Paul Hohensee, Amazon

Bug Summary
JDK-8225722 pathological case of JIT recompilation and code cache bloat
JDK-8226632 testlibrary_tests/ctw/ClassesListTest.java fails with Agent timeout frequently
JDK-8224765 Update the default SSL session cache size to 20480

Roman Kennke, Red Hat

Bug Summary
JDK-8229248 Allocation of compile task fails with assert: "Leaking compilation tasks?"
JDK-8229247 C2 crash in loopTransform.cpp with assert(cl->trip_count() > 0) failed: peeling a fully unrolled loop
JDK-8229249 Class redefinition fails with assert(!is_unloaded()) failed: unloaded method on the stack
JDK-8229233 Fix replicateB encoding
JDK-8229251 Out-of-bounds access to CPU _family_id_xxx array

Roland Westrelin, Red Hat

Bug Summary
JDK-8229881 assert(false) failed: infinite loop in PhaseIterGVN::optimize
JDK-8229884 C1 dumps incorrect class name in ClassCastException message
JDK-8229885 C2 still crashes with "assert(mode == ControlAroundStripMined && use == sfpt) failed: missed a node"
JDK-8229883 Enable argument profiling for sun.misc.Unsafe.put*/get*
JDK-8229880 GraphKit::make_runtime_call() sometimes attaches wrong memory state to call
JDK-8229908 Incorrect exception message generation
JDK-8230038 Running jcmd Compiler.CodeHeap_Analytics all 0 cause crash.

Severin Gehwolf, Red Hat

Bug Summary
JDK-8229294 [Containers] SubSystem.java out of sync with osContainer_linux.cpp
JDK-8229927 [TESTBUG] Create test for JFR events in Docker container: CPU, Memory and Process Info
JDK-8229325 [TESTBUG] Docker tests produce excessive output
JDK-8229299 [TESTBUG] Docker tests use old/deprecated image on AArch64
JDK-8229301 [TESTBUG] DockerBasicTest.java contains hard-coded reference to JDK 10
JDK-8229298 [TESTBUG] Generate Dockerfile for docker testing
JDK-8229296 [TESTBUG] MetricsMemoryTester failcount test in docker container only works with debug JVMs
JDK-8229324 [TESTBUG] more configurable parameters for docker testing
JDK-8229929 [TESTBUG] move hotspot container tests to hotspot/containers
JDK-8229303 [TESTBUG] TestCgroupMetrics.java fails after fix for JDK-8219562
JDK-8229913 [TESTBUG] TestCPUSets should check that cpuset does not exceed available cores
JDK-8229297 [TESTBUG] Update base image for Docker testing to OL 7.6
JDK-8229928 Add notes for docker tests in the test doc
JDK-8230156 Adjust default concurrency settings for running tests on Sparc
JDK-8228985 ATTRIBUTE_ALIGNED requires GNU extensions enabled
JDK-8230177 Avoid some GCC 8.X strncpy() errors in HotSpot
JDK-8230174 ByteArrayPublisher is not thread-safe resulting in broken re-use of HttpRequests
JDK-8229295 Container Support doesn't work for some Join Controllers combinations
JDK-8230176 Fix errors in LittleCMS 2.9 reported by GCC 8
JDK-8230175 GCC 8.3 reports errors in java.base
JDK-8228984 Inconsistent info between pcsclite.md and MUSCLE headers
JDK-8230157 Limit default test jobs based on memory size
JDK-8229302 Line of code in osContainer_linux.cpp#L102 appears unreachable
JDK-8230163 LineNumberReader throws "Mark invalid" exception if CRLF straddles buffer.
JDK-8230173 Memory leaks in the AWT on macOS
JDK-8228987 SAXParser.parse(File, ..) does not close resources when Exception occurs.
JDK-8228983 Update MUSCLE PCSC-Lite header files
JDK-8230178 Windows build failure after JDK-8214777 (Avoid some GCC 8.X strncpy() errors in HotSpot)
JDK-8229300 Wrong cgroup subsystem being used for some CPU Container Metrics
JDK-8228986 ZipFile/MultiThreadedReadTest.java timed out in tier1

Aleksey Shipilev, Red Hat

Bug Summary
JDK-8230196 "bad trailing membar" assert failure at memnode.cpp:3220
JDK-8228879 (aio) Closed AsynchronousSocketChannel keeps completion handler alive
JDK-8229356 8213232 causes crashes on solaris sparc64
JDK-8230210 [TESTBUG] serviceability/sa/ClhsdbFindPC fails on AArch64
JDK-8226675 [TESTBUG] TestUseOptoBiasInliningWithoutEliminateLocks needs to unlock WhiteBoxAPI
JDK-8226665 AArch64: Add StoreStore membar explicitly for Volatile Writes in TemplateTable
JDK-8229878 AArch64: Fix interpreter code at JVMCI deoptimization entry
JDK-8226664 aarch64: missing LoadStore barrier in TemplateTable::fast_storefield
JDK-8226663 aarch64: missing LoadStore barrier in TemplateTable::putfield_or_static
JDK-8229886 AArch64: Purge method call format support
JDK-8230165 Allow Sasl mechanisms to be restricted
JDK-8227669 assert(_handle_mark_nesting > 1) failed: memory leak: allocating handle outside HandleMark
JDK-8227670 C1 atomic access handlers use incorrect decorators
JDK-8227139 C1's CEE optimization produces safepoint poll with invalid debug information
JDK-8226671 C2 compiler triggers SIGSEGV after transformation in ConvI2LNode::Ideal
JDK-8225742 C2 crash in IfNode::up_one_dom(Node*, bool)
JDK-8226674 C2 UseOptoBiasInlining: load of markword optimized to 0 if running with -XX:-EliminateLocks
JDK-8230171 C2-only debug build fails
JDK-8230139 C2: assert(n->outcnt() != 0 || C->top() == n || n->is_Proj()) failed: No dead instructions after post-alloc
JDK-8227140 C2: Continuous deoptimization w/ Reason_speculate_class_check and Action_none
JDK-8227145 C2: Disallow definition split on MachCopySpill nodes
JDK-8226670 C2: Missing symbolic info on a call from intrinsics when invoked through MethodHandle
JDK-8227147 C2: range check elimination may allow illegal out of bound access
JDK-8229943 C2: Unexpected dead nodes after matching
JDK-8228877 Change mirror accessor in Klass::verify_on() to use AS_NO_KEEPALIVE
JDK-8227144 ciMethodData::load_data() unpacks MDOs with non-atomic copy
JDK-8227143 ciMethodData::load_extra_data() does not always unpack the last entry
JDK-8229256 Class redefinition fails when condy instructions are removed
JDK-8226667 CopyOnWriteArrayList.set should always have volatile write semantics
JDK-8226662 Currency decimal marker incorrect for Peru
JDK-8228880 Data race on JvmtiEnvBase::_tag_map in double-checked locking
JDK-8230166 Enhance keystore load debug output
JDK-8226669 Failures when vmIntrinsics::_getClass is not inlined
JDK-8226661 FieldReflectorKey hash code computation can be improved
JDK-8226660 Fix typo in lib-x11 autoconf error message about missing headers
JDK-8227668 Fix usage of ARRAYCOPY_DISJOINT decorator
JDK-8228874 Heap dumping and inspection fails with JDK-8214712
JDK-8228875 HeapInspection::find_instances_at_safepoint walks dead objects
JDK-8229257 Incorrect LP64 guard in x86.ad after JDK-8210764 (Update avx512 implementation)
JDK-8228868 Intrinsics that assume some input non null should use GraphKit::must_be_not_null()
JDK-8230573 java.lang.UnsatisfiedLinkError: net.dll: Can't find dependent libraries
JDK-8228869 Javadoc does not support module-info in a multi-release jar
JDK-8230169 Javap ignores default modifier on interfaces
JDK-8227148 jdk/jfr/event/os/TestCPUInformation.java fails on AArch64
JDK-8229941 jhsdb jmap fails to write binary heap dump of a jshell process
JDK-8228887 JNI IsSameObject should not keep objects alive
JDK-8225107 jspawnhelper: need to handle pipe write failure when sending return code
JDK-8228871 JVM crashes when bootstrap method for condy triggers loading of class whose static initializer throws exception
JDK-8229973 Keep track of memory accesses originated from Unsafe
JDK-8226668 Local variable arg defined but never used in BCEscapeAnalyzer::compute_escape_for_intrinsic()
JDK-8229403 Make better use of LCPUs when building on AIX
JDK-8227141 Matcher can cause oop field/array element to be reloaded
JDK-8230197 MemBarNode::trailing_membar() and MemBarNode::leading_membar() need to handle dying subgraphs better
JDK-8226673 Mismatched unsafe access to non escaping object fails
JDK-8228872 normal interpreter table is not restored after single stepping with TLH
JDK-8228886 Optimize Collections.nCopies().hashCode() and equals()
JDK-8229255 Padding ParallelTaskTerminator::_offered_termination variable
JDK-8229830 Path rendered incorrectly when it goes outside the clipping region
JDK-8228870 Reduce GC pressure during message digest calculations in password-based encryption
JDK-8229142 reevaluate trivial method policy
JDK-8229402 Remove built-in AArch64 simulator
JDK-8228881 Rename acquire_tag_map() to tag_map_acquire() in jvmtiEnvBase
JDK-8229141 Rename SimpleThresholdPolicy to TieredThresholdPolicy
JDK-8229144 Revert JDK-8145579 after JDK-8076988 is resolved
JDK-8228882 RuntimeStub's name lost with PrintFrameConverterAssembly
JDK-8228878 SEGV while collecting Klass statistics
JDK-8230153 Speed up Properties.load
JDK-8228873 Starting a JFR recording in response to JVMTI VMInit and / or Java agent premain corrupts memory
JDK-8230170 test for JDK-8216261 fails in Windows
JDK-8230144 test/jdk/java/beans/PropertyEditor/Test6397609.java failing
JDK-8230145 test/jdk/java/rmi/transport/runtimeThreadInheritanceLeak/RuntimeThreadInheritanceLeak.java failing with Xcomp
JDK-8228586 ThreadPoolExecutor: Thread.isAlive() is not equivalent to not being startable
JDK-8230198 Track membars for volatile accesses so they can be properly optimized
JDK-8227146 Transformer.reset() resets the state only once
JDK-8230167 Typo in java.security: Sasl.createClient and Sasl.createServer
JDK-8229974 Unsafe access C2 compile fails with assert(flat != TypePtr::BOTTOM) failed: cannot alias-analyze an untyped ptr: adr_type = NULL
JDK-8228595 Unsupported ciphersuites may be offered by a TLS client
JDK-8227142 When using -Xcheck:jni an internally allocated buffer can leak
JDK-8230207 Xerces 2.12.0: DOM Implementation
JDK-8230209 Xerces 2.12.0: License file
JDK-8230206 Xerces 2.12.0: Parsing Configuration
JDK-8230208 Xerces 2.12.0: Validation
JDK-8228876 ZGC: Enable load barriers for IN_NATIVE runtime barriers
JDK-8229942 ZGC: Fix incorrect statistics
JDK-8229698 ZipFile reads wrong entry size from ZIP64 entries

Thomas Stuefe, SAP

Bug Summary
JDK-8226629 [Solaris] os::signal() should call sigaction() with SA_SIGINFO
JDK-8226631 [TESTBUG] runtime/ErrorHandling/ErrorHandler.java fails intermittently for case 13 on Windows
JDK-8226890 jcmd VM.metaspace shall print limits in basic mode
JDK-8226630 On child process spawn, child may write to random file descriptor instead of the fail pipe
JDK-8226894 outputStream should not be copyable

Vladimir Kempik, Azul

Bug Summary
JDK-8225714 TLSv1.3 may generate TLSInnerPlainText longer than 2^14+1 bytes

Yasumasa Suenaga, NTT DATA

Bug Summary
JDK-8225112 [TESTBUG] hotspot/test/serviceability/sa/sadebugd/SADebugDTest.java is timing out again after fix for JDK-8163805
JDK-8226568 SA can't handle prelinked libraries
JDK-8230143 SA: jhsdb common help needs to be more detailed
JDK-8230142 sadebugd/DebugdConnectTest.java fails due to "java.rmi.NotBoundException: SARemoteDebugger"

Zhengyu Gu, Red Hat

Bug Summary
JDK-8229879 [Yaru] GTK L&F: There is no difference between menu selected and de-selected
JDK-8229777 Allow "file:" URLs in Class-Path of local JARs
JDK-8229305 Assert in VirtualMemoryTracker::remove_released_region when running the SharedArchiveConsistency.java test with -XX:NativeMemoryTracking=detail
JDK-8230194 assert(!JavaThread::current()->in_critical()) failed: Would deadlock
JDK-8229289 Better handling of classes in error state by fast class initialization checks
JDK-8229291 Colors with alpha are painted incorrectly on Linux, after JDK-8214579
JDK-8229293 GTK L&F: JSplitPane: There is no divider shown
JDK-8229292 java/awt/Color/AlphaColorTest.java fails in linux-x64 system
JDK-8229290 JVM crash in klassItable::initialize_itable_for_interface(int, InstanceKlass*, bool, Thread*)
JDK-8228849 NMT stack traces in output should show mt component for virtual memory allocations
JDK-8229306 NMT: Change ThreadSafepointState's allocation type from mtInternal to mtThread
JDK-8228851 NMT: missing memory tag for assert poison page
JDK-8229307 NMT: Missing memory tag for Safepoint polling page
JDK-8229882 NMT: Move synchronization primitives from mtInternal to mtSynchronizer
JDK-8230164 Reduce minRefreshTime for updating remote printer list on Windows
JDK-8229304 Upgrade libpng to 1.6.37