PUSHES REPORT: 11.0.6

This report shows who pushed the backports to the given release. This usually shows who did the backporting, testing, and review work.

Report generated: Wed Sep 01 03:23:22 CEST 2021

Distribution by priority

Count Priority
4 P1
39 P2
125 P3
131 P4
2 P5

Distribution by components

Count Component
301 Total
148 (49.2%) hotspot
60 (19.9%) hotspot/compiler
39 (13.0%) hotspot/runtime
25 (8.3%) hotspot/jfr
13 (4.3%) hotspot/gc
5 (1.7%) hotspot/svc-agent
4 (1.3%) hotspot/svc
1 (0.3%) hotspot/jvmti
1 (0.3%) hotspot/test
48 (15.9%) core-libs
13 (4.3%) core-libs/java.nio
8 (2.7%) core-libs/java.net
4 (1.3%) core-libs
4 (1.3%) core-libs/java.util:i18n
3 (1.0%) core-libs/java.util
3 (1.0%) core-libs/java.time
2 (0.7%) core-libs/jdk.nashorn
2 (0.7%) core-libs/java.io
2 (0.7%) core-libs/java.lang
1 (0.3%) core-libs/java.util.logging
1 (0.3%) core-libs/java.lang.module
1 (0.3%) core-libs/java.util:collections
1 (0.3%) core-libs/java.lang:reflect
1 (0.3%) core-libs/java.text
1 (0.3%) core-libs/javax.naming
1 (0.3%) core-libs/java.util.jar
40 (13.3%) client-libs
19 (6.3%) client-libs/java.awt
14 (4.7%) client-libs/2d
3 (1.0%) client-libs
3 (1.0%) client-libs/javax.swing
1 (0.3%) client-libs/java.beans
40 (13.3%) security-libs
11 (3.7%) security-libs/javax.crypto:pkcs11
9 (3.0%) security-libs/java.security
8 (2.7%) security-libs/javax.net.ssl
4 (1.3%) security-libs/org.ietf.jgss:krb5
3 (1.0%) security-libs/javax.crypto
2 (0.7%) security-libs/org.ietf.jgss
2 (0.7%) security-libs
1 (0.3%) security-libs/javax.xml.crypto
12 (4.0%) infrastructure
11 (3.7%) infrastructure/build
1 (0.3%) infrastructure
8 (2.7%) core-svc
3 (1.0%) core-svc
2 (0.7%) core-svc/tools
2 (0.7%) core-svc/debugger
1 (0.3%) core-svc/java.lang.instrument
2 (0.7%) other-libs
1 (0.3%) other-libs
1 (0.3%) other-libs/other
2 (0.7%) xml
1 (0.3%) xml/jaxp
1 (0.3%) xml/javax.xml.parsers
1 (0.3%) tools
1 (0.3%) tools/javac

Distribution by affiliation

Count Committer
301 Total
166 (55.1%) SAP
94 (31.2%) Christoph Langer
48 (15.9%) Goetz Lindenmaier
12 (4.0%) Matthias Baesken
7 (2.3%) Martin Doerr
5 (1.7%) Thomas Stuefe
108 (35.9%) Red Hat
49 (16.3%) Aleksey Shipilev
22 (7.3%) Severin Gehwolf
10 (3.3%) Zhengyu Gu
9 (3.0%) Martin Balao
9 (3.0%) Roland Westrelin
5 (1.7%) Roman Kennke
3 (1.0%) Mario Torre
1 (0.3%) Andrew Hughes
7 (2.3%) Azul
5 (1.7%) Andrew Brygin
2 (0.7%) Vladimir Kempik
6 (2.0%) Google
6 (2.0%) Jiangli Zhou
5 (1.7%) Amazon
5 (1.7%) Paul Hohensee
3 (1.0%) DataDog
3 (1.0%) Jaroslav Bachorík
2 (0.7%) NTT DATA
2 (0.7%) Yasumasa Suenaga
2 (0.7%) Oracle
1 (0.3%) Stuart Marks
1 (0.3%) Ioi Lam
1 (0.3%) Huawei
1 (0.3%) Fei Yang
1 (0.3%) Independent
1 (0.3%) Laurent Bourgès

Chronological push log:

Days Ago Committer Affiliation Bug Summary
595 Andrew Hughes Red Hat JDK-8231741 Malformed copyright year range in a few files in java.base
621 Christoph Langer SAP JDK-8236253 Contents/MacOS/libjli.dylib cannot be a symlink
621 Christoph Langer SAP JDK-8236252 Enable macOS codesigning for all libraries and executables
624 Goetz Lindenmaier SAP JDK-8235979 UnsatisfiedLinkError or NoSuchAlgorithmException after removing sunec.dll
628 Christoph Langer SAP JDK-8235823 Further cleanup to test serviceability/sa/ClhsdbCDSCore.java
628 Christoph Langer SAP JDK-8235822 hs test serviceability/sa/ClhsdbCDSCore.java fails on macOS 10.15
628 Christoph Langer SAP JDK-8235820 Add Amazon Root CA certificates
634 Christoph Langer SAP JDK-8235487 [TESTBUG] TestDivZeroCheckControl fails for client VMs due to Unrecognized VM option LoopUnrollLimit
638 Severin Gehwolf Red Hat JDK-8235142 JDK-8193255 backport broke bootstrap with JDK 10
638 Christoph Langer SAP JDK-8235187 ARM32: C1: PatchingStub for field access: not enough bytes
644 Severin Gehwolf Red Hat JDK-8234820 SunEC specific test is not limited to SunEC
644 Goetz Lindenmaier SAP JDK-8234797 [AIX] GUI app does not work with UTF-8 locale on minimum software requirements
647 Goetz Lindenmaier SAP JDK-8234702 (tz) Upgrade time-zone data to tzdata2019c
647 Goetz Lindenmaier SAP JDK-8234701 Robot.createScreenCapture() fails if “awt.robot.gtk” is set to false
647 Goetz Lindenmaier SAP JDK-8234700 Fontmetrics for large Fonts has zero width
648 Martin Balao Red Hat JDK-8234523 System property to set the number of PBE iterations in JCEKS keystores
648 Martin Doerr SAP JDK-8234667 Missing closedir call with JDK-8223490
648 Martin Balao Red Hat JDK-8234661 NoSuchAlgorithmException exception for SHA256withECDSA with RSASSA-PSS support
648 Goetz Lindenmaier SAP JDK-8234660 Corrupted option dialog in JTHarness with JDK14b13
648 Goetz Lindenmaier SAP JDK-8234658 Upgrade X Window System 6.8.2 to the latest XWD 1.0.7
648 Christoph Langer SAP JDK-8234653 sun/security/lib/cacerts/VerifyCACerts.java fails due to wrong checksum
648 Christoph Langer SAP JDK-8234652 (zipfs) jdk/nio/zipfs/CRCWriteTest.java fails
648 Christoph Langer SAP JDK-8234651 Add LuxTrust certificate updates to the existing root program
648 Christoph Langer SAP JDK-8234650 Comparison builds are failing due to cacerts file
648 Christoph Langer SAP JDK-8234649 Root Certificates should be stored in text format and assembled at build time
648 Roland Westrelin Red Hat JDK-8234648 SIGSEGV in C2 Node::unique_ctrl_out
648 Martin Doerr SAP JDK-8234591 [11u] Build with old C compiler broken by 8223490
648 Ioi Lam Oracle JDK-8234620 Call cache flush after generating trampoline.
649 Severin Gehwolf Red Hat JDK-8234600 Upgrading Joni License version to 2.1.16
649 Mario Torre Red Hat JDK-8234590 Several AWT modal dialog tests failing on Linux after JDK-8231991
649 Mario Torre Red Hat JDK-8234589 Mouse wheel change focus on awt/swing windows
649 Martin Doerr SAP JDK-8234579 Test crashed with assert(phi->operand_count() != 1 || phi->subst() != phi) failed: missed trivial simplification
649 Martin Doerr SAP JDK-8234578 C1: PatchingStub for field access copies too much
649 Martin Doerr SAP JDK-8234577 [PPC64, s390]: Make async profiling more reliable
649 Martin Doerr SAP JDK-8234576 [s390] C1: assert(is_bound() || is_unused()) failed: Label was never bound to a location, but it was used as a jmp target
649 Goetz Lindenmaier SAP JDK-8234561 [macos] NullPointerException getting bounds of GraphicsConfiguration
649 Goetz Lindenmaier SAP JDK-8234560 [macos] access to window property of NSView on wrong thread
649 Goetz Lindenmaier SAP JDK-8234559 Don't run sun/security/pkcs11/Cipher/TestKATForGCM.java on buggy NSS solaris versions
649 Goetz Lindenmaier SAP JDK-8234558 Setting the mgfHash in CK_RSA_PKCS_PSS_PARAMS has no effect
649 Goetz Lindenmaier SAP JDK-8234557 HOST locale provider holds wrong era name for GregorianCalendar in US locale
649 Goetz Lindenmaier SAP JDK-8234556 Optimize search algorithm for determining default time zone
649 Goetz Lindenmaier SAP JDK-8234555 Cache HarfBuzz face object for same font's text layout calls
650 Severin Gehwolf Red Hat JDK-8234537 Update double-conversion to version 3.1.5
650 Christoph Langer SAP JDK-8234529 Devanagari not shown with logical fonts on Windows after removal of Lucida Sans from JDK
650 Martin Balao Red Hat JDK-8234521 S4U2proxy cannot continue because server's TGT cannot be found
651 Goetz Lindenmaier SAP JDK-8234390 [macOS] ProblemList tests that leave rubbish on the screen
651 Goetz Lindenmaier SAP JDK-8234389 BCEL: update to version 6.3.1
651 Goetz Lindenmaier SAP JDK-8234388 TLSv1.3 fail with ClassException when EC keys are stored in PKCS11
652 Severin Gehwolf Red Hat JDK-8234349 Add 10 JNDI tests to com/sun/jndi/dns/AttributeTests/
652 Thomas Stuefe SAP JDK-8234344 [metaspace] Improve MetaspaceObj::is_metaspace_obj() and friends
654 Goetz Lindenmaier SAP JDK-8234283 Finished message validation failure should be decrypt_error alert
654 Goetz Lindenmaier SAP JDK-8234282 IllegalArgumentException in sun.lwawt.macosx.CPlatformWindow
654 Goetz Lindenmaier SAP JDK-8234281 Misleading code in SSLCipher
654 Goetz Lindenmaier SAP JDK-8234280 [macosx] Undecorated Frame does not Iconify when set to
654 Goetz Lindenmaier SAP JDK-8234279 [macos] java/awt/GraphicsDevice/CheckDisplayModes.java fails
654 Goetz Lindenmaier SAP JDK-8234278 Cipher with UNWRAP_MODE should support the generation of an AES key type
654 Goetz Lindenmaier SAP JDK-8234255 Turn off AOT by default
655 Christoph Langer SAP JDK-8234261 Test java/util/Locale/LocaleProvidersRun.java should enable assertions
655 Christoph Langer SAP JDK-8234260 Refactor java.util.Locale:i18n shell tests to plain java tests
655 Christoph Langer SAP JDK-8234259 exclude javax/swing/plaf/basic/BasicGraphicsUtils/8132119/bug8132119.java
655 Christoph Langer SAP JDK-8234258 MacVolumesTest failed after upgrade to MacOS Catalina
655 Christoph Langer SAP JDK-8234257 use string literal for format string when handling PauseAtStartupFile
655 Christoph Langer SAP JDK-8234256 (fs) Add test for macOS Catalina changes to protect system software
655 Christoph Langer SAP JDK-8234253 SunPKCS11-Solaris provider tests failing on Solaris 11.4
655 Christoph Langer SAP JDK-8234252 fix pkcs11 P11_DEBUG guarded native traces
655 Christoph Langer SAP JDK-8234251 Memory leak in PKCS11 provider when using AES GCM
655 Christoph Langer SAP JDK-8234250 32-bit build failures after JDK-8080462 (Update SunPKCS11 provider with PKCS11 v2.40 support)
655 Christoph Langer SAP JDK-8234249 SunPKCS11 provider needs to check more details on PKCS11 Mechanism
655 Christoph Langer SAP JDK-8233824 Update SunPKCS11 provider with PKCS11 v2.40 support
655 Vladimir Kempik Azul JDK-8234236 Proxied HttpsURLConnection doesn't send BODY when retrying POST request
655 Goetz Lindenmaier SAP JDK-8234235 Typo in SSL log message related to inactive/disabled signature scheme
655 Goetz Lindenmaier SAP JDK-8234234 Incorrectly named signature scheme ecdsa_secp512r1_sha512
655 Goetz Lindenmaier SAP JDK-8234233 [TESTBUG] vmTestbase/nsk/stress/stack tests fail by timeout
656 Goetz Lindenmaier SAP JDK-8234157 [AOT] -XX:AOTLibrary doesn't accept windows path
656 Roland Westrelin Red Hat JDK-8234155 UseAVX=3 has performance degredation on Skylake (X7) processors
657 Martin Balao Red Hat JDK-8234095 GSS login fails with PREAUTH_FAILED
657 Martin Balao Red Hat JDK-8234094 KDC.java test behaves incorrectly when AS-REQ contains a PAData not PA-ENC-TS-ENC
657 Martin Balao Red Hat JDK-8234093 Kerberos login to Windows 2000 failed with "Inappropriate type of checksum in message"
657 Christoph Langer SAP JDK-8234087 Problemlist JFR TestNetworkUtilization test
657 Christoph Langer SAP JDK-8234075 Asserts on AIX because os::elapsed_counter() is not monotonic
658 Martin Balao Red Hat JDK-8233944 Make KerberosPrincipal.KRB_NT_ENTERPRISE field package private
658 Fei Yang Huawei JDK-8234002 aarch64: missing memory barrier in NewObjectArrayStub and NewTypeArrayStub
658 Goetz Lindenmaier SAP JDK-8233988 serviceability/sa/TestJmapCore tests fail with java.lang.RuntimeException: Could not find dump file
658 Goetz Lindenmaier SAP JDK-8233984 [TESTBUG] sun/tools/jhsdb/JShellHeapDumpTest.java fails with RuntimeException 'JShellToolProvider' missing from stdout/stderr
658 Goetz Lindenmaier SAP JDK-8233983 Problemlist additional compiler/rtm tests
658 Goetz Lindenmaier SAP JDK-8233982 Problemlist compiler/rtm tests
658 Christoph Langer SAP JDK-8233981 TEST_BUG jdk/java/net/CookieHandler/B6791927.java hit hardcoded expiration date
658 Christoph Langer SAP JDK-8233980 TestQuotedLogOutput failure after ProcessBuilder changes
658 Christoph Langer SAP JDK-8233979 NullPointerException in java.util.logging.Handler#isLoggable
658 Christoph Langer SAP JDK-8233978 GraphicsConfiguration.getDevice().getDisplayMode() causes JVM crash on Mac
658 Christoph Langer SAP JDK-8233977 TLS 1.3 CertificateRequest message sometimes offers disallowed signature algorithms
658 Christoph Langer SAP JDK-8233976 Incorrect comparator com.sun.beans.introspect.MethodInfo.MethodOrder
658 Christoph Langer SAP JDK-8233975 SunLayoutEngine.isAAT() font is expensive on MacOS
658 Christoph Langer SAP JDK-8233973 jdk.test.lib.Utils::runAndCheckException error
658 Christoph Langer SAP JDK-8233972 [GRAAL] compiler/uncommontrap/TestDeoptOOM.java failed with OutOfMemoryError
658 Christoph Langer SAP JDK-8233971 Typos in javadoc - missing verb "be" and alike
658 Christoph Langer SAP JDK-8233969 setRequestProperty(key, null) results in HTTP header without colon in request
658 Christoph Langer SAP JDK-8233968 [macos] java/awt/event/ComponentEvent/MovedResizedTwiceTest/MovedResizedTwiceTest.java failed automatically
659 Christoph Langer SAP JDK-8233457 (zipfs) Writing out data with ZipFileSystem leads to a CRC failure in the generated jar file
662 Matthias Baesken SAP JDK-8233203 fix non-product build on AIX when compiling with xlc16/legacy-xlc
663 Zhengyu Gu Red Hat JDK-8233809 ctrl-F1 does not show the tooltip of a menu item (JMenuItems)
663 Zhengyu Gu Red Hat JDK-8233808 NullPointerException within Win32ShellFolder2
663 Christoph Langer SAP JDK-8233794 [ppc]: Align ReservedCodeCacheSize default value with other platforms
664 Christoph Langer SAP JDK-8233715 add result NULL-checking to freetypeScaler.c
664 Severin Gehwolf Red Hat JDK-8233694 JFR - nmetods - misspelled in several places
666 Roland Westrelin Red Hat JDK-8233508 assert(bol->is_Bool()) crash during split if due to FastLockNode
666 Martin Balao Red Hat JDK-8230495 Support Kerberos cross-realm referrals (RFC 6806)
666 Severin Gehwolf Red Hat JDK-8233502 Replace use of thread unsafe strtok
666 Severin Gehwolf Red Hat JDK-8233501 Usage of array placement new may lead to memory corruption
666 Aleksey Shipilev Red Hat JDK-8233460 Incorrect GPL header in src/jdk.internal.jvmstat/share/classes/sun/jvmstat/perfdata/monitor/protocol/local/PerfDataFile.java
666 Aleksey Shipilev Red Hat JDK-8233459 Incorrect GPL header in src/java.instrument/share/classes/java/lang/instrument/package-info.java
666 Aleksey Shipilev Red Hat JDK-8233458 Incorrect copyright header in FileSystemSupport_md.c
671 Mario Torre Red Hat JDK-8233221 Need to set the FreeType LCD Filter to reduce fringing.
671 Paul Hohensee Amazon JDK-8233216 [GRAAL] Don't run RTM tests with Graal
671 Severin Gehwolf Red Hat JDK-8233194 dtrace gensrc has missing dependencies
672 Severin Gehwolf Red Hat JDK-8233136 jfr tool can't format duration values greater than 1 minute
672 Severin Gehwolf Red Hat JDK-8233135 The jfr tool should pretty print reference chains
672 Christoph Langer SAP JDK-8233108 [s390, PPC64] More exception checks missing in interpreter
673 Paul Hohensee Amazon JDK-8233079 endpoint identification algorithm should be case-insensitive
673 Roman Kennke Red Hat JDK-8233070 C2/GC: Better GC-interface for expanding clone
673 Zhengyu Gu Red Hat JDK-8233069 False failure of GenericTaskQueue::pop_local on architectures with weak memory model
677 Aleksey Shipilev Red Hat JDK-8232987 ctw of jdk.security.auth failed with "Unexpected zero exit codebefore finishing all compilations"
677 Aleksey Shipilev Red Hat JDK-8232986 Unexpected test result caused by C2 IdealLoopTree::do_remove_empty_loop
677 Aleksey Shipilev Red Hat JDK-8232970 [testbug] vmTestbase/vm/compiler/CodeCacheInfoOnCompilation - wrong shell used
677 Aleksey Shipilev Red Hat JDK-8232969 Epsilon should warn about Xms/Xmx/AlwaysPreTouch configuration
677 Aleksey Shipilev Red Hat JDK-8232968 Add missing test for 8230062
677 Severin Gehwolf Red Hat JDK-8232965 HttpClient leaving connections in CLOSE_WAIT state until Java process ends
677 Roman Kennke Red Hat JDK-8232956 some GetByteArrayElements calls miss corresponding Release
677 Roman Kennke Red Hat JDK-8232955 ProblemList gc/stress/gclocker/TestExcessGCLockerCollections.java
677 Matthias Baesken SAP JDK-8232940 on aix handle Power 9 in os::get_summary_cpu_info
678 Yasumasa Suenaga NTT DATA JDK-8232920 is shown in jstack mixed mode
678 Christoph Langer SAP JDK-8232915 Windows build fails after JDK-8191521
678 Christoph Langer SAP JDK-8232914 Fix/remove malformed assert in os_windows.cpp
678 Christoph Langer SAP JDK-8232913 handle long relative path specified in -Xbootclasspath/a on windows
678 Severin Gehwolf Red Hat JDK-8232901 Destination option missing in FlightRecorderMXBeanImpl
679 Paul Hohensee Amazon JDK-8232831 [macosx] Java2D Queue Flusher crash on OSX after switching between user accounts
680 Zhengyu Gu Red Hat JDK-8232743 [TEST_BUG] Some tests should check isDisplayChangeSupported
680 Zhengyu Gu Red Hat JDK-8232742 JEditorPane is shown with incorrect size
680 Zhengyu Gu Red Hat JDK-8232741 java/awt/Robot/HiDPIScreenCapture/ScreenCaptureTest.java: Wrong Pixel Color
680 Zhengyu Gu Red Hat JDK-8232740 Crash at sun.awt.X11.XlibWrapper.XkbGetUpdatedMap when change keybord map
680 Zhengyu Gu Red Hat JDK-8232738 [Redo] jstat reports incorrect values for OU for CMS GC
680 Vladimir Kempik Azul JDK-8232688 (fs) Increase buffer size used with getmntent
681 Christoph Langer SAP JDK-8232667 Test security/infra/java/security/cert/CertPathValidator/certification/ComodoCA.java fails because certificate was revoked
681 Christoph Langer SAP JDK-8232666 HttpClient: The logic of retry on connect exception is inverted
681 Christoph Langer SAP JDK-8232665 Missing symbols in hs_err files on Windows after JDK-8212028
681 Christoph Langer SAP JDK-8232664 Use run-test makefile framework for testing in Oracle's Mach5
681 Christoph Langer SAP JDK-8232663 Load jib jars dynamically from JibArtifactResolver
684 Christoph Langer SAP JDK-8232587 use unicode version of the canonicalize() function to handle long path on windows
685 Aleksey Shipilev Red Hat JDK-8232376 JDB hangs when running monitor command
685 Aleksey Shipilev Red Hat JDK-8232375 assert(i == p->size()-1) failed: must be last element of the pack
685 Aleksey Shipilev Red Hat JDK-8232374 [TESTBUG] compiler/{jvmci,aot} tests should not run with GCs that do not support JVMCI/AOT
685 Aleksey Shipilev Red Hat JDK-8232373 Add GC.selected() jtreg-ext function
685 Aleksey Shipilev Red Hat JDK-8232372 CoreDocumentImpl.setXmlVersion NPE
685 Aleksey Shipilev Red Hat JDK-8232371 Test java/util/zip/FlaterTest.java fails with -Xcheck:jni
686 Zhengyu Gu Red Hat JDK-8232259 Failure on CPUs allowing loads reordering: assert(_tasks[t] == 1) failed: What else?
690 Zhengyu Gu Red Hat JDK-8232177 Typo in java/awt/GraphicsEnvironment/LoadLock/GE_init5.java
691 Severin Gehwolf Red Hat JDK-8232105 serviceability/dcmd/framework/VMVersionTest.java fails with a timeout
691 Severin Gehwolf Red Hat JDK-8232104 Test for JDK-8211435 can be run on all platforms
691 Roman Kennke Red Hat JDK-8232099 Unnecessary GCLocker-initiated young GCs
691 Christoph Langer SAP JDK-8232096 RecordingInfo should use textual representation of path
692 Aleksey Shipilev Red Hat JDK-8232055 hs_err should print coalesced safepoint operations in Events section
693 Roman Kennke Red Hat JDK-8232020 nmethod::make_unloaded() clears _method member too early
693 Christoph Langer SAP JDK-8231998 WindowsServerCore 1809 does not provide d2d1.dll library required by awt.dll
693 Christoph Langer SAP JDK-8231997 avoid incompatible pointer to integer conversion initializing gint in gtk2_interface
693 Severin Gehwolf Red Hat JDK-8231989 [Test_bug]java/util/Locale/LocaleProvidersRun.java failed on de_DE and ja_JP locale.
694 Aleksey Shipilev Red Hat JDK-8231967 ZGC: vmTestbase/nsk/jvmti/ResourceExhausted/resexhausted002 fails
694 Aleksey Shipilev Red Hat JDK-8231966 ZGC: vmTestbase/nsk/jvmti/Allocate/alloc001/ fails
694 Aleksey Shipilev Red Hat JDK-8231965 BufferedReader performance can be improved by using StringBuilder
694 Aleksey Shipilev Red Hat JDK-8231964 java.io.File.isInvalid() is racy
694 Aleksey Shipilev Red Hat JDK-8231963 C2's conditional move optimization fails with assert(bol->Opcode() == Op_Bool) failed
694 Aleksey Shipilev Red Hat JDK-8231962 # assert(mode == ControlAroundStripMined && use == sfpt) failed: missed a node
694 Roland Westrelin Red Hat JDK-8231929 x86_32 build failures after JDK-8229496
694 Roland Westrelin Red Hat JDK-8231928 SIGFPE (division by zero) in C2 OSR compiled method
694 Roland Westrelin Red Hat JDK-8231927 C2: Let ConnectionGraph::not_global_escape(Node* n) return false if n is not in the CG
694 Roland Westrelin Red Hat JDK-8231926 8231055 broke escapeAnalysis/TestSelfArrayCopy.java
694 Roland Westrelin Red Hat JDK-8231925 C2: arraycopy with same non escaping src and dest but different positions causes wrong execution
697 Christoph Langer SAP JDK-8231909 Problem list java/awt/FontMetrics/MaxAdvanceIsMax.java on more platforms
697 Roland Westrelin Red Hat JDK-8231888 Sinking load out of loop may trigger: assert(found_sfpt) failed: no node in loop that's not input to safepoint
697 Christoph Langer SAP JDK-8231886 [TESTBUG] jdk/internal/platform/cgroup/TestCgroupMetrics.java fails for - memory:getMemoryUsage
697 Christoph Langer SAP JDK-8231318 Several compiler/aot tests fail for JDK11 on Windows when only MSVC 2017 is installed
697 Christoph Langer SAP JDK-8231879 jdk/net/Sockets/Test.java fails after JDK-8227642
697 Christoph Langer SAP JDK-8231878 [TESTBUG] Make docker tests podman compatible
697 Christoph Langer SAP JDK-8231877 [TESTBUG] JDK docker test TestSystemMetrics.java fails with access issues and OOM
697 Christoph Langer SAP JDK-8231875 [AIX] Fix basic Xinerama and Xrender functionality
698 Christoph Langer SAP JDK-8231837 Kitchensink fails "assert((((klass)->trace_id() & (JfrTraceIdEpoch::leakp_in_use_this_epoch_bit())) != 0)) failed: invariant"
698 Christoph Langer SAP JDK-8231836 TestTimeMultiple.java failed "assert(!lease()) failed: invariant"
698 Christoph Langer SAP JDK-8231834 Emergency dump does not work when disk=false is set
700 Severin Gehwolf Red Hat JDK-8231714 Several tests failing when jtreg run with -vmoption:--illegal-access=deny
700 Severin Gehwolf Red Hat JDK-8231704 [TESTBUG] exclude Container tests from hotspot_misc group
700 Severin Gehwolf Red Hat JDK-8231703 langtools/tools/javac/T8152616.java missing @modules
700 Severin Gehwolf Red Hat JDK-8231702 java/lang/reflect/callerCache/ReflectionCallerCacheTest.java missing module dependencies declaration
701 Laurent Bourgès Independent JDK-8231621 Thin stroked shapes are not rendered if affine transform has flip bit
701 Matthias Baesken SAP JDK-8231611 add os::dll_load to the unified logging os category
704 Matthias Baesken SAP JDK-8231576 missing ReleaseStringUTFChars in Java_sun_security_pkcs11_wrapper_PKCS11_connect
704 Matthias Baesken SAP JDK-8231575 Java_java_net_NetworkInterface_getByName0 on unix misses ReleaseStringUTFChars in early return
704 Matthias Baesken SAP JDK-8231574 missing ReleaseStringUTFChars in java.desktop native code
704 Matthias Baesken SAP JDK-8231573 missing ReleaseStringUTFChars in serviceability native code
705 Christoph Langer SAP JDK-8231535 False deadlock detection with -XX:+CIPrintCompileQueue after JDK-8163511
705 Christoph Langer SAP JDK-8231534 TestLinkageErrorInGenerateOopMap times out
705 Christoph Langer SAP JDK-8231532 -XX:StartFlightRecording:settings= doesn't work properly
705 Goetz Lindenmaier SAP JDK-8231521 (fs) FileStore::isReadOnly is always true on macOS Catalina
705 Goetz Lindenmaier SAP JDK-8231520 Test sun/tools/jcmd/TestProcessHelper.java fails intermittently
705 Goetz Lindenmaier SAP JDK-8231519 Resolve permissions for code source URLs lazily
705 Goetz Lindenmaier SAP JDK-8231518 (tz) Upgrade time-zone data to tzdata2019b
705 Goetz Lindenmaier SAP JDK-8231517 TZ database in "vanguard" format support
707 Thomas Stuefe SAP JDK-8231399 JVM::printFlags fails in native OOM situations
707 Thomas Stuefe SAP JDK-8231396 MetaspaceUtils::print_report crashes when called before initialization
707 Thomas Stuefe SAP JDK-8231394 Print NMT statistics on fatal errors
708 Martin Balao Red Hat JDK-8230923 SunJSSE is not properly initialized in FIPS mode from a configuration file
711 Christoph Langer SAP JDK-8231247 (zipfs) Test failure in jdk/nio/zipfs/InvalidZipHeaderTests.java after backport of JDK-8222807
711 Christoph Langer SAP JDK-8231303 [TESTBUG] Test JFR API from Java agent
711 Christoph Langer SAP JDK-8231302 Unnecessary

tags in jfr classes

712 Christoph Langer SAP JDK-8231241 Perf::attach() should not throw a java.lang.Exception
712 Christoph Langer SAP JDK-8231240 templateInterpreter.cpp: copy_table() needs to be safer
712 Christoph Langer SAP JDK-8231239 add VirtualizationInformation JFR event
712 Christoph Langer SAP JDK-8231238 (zipfs) OutOfMemory on compiling with darcula.jar in classpath
712 Christoph Langer SAP JDK-8231237 sun.jdwp.listenerAddress agent property uses wrong encoding
712 Christoph Langer SAP JDK-8231236 (zipfs) JarFileSystem does not correctly handle versioned entries if no root entry is present
712 Christoph Langer SAP JDK-8231235 (zipfs) ZipDirectoryStream should provide a stream of paths that are relative to the directory
712 Christoph Langer SAP JDK-8231234 (zipfs) ZipDirectoryStream yields a stream of absolute paths when directory is relative
712 Goetz Lindenmaier SAP JDK-8231233 problemList failing/ignored manual tests in security-libs
712 Goetz Lindenmaier SAP JDK-8231232 upgrade gtest to 1.8.1
713 Thomas Stuefe SAP JDK-8231195 No hs-err file if fatal error is raised during dynamic initialization.
714 Severin Gehwolf Red Hat JDK-8231116 Add --with-extra-asflags configure option
714 Aleksey Shipilev Red Hat JDK-8231108 aarch64: C2 OSR compilation fails with "shouldn't process one node several times" in final graph reshaping
715 Aleksey Shipilev Red Hat JDK-8231050 [TESTBUG] runtime/StackTrace/HiddenFrameTest.java fails with release VM
715 Aleksey Shipilev Red Hat JDK-8231049 ShowHiddenFrames use in java_lang_StackTraceElement::fill_in appears broken
715 Aleksey Shipilev Red Hat JDK-8230697 Change the environment variable for Java Access Bridge logging to have a directory
716 Christoph Langer SAP JDK-8231029 Aarch64: elide barriers on all volatile operations
719 Matthias Baesken SAP JDK-8230914 [TESTBUG] runtime/containers/docker/TestMemoryAwareness.java test fails on SLES12
719 Matthias Baesken SAP JDK-8230913 BufImg_SetupICM add ReleasePrimitiveArrayCritical call in early return
719 Matthias Baesken SAP JDK-8230911 ConnectionGraph::unique_java_object(Node* N) return NULL if n is not in the CG
719 Matthias Baesken SAP JDK-8230909 check malloc/calloc results in jdk.hotspot.agent
719 Aleksey Shipilev Red Hat JDK-8230908 ClassLoaderData Symbols can leak
719 Aleksey Shipilev Red Hat JDK-8230907 Add JDK-8010500 to compiler/loopopts/superword/TestFuzzPreLoop.java bug list
719 Aleksey Shipilev Red Hat JDK-8230906 Add another regression test for JDK-8134739
719 Aleksey Shipilev Red Hat JDK-8230905 Crash in CompileBroker::make_thread due to OOM
719 Goetz Lindenmaier SAP JDK-8230898 (zipfs) zip file corruption when replacing an existing STORED entry
719 Goetz Lindenmaier SAP JDK-8230897 ProblemList sun/security/pkcs11/sslecc/ClientJSSEServerJSSE.java due to JDK-8161536
719 Goetz Lindenmaier SAP JDK-8230896 Many pkcs11 tests failed in Provider initialization, after compiler on Windows changed
719 Goetz Lindenmaier SAP JDK-8230895 Update Apache Santuario (XML Signature) to version 2.1.3
719 Goetz Lindenmaier SAP JDK-8230894 java.lang.UnsatisfiedLinkError: net.dll: Can't find dependent libraries
719 Goetz Lindenmaier SAP JDK-8230893 Windows 32bit build error in libsunmscapi/security.cpp
719 Goetz Lindenmaier SAP JDK-8230892 (fs) More than one instance of built-in FileSystem observed in heap
720 Stuart Marks Oracle JDK-8227650 EnumSet.class serialization broken in JDK 9+
721 Martin Doerr SAP JDK-8230807 Fix missing includes after JDK-8212673
721 Andrew Brygin Azul JDK-8230805 Allow shorter method sampling interval than 10 ms
721 Andrew Brygin Azul JDK-8230804 JFR tool produces incorrect output when both --categories and --events are specified
721 Andrew Brygin Azul JDK-8230803 [TESTBUG] docker/TestJFREvents.java fails due to "RuntimeException: JAVA_MAIN_CLASS_* is not defined"
721 Andrew Brygin Azul JDK-8230802 [TESTBUG] create more tests for JFR in container environment
721 Andrew Brygin Azul JDK-8230801 JFR tool shows potentially misleading message when it cannot access a file
722 Aleksey Shipilev Red Hat JDK-8230748 C2 scalarization crashes with assert(node->Opcode() == Op_CastP2X) failed: ConvP2XNode required
722 Aleksey Shipilev Red Hat JDK-8230747 jtreg/applications/runthese/RunThese30M.java fails in C2 with "assert(!had_error) failed: bad dominance"
725 Aleksey Shipilev Red Hat JDK-8230719 Load barrier slow path node should be MachTypeNode
725 Aleksey Shipilev Red Hat JDK-8230718 [TESTBUG] Crash with assert(external_guard || result != __null) failed: Invalid JNI handle
725 Aleksey Shipilev Red Hat JDK-8230717 -Xlog::file cannot be used with named pipe
725 Aleksey Shipilev Red Hat JDK-8230716 Epsilon does not extend TLABs to max size
725 Christoph Langer SAP JDK-8230714 Make jfr strncpy uses GCC 8.x friendly
725 Christoph Langer SAP JDK-8230713 assert(is_aligned(ref, HeapWordSize)) failed: invariant
725 Christoph Langer SAP JDK-8230712 Regression caused by JDK-8214542 not installing complete checkpoint data to candidates
725 Christoph Langer SAP JDK-8229024 JFR: Old Object Sample event slow on a deep heap in debug builds
726 Paul Hohensee Amazon JDK-8230667 C2 compilation fails with assert(found_sfpt) failed: no node in loop that's not input to safepoint
726 Jaroslav Bachorík DataDog JDK-8229475 Accessorize JFR getEventWriter() intrinsics
726 Jaroslav Bachorík DataDog JDK-8230655 Introduce native oop barriers in C2 for OopHandle
727 Severin Gehwolf Red Hat JDK-8230593 Era designator not displayed correctly using the COMPAT provider
727 Jaroslav Bachorík DataDog JDK-8230578 Introduce native oop barriers in C1 for OopHandle
727 Aleksey Shipilev Red Hat JDK-8230577 [TESTBUG] runtime/CreateMirror/ArraysNewInstanceBug.java timed out
727 Aleksey Shipilev Red Hat JDK-8230576 C2 compilation fails with "assert(node->_last_del == _last) failed: must have deleted the edge just produced"
727 Aleksey Shipilev Red Hat JDK-8230575 sun.security.ssl.HandshakeHash.T12HandshakeHash constructor check backwards.
727 Aleksey Shipilev Red Hat JDK-8230574 LoadBarrierNode::common_barrier must check address
727 Aleksey Shipilev Red Hat JDK-8230570 C2 compilation fails due to unschedulable graph if DominatorSearchLimit is reached
727 Aleksey Shipilev Red Hat JDK-8230569 ZGC: split_barrier_thru_phi: check number of inputs of phi
727 Aleksey Shipilev Red Hat JDK-8230568 ZGC: Add missing LoadBarrierNode::size_of()
727 Aleksey Shipilev Red Hat JDK-8230567 Allow MemBar on single memory slice
727 Goetz Lindenmaier SAP JDK-8230556 Improve startup behavior of SecurityProperties
727 Christoph Langer SAP JDK-8230550 stringStream internal buffer should always be zero terminated
727 Christoph Langer SAP JDK-8230549 bufferedStream does not honor size limit
727 Christoph Langer SAP JDK-8230547 [TESTBUG] enhance jfr/jvm/TestDumpOnCrash
728 Jiangli Zhou Google JDK-8230515 constantPoolHandle::constantPoolHandle(ConstantPool*) when precompiled header is disabled
728 Jiangli Zhou Google JDK-8230514 Simplify HeapShared::archive_module_graph_objects
728 Jiangli Zhou Google JDK-8230513 Use shared macros for JavaClasses::compute_offsets and MetaspaceShared::serialize_well_known_classes
728 Jiangli Zhou Google JDK-8230512 Archive the Integer.IntegerCache
728 Jiangli Zhou Google JDK-8230511 Store the Configuration for system modules into CDS archive
728 Jiangli Zhou Google JDK-8230510 Consolidate use of empty collections in java.lang.module
728 Aleksey Shipilev Red Hat JDK-8230476 Hook to allow GC to inject Node::Ideal() calls
728 Aleksey Shipilev Red Hat JDK-8230475 C2 compilation fails with assert "m has strange control"
728 Aleksey Shipilev Red Hat JDK-8230474 C2 compilation fails with "assert(ex_map->jvms()->same_calls_as(_exceptions->jvms())) failed: all collected exceptions must come from the same place"
728 Aleksey Shipilev Red Hat JDK-8230473 C2 assert(!had_error) failed: bad dominance
728 Aleksey Shipilev Red Hat JDK-8230472 Use AS_NO_KEEPALIVE loads in HeapDumper
728 Aleksey Shipilev Red Hat JDK-8230471 StackFrameInfo::getByteCodeIndex returns wrong value if bci > 32767
729 Christoph Langer SAP JDK-8230437 Windows 32bit build error in NetworkInterface_winXP.c
729 Christoph Langer SAP JDK-8230430 [TESTBUG] JFR tool fails to execute
729 Christoph Langer SAP JDK-8230429 JFR Tool left files behind
729 Christoph Langer SAP JDK-8228669 JFR tool
730 Yasumasa Suenaga NTT DATA JDK-8230229 SA tools not providing option to connect to debug server
733 Christoph Langer SAP JDK-8230353 add os::dll_load calls to event log
733 Christoph Langer SAP JDK-8230352 stringStream should not use Resource Area
733 Christoph Langer SAP JDK-8230351 Small VM.metaspace improvements
733 Matthias Baesken SAP JDK-8230340 G1: fatal error: acquiring lock SATB_Q_FL_lock/1 out of order with lock tty_lock/0
734 Paul Hohensee Amazon JDK-8230316 Font rendering and glyph spacing changed from jdk-8 to jdk-11
734 Goetz Lindenmaier SAP JDK-8229408 Bump update version for OpenJDK: jdk-11.0.6

No changesets log

JDK-8231569 Remove invalid assertion in jfr_conditional_flush()

Committer push log

Andrew Hughes, Red Hat

Bug Summary
JDK-8231741 Malformed copyright year range in a few files in java.base

Andrew Brygin, Azul

Bug Summary
JDK-8230802 [TESTBUG] create more tests for JFR in container environment
JDK-8230803 [TESTBUG] docker/TestJFREvents.java fails due to "RuntimeException: JAVA_MAIN_CLASS_* is not defined"
JDK-8230805 Allow shorter method sampling interval than 10 ms
JDK-8230804 JFR tool produces incorrect output when both --categories and --events are specified
JDK-8230801 JFR tool shows potentially misleading message when it cannot access a file

Christoph Langer, SAP

Bug Summary
JDK-8234256 (fs) Add test for macOS Catalina changes to protect system software
JDK-8231236 (zipfs) JarFileSystem does not correctly handle versioned entries if no root entry is present
JDK-8234652 (zipfs) jdk/nio/zipfs/CRCWriteTest.java fails
JDK-8231238 (zipfs) OutOfMemory on compiling with darcula.jar in classpath
JDK-8231247 (zipfs) Test failure in jdk/nio/zipfs/InvalidZipHeaderTests.java after backport of JDK-8222807
JDK-8233457 (zipfs) Writing out data with ZipFileSystem leads to a CRC failure in the generated jar file
JDK-8231235 (zipfs) ZipDirectoryStream should provide a stream of paths that are relative to the directory
JDK-8231234 (zipfs) ZipDirectoryStream yields a stream of absolute paths when directory is relative
JDK-8231532 -XX:StartFlightRecording:settings= doesn't work properly
JDK-8234250 32-bit build failures after JDK-8080462 (Update SunPKCS11 provider with PKCS11 v2.40 support)
JDK-8231875 [AIX] Fix basic Xinerama and Xrender functionality
JDK-8233972 [GRAAL] compiler/uncommontrap/TestDeoptOOM.java failed with OutOfMemoryError
JDK-8233968 [macos] java/awt/event/ComponentEvent/MovedResizedTwiceTest/MovedResizedTwiceTest.java failed automatically
JDK-8233794 [ppc]: Align ReservedCodeCacheSize default value with other platforms
JDK-8233108 [s390, PPC64] More exception checks missing in interpreter
JDK-8230547 [TESTBUG] enhance jfr/jvm/TestDumpOnCrash
JDK-8231877 [TESTBUG] JDK docker test TestSystemMetrics.java fails with access issues and OOM
JDK-8231886 [TESTBUG] jdk/internal/platform/cgroup/TestCgroupMetrics.java fails for - memory:getMemoryUsage
JDK-8230430 [TESTBUG] JFR tool fails to execute
JDK-8231878 [TESTBUG] Make docker tests podman compatible
JDK-8231303 [TESTBUG] Test JFR API from Java agent
JDK-8235487 [TESTBUG] TestDivZeroCheckControl fails for client VMs due to Unrecognized VM option LoopUnrollLimit
JDK-8231029 Aarch64: elide barriers on all volatile operations
JDK-8235820 Add Amazon Root CA certificates
JDK-8234651 Add LuxTrust certificate updates to the existing root program
JDK-8230353 add os::dll_load calls to event log
JDK-8233715 add result NULL-checking to freetypeScaler.c
JDK-8231239 add VirtualizationInformation JFR event
JDK-8235187 ARM32: C1: PatchingStub for field access: not enough bytes
JDK-8230713 assert(is_aligned(ref, HeapWordSize)) failed: invariant
JDK-8234075 Asserts on AIX because os::elapsed_counter() is not monotonic
JDK-8231997 avoid incompatible pointer to integer conversion initializing gint in gtk2_interface
JDK-8230549 bufferedStream does not honor size limit
JDK-8234650 Comparison builds are failing due to cacerts file
JDK-8236253 Contents/MacOS/libjli.dylib cannot be a symlink
JDK-8234529 Devanagari not shown with logical fonts on Windows after removal of Lucida Sans from JDK
JDK-8231834 Emergency dump does not work when disk=false is set
JDK-8236252 Enable macOS codesigning for all libraries and executables
JDK-8234259 exclude javax/swing/plaf/basic/BasicGraphicsUtils/8132119/bug8132119.java
JDK-8231535 False deadlock detection with -XX:+CIPrintCompileQueue after JDK-8163511
JDK-8234252 fix pkcs11 P11_DEBUG guarded native traces
JDK-8232914 Fix/remove malformed assert in os_windows.cpp
JDK-8235823 Further cleanup to test serviceability/sa/ClhsdbCDSCore.java
JDK-8233978 GraphicsConfiguration.getDevice().getDisplayMode() causes JVM crash on Mac
JDK-8232913 handle long relative path specified in -Xbootclasspath/a on windows
JDK-8235822 hs test serviceability/sa/ClhsdbCDSCore.java fails on macOS 10.15
JDK-8232666 HttpClient: The logic of retry on connect exception is inverted
JDK-8233976 Incorrect comparator com.sun.beans.introspect.MethodInfo.MethodOrder
JDK-8233973 jdk.test.lib.Utils::runAndCheckException error
JDK-8231879 jdk/net/Sockets/Test.java fails after JDK-8227642
JDK-8228669 JFR tool
JDK-8230429 JFR Tool left files behind
JDK-8229024 JFR: Old Object Sample event slow on a deep heap in debug builds
JDK-8231837 Kitchensink fails "assert((((klass)->trace_id() & (JfrTraceIdEpoch::leakp_in_use_this_epoch_bit())) != 0)) failed: invariant"
JDK-8232663 Load jib jars dynamically from JibArtifactResolver
JDK-8234258 MacVolumesTest failed after upgrade to MacOS Catalina
JDK-8230714 Make jfr strncpy uses GCC 8.x friendly
JDK-8234251 Memory leak in PKCS11 provider when using AES GCM
JDK-8232665 Missing symbols in hs_err files on Windows after JDK-8212028
JDK-8233979 NullPointerException in java.util.logging.Handler#isLoggable
JDK-8231241 Perf::attach() should not throw a java.lang.Exception
JDK-8231909 Problem list java/awt/FontMetrics/MaxAdvanceIsMax.java on more platforms
JDK-8234087 Problemlist JFR TestNetworkUtilization test
JDK-8232096 RecordingInfo should use textual representation of path
JDK-8234260 Refactor java.util.Locale:i18n shell tests to plain java tests
JDK-8230712 Regression caused by JDK-8214542 not installing complete checkpoint data to candidates
JDK-8234649 Root Certificates should be stored in text format and assembled at build time
JDK-8233969 setRequestProperty(key, null) results in HTTP header without colon in request
JDK-8231318 Several compiler/aot tests fail for JDK11 on Windows when only MSVC 2017 is installed
JDK-8230351 Small VM.metaspace improvements
JDK-8230550 stringStream internal buffer should always be zero terminated
JDK-8230352 stringStream should not use Resource Area
JDK-8231237 sun.jdwp.listenerAddress agent property uses wrong encoding
JDK-8234653 sun/security/lib/cacerts/VerifyCACerts.java fails due to wrong checksum
JDK-8233975 SunLayoutEngine.isAAT() font is expensive on MacOS
JDK-8234249 SunPKCS11 provider needs to check more details on PKCS11 Mechanism
JDK-8234253 SunPKCS11-Solaris provider tests failing on Solaris 11.4
JDK-8231240 templateInterpreter.cpp: copy_table() needs to be safer
JDK-8232667 Test security/infra/java/security/cert/CertPathValidator/certification/ComodoCA.java fails because certificate was revoked
JDK-8234261 Test java/util/Locale/LocaleProvidersRun.java should enable assertions
JDK-8233981 TEST_BUG jdk/java/net/CookieHandler/B6791927.java hit hardcoded expiration date
JDK-8231534 TestLinkageErrorInGenerateOopMap times out
JDK-8233980 TestQuotedLogOutput failure after ProcessBuilder changes
JDK-8231836 TestTimeMultiple.java failed "assert(!lease()) failed: invariant"
JDK-8233977 TLS 1.3 CertificateRequest message sometimes offers disallowed signature algorithms
JDK-8233971 Typos in javadoc - missing verb "be" and alike
JDK-8231302 Unnecessary

tags in jfr classes

JDK-8233824 Update SunPKCS11 provider with PKCS11 v2.40 support
JDK-8232664 Use run-test makefile framework for testing in Oracle's Mach5
JDK-8234257 use string literal for format string when handling PauseAtStartupFile
JDK-8232587 use unicode version of the canonicalize() function to handle long path on windows
JDK-8230437 Windows 32bit build error in NetworkInterface_winXP.c
JDK-8232915 Windows build fails after JDK-8191521
JDK-8231998 WindowsServerCore 1809 does not provide d2d1.dll library required by awt.dll

Fei Yang, Huawei

Bug Summary
JDK-8234002 aarch64: missing memory barrier in NewObjectArrayStub and NewTypeArrayStub

Goetz Lindenmaier, SAP

Bug Summary
JDK-8231521 (fs) FileStore::isReadOnly is always true on macOS Catalina
JDK-8230892 (fs) More than one instance of built-in FileSystem observed in heap
JDK-8231518 (tz) Upgrade time-zone data to tzdata2019b
JDK-8234702 (tz) Upgrade time-zone data to tzdata2019c
JDK-8230898 (zipfs) zip file corruption when replacing an existing STORED entry
JDK-8234797 [AIX] GUI app does not work with UTF-8 locale on minimum software requirements
JDK-8234157 [AOT] -XX:AOTLibrary doesn't accept windows path
JDK-8234560 [macos] access to window property of NSView on wrong thread
JDK-8234279 [macos] java/awt/GraphicsDevice/CheckDisplayModes.java fails
JDK-8234561 [macos] NullPointerException getting bounds of GraphicsConfiguration
JDK-8234390 [macOS] ProblemList tests that leave rubbish on the screen
JDK-8234280 [macosx] Undecorated Frame does not Iconify when set to
JDK-8233984 [TESTBUG] sun/tools/jhsdb/JShellHeapDumpTest.java fails with RuntimeException 'JShellToolProvider' missing from stdout/stderr
JDK-8234233 [TESTBUG] vmTestbase/nsk/stress/stack tests fail by timeout
JDK-8234389 BCEL: update to version 6.3.1
JDK-8229408 Bump update version for OpenJDK: jdk-11.0.6
JDK-8234555 Cache HarfBuzz face object for same font's text layout calls
JDK-8234278 Cipher with UNWRAP_MODE should support the generation of an AES key type
JDK-8234660 Corrupted option dialog in JTHarness with JDK14b13
JDK-8234559 Don't run sun/security/pkcs11/Cipher/TestKATForGCM.java on buggy NSS solaris versions
JDK-8234283 Finished message validation failure should be decrypt_error alert
JDK-8234700 Fontmetrics for large Fonts has zero width
JDK-8234557 HOST locale provider holds wrong era name for GregorianCalendar in US locale
JDK-8234282 IllegalArgumentException in sun.lwawt.macosx.CPlatformWindow
JDK-8230556 Improve startup behavior of SecurityProperties
JDK-8234234 Incorrectly named signature scheme ecdsa_secp512r1_sha512
JDK-8230894 java.lang.UnsatisfiedLinkError: net.dll: Can't find dependent libraries
JDK-8230896 Many pkcs11 tests failed in Provider initialization, after compiler on Windows changed
JDK-8234281 Misleading code in SSLCipher
JDK-8234556 Optimize search algorithm for determining default time zone
JDK-8233983 Problemlist additional compiler/rtm tests
JDK-8233982 Problemlist compiler/rtm tests
JDK-8231233 problemList failing/ignored manual tests in security-libs
JDK-8230897 ProblemList sun/security/pkcs11/sslecc/ClientJSSEServerJSSE.java due to JDK-8161536
JDK-8231519 Resolve permissions for code source URLs lazily
JDK-8234701 Robot.createScreenCapture() fails if “awt.robot.gtk” is set to false
JDK-8233988 serviceability/sa/TestJmapCore tests fail with java.lang.RuntimeException: Could not find dump file
JDK-8234558 Setting the mgfHash in CK_RSA_PKCS_PSS_PARAMS has no effect
JDK-8231520 Test sun/tools/jcmd/TestProcessHelper.java fails intermittently
JDK-8234388 TLSv1.3 fail with ClassException when EC keys are stored in PKCS11
JDK-8234255 Turn off AOT by default
JDK-8234235 Typo in SSL log message related to inactive/disabled signature scheme
JDK-8231517 TZ database in "vanguard" format support
JDK-8235979 UnsatisfiedLinkError or NoSuchAlgorithmException after removing sunec.dll
JDK-8230895 Update Apache Santuario (XML Signature) to version 2.1.3
JDK-8231232 upgrade gtest to 1.8.1
JDK-8234658 Upgrade X Window System 6.8.2 to the latest XWD 1.0.7
JDK-8230893 Windows 32bit build error in libsunmscapi/security.cpp

Ioi Lam, Oracle

Bug Summary
JDK-8234620 Call cache flush after generating trampoline.

Jaroslav Bachorík, DataDog

Bug Summary
JDK-8229475 Accessorize JFR getEventWriter() intrinsics
JDK-8230578 Introduce native oop barriers in C1 for OopHandle
JDK-8230655 Introduce native oop barriers in C2 for OopHandle

Jiangli Zhou, Google

Bug Summary
JDK-8230512 Archive the Integer.IntegerCache
JDK-8230510 Consolidate use of empty collections in java.lang.module
JDK-8230515 constantPoolHandle::constantPoolHandle(ConstantPool*) when precompiled header is disabled
JDK-8230514 Simplify HeapShared::archive_module_graph_objects
JDK-8230511 Store the Configuration for system modules into CDS archive
JDK-8230513 Use shared macros for JavaClasses::compute_offsets and MetaspaceShared::serialize_well_known_classes

Laurent Bourgès, Independent

Bug Summary
JDK-8231621 Thin stroked shapes are not rendered if affine transform has flip bit

Matthias Baesken, SAP

Bug Summary
JDK-8230914 [TESTBUG] runtime/containers/docker/TestMemoryAwareness.java test fails on SLES12
JDK-8231611 add os::dll_load to the unified logging os category
JDK-8230913 BufImg_SetupICM add ReleasePrimitiveArrayCritical call in early return
JDK-8230909 check malloc/calloc results in jdk.hotspot.agent
JDK-8230911 ConnectionGraph::unique_java_object(Node* N) return NULL if n is not in the CG
JDK-8233203 fix non-product build on AIX when compiling with xlc16/legacy-xlc
JDK-8230340 G1: fatal error: acquiring lock SATB_Q_FL_lock/1 out of order with lock tty_lock/0
JDK-8231575 Java_java_net_NetworkInterface_getByName0 on unix misses ReleaseStringUTFChars in early return
JDK-8231574 missing ReleaseStringUTFChars in java.desktop native code
JDK-8231576 missing ReleaseStringUTFChars in Java_sun_security_pkcs11_wrapper_PKCS11_connect
JDK-8231573 missing ReleaseStringUTFChars in serviceability native code
JDK-8232940 on aix handle Power 9 in os::get_summary_cpu_info

Martin Balao, Red Hat

Bug Summary
JDK-8234095 GSS login fails with PREAUTH_FAILED
JDK-8234094 KDC.java test behaves incorrectly when AS-REQ contains a PAData not PA-ENC-TS-ENC
JDK-8234093 Kerberos login to Windows 2000 failed with "Inappropriate type of checksum in message"
JDK-8233944 Make KerberosPrincipal.KRB_NT_ENTERPRISE field package private
JDK-8234661 NoSuchAlgorithmException exception for SHA256withECDSA with RSASSA-PSS support
JDK-8234521 S4U2proxy cannot continue because server's TGT cannot be found
JDK-8230923 SunJSSE is not properly initialized in FIPS mode from a configuration file
JDK-8230495 Support Kerberos cross-realm referrals (RFC 6806)
JDK-8234523 System property to set the number of PBE iterations in JCEKS keystores

Martin Doerr, SAP

Bug Summary
JDK-8234591 [11u] Build with old C compiler broken by 8223490
JDK-8234577 [PPC64, s390]: Make async profiling more reliable
JDK-8234576 [s390] C1: assert(is_bound() || is_unused()) failed: Label was never bound to a location, but it was used as a jmp target
JDK-8234578 C1: PatchingStub for field access copies too much
JDK-8230807 Fix missing includes after JDK-8212673
JDK-8234667 Missing closedir call with JDK-8223490
JDK-8234579 Test crashed with assert(phi->operand_count() != 1 || phi->subst() != phi) failed: missed trivial simplification

Mario Torre, Red Hat

Bug Summary
JDK-8234589 Mouse wheel change focus on awt/swing windows
JDK-8233221 Need to set the FreeType LCD Filter to reduce fringing.
JDK-8234590 Several AWT modal dialog tests failing on Linux after JDK-8231991

Paul Hohensee, Amazon

Bug Summary
JDK-8233216 [GRAAL] Don't run RTM tests with Graal
JDK-8232831 [macosx] Java2D Queue Flusher crash on OSX after switching between user accounts
JDK-8230667 C2 compilation fails with assert(found_sfpt) failed: no node in loop that's not input to safepoint
JDK-8233079 endpoint identification algorithm should be case-insensitive
JDK-8230316 Font rendering and glyph spacing changed from jdk-8 to jdk-11

Roman Kennke, Red Hat

Bug Summary
JDK-8233070 C2/GC: Better GC-interface for expanding clone
JDK-8232020 nmethod::make_unloaded() clears _method member too early
JDK-8232955 ProblemList gc/stress/gclocker/TestExcessGCLockerCollections.java
JDK-8232956 some GetByteArrayElements calls miss corresponding Release
JDK-8232099 Unnecessary GCLocker-initiated young GCs

Roland Westrelin, Red Hat

Bug Summary
JDK-8231926 8231055 broke escapeAnalysis/TestSelfArrayCopy.java
JDK-8233508 assert(bol->is_Bool()) crash during split if due to FastLockNode
JDK-8231925 C2: arraycopy with same non escaping src and dest but different positions causes wrong execution
JDK-8231927 C2: Let ConnectionGraph::not_global_escape(Node* n) return false if n is not in the CG
JDK-8231928 SIGFPE (division by zero) in C2 OSR compiled method
JDK-8234648 SIGSEGV in C2 Node::unique_ctrl_out
JDK-8231888 Sinking load out of loop may trigger: assert(found_sfpt) failed: no node in loop that's not input to safepoint
JDK-8234155 UseAVX=3 has performance degredation on Skylake (X7) processors
JDK-8231929 x86_32 build failures after JDK-8229496

Severin Gehwolf, Red Hat

Bug Summary
JDK-8231989 [Test_bug]java/util/Locale/LocaleProvidersRun.java failed on de_DE and ja_JP locale.
JDK-8231704 [TESTBUG] exclude Container tests from hotspot_misc group
JDK-8231116 Add --with-extra-asflags configure option
JDK-8234349 Add 10 JNDI tests to com/sun/jndi/dns/AttributeTests/
JDK-8232901 Destination option missing in FlightRecorderMXBeanImpl
JDK-8233194 dtrace gensrc has missing dependencies
JDK-8230593 Era designator not displayed correctly using the COMPAT provider
JDK-8232965 HttpClient leaving connections in CLOSE_WAIT state until Java process ends
JDK-8231702 java/lang/reflect/callerCache/ReflectionCallerCacheTest.java missing module dependencies declaration
JDK-8235142 JDK-8193255 backport broke bootstrap with JDK 10
JDK-8233694 JFR - nmetods - misspelled in several places
JDK-8233136 jfr tool can't format duration values greater than 1 minute
JDK-8231703 langtools/tools/javac/T8152616.java missing @modules
JDK-8233502 Replace use of thread unsafe strtok
JDK-8232105 serviceability/dcmd/framework/VMVersionTest.java fails with a timeout
JDK-8231714 Several tests failing when jtreg run with -vmoption:--illegal-access=deny
JDK-8234820 SunEC specific test is not limited to SunEC
JDK-8232104 Test for JDK-8211435 can be run on all platforms
JDK-8233135 The jfr tool should pretty print reference chains
JDK-8234537 Update double-conversion to version 3.1.5
JDK-8234600 Upgrading Joni License version to 2.1.16
JDK-8233501 Usage of array placement new may lead to memory corruption

Aleksey Shipilev, Red Hat

Bug Summary
JDK-8231962 # assert(mode == ControlAroundStripMined && use == sfpt) failed: missed a node
JDK-8230717 -Xlog::file cannot be used with named pipe
JDK-8232374 [TESTBUG] compiler/{jvmci,aot} tests should not run with GCs that do not support JVMCI/AOT
JDK-8230718 [TESTBUG] Crash with assert(external_guard || result != __null) failed: Invalid JNI handle
JDK-8230577 [TESTBUG] runtime/CreateMirror/ArraysNewInstanceBug.java timed out
JDK-8231050 [TESTBUG] runtime/StackTrace/HiddenFrameTest.java fails with release VM
JDK-8232970 [testbug] vmTestbase/vm/compiler/CodeCacheInfoOnCompilation - wrong shell used
JDK-8231108 aarch64: C2 OSR compilation fails with "shouldn't process one node several times" in final graph reshaping
JDK-8230906 Add another regression test for JDK-8134739
JDK-8232373 Add GC.selected() jtreg-ext function
JDK-8230907 Add JDK-8010500 to compiler/loopopts/superword/TestFuzzPreLoop.java bug list
JDK-8232968 Add missing test for 8230062
JDK-8230567 Allow MemBar on single memory slice
JDK-8232375 assert(i == p->size()-1) failed: must be last element of the pack
JDK-8231965 BufferedReader performance can be improved by using StringBuilder
JDK-8230473 C2 assert(!had_error) failed: bad dominance
JDK-8230570 C2 compilation fails due to unschedulable graph if DominatorSearchLimit is reached
JDK-8230474 C2 compilation fails with "assert(ex_map->jvms()->same_calls_as(_exceptions->jvms())) failed: all collected exceptions must come from the same place"
JDK-8230576 C2 compilation fails with "assert(node->_last_del == _last) failed: must have deleted the edge just produced"
JDK-8230475 C2 compilation fails with assert "m has strange control"
JDK-8230748 C2 scalarization crashes with assert(node->Opcode() == Op_CastP2X) failed: ConvP2XNode required
JDK-8231963 C2's conditional move optimization fails with assert(bol->Opcode() == Op_Bool) failed
JDK-8230697 Change the environment variable for Java Access Bridge logging to have a directory
JDK-8230908 ClassLoaderData Symbols can leak
JDK-8232372 CoreDocumentImpl.setXmlVersion NPE
JDK-8230905 Crash in CompileBroker::make_thread due to OOM
JDK-8232987 ctw of jdk.security.auth failed with "Unexpected zero exit codebefore finishing all compilations"
JDK-8230716 Epsilon does not extend TLABs to max size
JDK-8232969 Epsilon should warn about Xms/Xmx/AlwaysPreTouch configuration
JDK-8230476 Hook to allow GC to inject Node::Ideal() calls
JDK-8232055 hs_err should print coalesced safepoint operations in Events section
JDK-8233458 Incorrect copyright header in FileSystemSupport_md.c
JDK-8233459 Incorrect GPL header in src/java.instrument/share/classes/java/lang/instrument/package-info.java
JDK-8233460 Incorrect GPL header in src/jdk.internal.jvmstat/share/classes/sun/jvmstat/perfdata/monitor/protocol/local/PerfDataFile.java
JDK-8231964 java.io.File.isInvalid() is racy
JDK-8232376 JDB hangs when running monitor command
JDK-8230747 jtreg/applications/runthese/RunThese30M.java fails in C2 with "assert(!had_error) failed: bad dominance"
JDK-8230719 Load barrier slow path node should be MachTypeNode
JDK-8230574 LoadBarrierNode::common_barrier must check address
JDK-8231049 ShowHiddenFrames use in java_lang_StackTraceElement::fill_in appears broken
JDK-8230471 StackFrameInfo::getByteCodeIndex returns wrong value if bci > 32767
JDK-8230575 sun.security.ssl.HandshakeHash.T12HandshakeHash constructor check backwards.
JDK-8232371 Test java/util/zip/FlaterTest.java fails with -Xcheck:jni
JDK-8232986 Unexpected test result caused by C2 IdealLoopTree::do_remove_empty_loop
JDK-8230472 Use AS_NO_KEEPALIVE loads in HeapDumper
JDK-8230568 ZGC: Add missing LoadBarrierNode::size_of()
JDK-8230569 ZGC: split_barrier_thru_phi: check number of inputs of phi
JDK-8231966 ZGC: vmTestbase/nsk/jvmti/Allocate/alloc001/ fails
JDK-8231967 ZGC: vmTestbase/nsk/jvmti/ResourceExhausted/resexhausted002 fails

Stuart Marks, Oracle

Bug Summary
JDK-8227650 EnumSet.class serialization broken in JDK 9+

Thomas Stuefe, SAP

Bug Summary
JDK-8234344 [metaspace] Improve MetaspaceObj::is_metaspace_obj() and friends
JDK-8231399 JVM::printFlags fails in native OOM situations
JDK-8231396 MetaspaceUtils::print_report crashes when called before initialization
JDK-8231195 No hs-err file if fatal error is raised during dynamic initialization.
JDK-8231394 Print NMT statistics on fatal errors

Vladimir Kempik, Azul

Bug Summary
JDK-8232688 (fs) Increase buffer size used with getmntent
JDK-8234236 Proxied HttpsURLConnection doesn't send BODY when retrying POST request

Yasumasa Suenaga, NTT DATA

Bug Summary
JDK-8232920 is shown in jstack mixed mode
JDK-8230229 SA tools not providing option to connect to debug server

Zhengyu Gu, Red Hat

Bug Summary
JDK-8232738 [Redo] jstat reports incorrect values for OU for CMS GC
JDK-8232743 [TEST_BUG] Some tests should check isDisplayChangeSupported
JDK-8232740 Crash at sun.awt.X11.XlibWrapper.XkbGetUpdatedMap when change keybord map
JDK-8233809 ctrl-F1 does not show the tooltip of a menu item (JMenuItems)
JDK-8232259 Failure on CPUs allowing loads reordering: assert(_tasks[t] == 1) failed: What else?
JDK-8233069 False failure of GenericTaskQueue::pop_local on architectures with weak memory model
JDK-8232741 java/awt/Robot/HiDPIScreenCapture/ScreenCaptureTest.java: Wrong Pixel Color
JDK-8232742 JEditorPane is shown with incorrect size
JDK-8233808 NullPointerException within Win32ShellFolder2
JDK-8232177 Typo in java/awt/GraphicsEnvironment/LoadLock/GE_init5.java