PUSHES REPORT: 11.0.7

This report shows who pushed the backports to the given release. This usually shows who did the backporting, testing, and review work.

Report generated: Wed Sep 01 03:25:24 CEST 2021

Distribution by priority

Count Priority
1 P1
31 P2
145 P3
146 P4
2 P5

Distribution by components

Count Component
325 Total
130 (40.0%) hotspot
57 (17.5%) hotspot/compiler
43 (13.2%) hotspot/runtime
8 (2.5%) hotspot/jfr
6 (1.8%) hotspot/gc
5 (1.5%) hotspot/svc
4 (1.2%) hotspot/svc-agent
3 (0.9%) hotspot/jvmti
2 (0.6%) hotspot
2 (0.6%) hotspot/test
73 (22.5%) client-libs
43 (13.2%) client-libs/javax.swing
14 (4.3%) client-libs/java.awt
11 (3.4%) client-libs/2d
2 (0.6%) client-libs
1 (0.3%) client-libs/javax.sound
1 (0.3%) client-libs/java.awt:i18n
1 (0.3%) client-libs/javax.accessibility
35 (10.8%) security-libs
13 (4.0%) security-libs/javax.net.ssl
9 (2.8%) security-libs/java.security
7 (2.2%) security-libs/javax.crypto
2 (0.6%) security-libs/javax.crypto:pkcs11
1 (0.3%) security-libs/javax.smartcardio
1 (0.3%) security-libs/jdk.security
1 (0.3%) security-libs/javax.xml.crypto
1 (0.3%) security-libs/org.ietf.jgss:krb5
33 (10.2%) core-libs
8 (2.5%) core-libs/java.net
7 (2.2%) core-libs/java.nio
4 (1.2%) core-libs/java.lang
2 (0.6%) core-libs
2 (0.6%) core-libs/javax.naming
2 (0.6%) core-libs/java.util:i18n
2 (0.6%) core-libs/java.util.jar
1 (0.3%) core-libs/java.rmi
1 (0.3%) core-libs/java.util
1 (0.3%) core-libs/java.lang.invoke
1 (0.3%) core-libs/java.util:collections
1 (0.3%) core-libs/java.math
1 (0.3%) core-libs/java.lang:reflect
33 (10.2%) infrastructure
30 (9.2%) infrastructure/build
3 (0.9%) infrastructure
10 (3.1%) core-svc
9 (2.8%) core-svc/debugger
1 (0.3%) core-svc/java.lang.management
9 (2.8%) tools
3 (0.9%) tools/javac
2 (0.6%) tools/jlink
1 (0.3%) tools/jconsole
1 (0.3%) tools/javadoc(tool)
1 (0.3%) tools/launcher
1 (0.3%) tools
2 (0.6%) xml
2 (0.6%) xml/jaxp

Distribution by affiliation

Count Committer
324 Total
220 (67.9%) SAP
128 (39.5%) Goetz Lindenmaier
46 (14.2%) Christoph Langer
36 (11.1%) Matthias Baesken
9 (2.8%) Martin Doerr
1 (0.3%) Thomas Stuefe
79 (24.4%) Red Hat
51 (15.7%) Aleksey Shipilev
15 (4.6%) Andrew Hughes
5 (1.5%) Severin Gehwolf
3 (0.9%) Roman Kennke
2 (0.6%) Martin Balao
2 (0.6%) Mario Torre
1 (0.3%) Zhengyu Gu
11 (3.4%) Amazon
11 (3.4%) Paul Hohensee
7 (2.2%) Google
7 (2.2%) Jiangli Zhou
3 (0.9%) Azul
1 (0.3%) Andrew Brygin
1 (0.3%) Dmitry Cherepanov
1 (0.3%) Yuri Nesterenko
2 (0.6%) Huawei
2 (0.6%) Fei Yang
1 (0.3%) @littlepinkcloud.com
1 (0.3%) Andrew Haley
1 (0.3%) NTT DATA
1 (0.3%) Yasumasa Suenaga

Chronological push log:

Days Ago Committer Affiliation Bug Summary
504 Andrew Hughes Red Hat JDK-8242761 make 4.3 breaks build
504 Andrew Hughes Red Hat JDK-8242759 java/util/Arrays/TimSortStackSize2.java times out with fastdebug build
504 Andrew Hughes Red Hat JDK-8242758 Various minor fixes
504 Andrew Hughes Red Hat JDK-8242757 Add Visual Studio Code workspace generation support (for native code)
504 Andrew Hughes Red Hat JDK-8242756 Refactor CacheFind
504 Andrew Hughes Red Hat JDK-8242755 Windows incremental build is broken with JDK-8217728
504 Andrew Hughes Red Hat JDK-8242754 Speed up incremental rerun of "make hotspot"
504 Andrew Hughes Red Hat JDK-8242753 Add support for generating compile_commands.json
504 Andrew Hughes Red Hat JDK-8242752 Use of THIS_FILE in hotspot invalidates precompiled header on Linux/GCC
504 Andrew Hughes Red Hat JDK-8242751 Setting of THIS_FILE in the build is broken
504 Andrew Hughes Red Hat JDK-8242750 Event descriptions are truncated in logs
504 Andrew Hughes Red Hat JDK-8242749 FLAGS_COMPILER_CHECK_ARGUMENTS doesn't handle cross-compilation
504 Andrew Hughes Red Hat JDK-8242743 (bf) Heap buffer state changes could provoke unexpected exceptions
525 Andrew Haley @littlepinkcloud.com JDK-8241501 Segfault in JNIHandleBlock::oops_do()
526 Martin Doerr SAP JDK-8241428 com/sun/jndi/ldap/privconn/RunTest.java failed due to hang in LdapRequest.getReplyBer
532 Christoph Langer SAP JDK-8241198 [TESTBUG] appcds/CommandLineFlagComboNegative.java does not handle archive mapping failure
537 Matthias Baesken SAP JDK-8240946 javax/net/ssl/templates/SSLSocketSSLEngineTemplate.java fails intermittently with "java.lang.Exception: Unexpected EOF"
537 Matthias Baesken SAP JDK-8240945 javax/net/ssl/TLS tests support TLSv1.3
537 Matthias Baesken SAP JDK-8240944 javax/net/ssl/templates/SSLSocketSSLEngineTemplate.java supports TLSv1.3
538 Christoph Langer SAP JDK-8240880 Update test documentation with additional settings for client UI tooltip tests
540 Matthias Baesken SAP JDK-8240724 [test] jdk11 downport of 8224475 misses binary file test/jdk/javax/swing/JTextPane/arrow.png
540 Martin Doerr SAP JDK-8240740 [ntintel] asserts about copying unaligned array element
540 Matthias Baesken SAP JDK-8240728 Update ProblemList.txt to exclude failing headful tests on macos
540 Goetz Lindenmaier SAP JDK-8240727 SuperWord::co_locate_pack picks memory state of first instead of last load
545 Matthias Baesken SAP JDK-8240525 (zipfs) Updating an existing zip file does not preserve original permissions
546 Severin Gehwolf Red Hat JDK-8240453 NamingManager should cache InitialContextFactory
546 Matthias Baesken SAP JDK-8240368 Update GIFlib library to the 5.2.1
546 Matthias Baesken SAP JDK-8240367 Access Bridge lacks html tags parsing
546 Matthias Baesken SAP JDK-8240366 JTextPane does not show images in HTML rendering
546 Matthias Baesken SAP JDK-8240365 [macosx] Two apostrophes are entered instead of one with "U.S. International - PC" layout
546 Aleksey Shipilev Red Hat JDK-8240359 Add exception for expiring Comodo roots to VerifyCACerts test
547 Christoph Langer SAP JDK-8240288 java/nio/channels/SocketChannel/AdaptSocket.java fails on Windows 10
551 Matthias Baesken SAP JDK-8240186 Duplicate attribution in freetype.md
551 Matthias Baesken SAP JDK-8240185 Upgrade to freetype 2.10.1
551 Matthias Baesken SAP JDK-8240184 Update CUP to v0.11b
551 Matthias Baesken SAP JDK-8240183 [macos 10.15] java/awt/Window/LocationAtScreenCorner/LocationAtScreenCorner.java may fail
551 Matthias Baesken SAP JDK-8240182 [macos 10.15] Windows in fullscreen tests jumps around the screen
553 Aleksey Shipilev Red Hat JDK-8239917 assert(false) failed: Bad graph detected in get_early_ctrl_for_expensive
554 Thomas Stuefe SAP JDK-8238531 Create new switch to redirect error reporting output to stdout or stderr
554 Matthias Baesken SAP JDK-8239851 build broken when configured with --with-zlib=bundled on gcc 7.3
554 Aleksey Shipilev Red Hat JDK-8239848 java/net/DatagramPacket/ReuseBuf.java failed due to timeout
554 Aleksey Shipilev Red Hat JDK-8239847 Add a new test to verify that DatagramSocket is not interruptible
556 Christoph Langer SAP JDK-8239820 Deep sign macOS bundles before bundle archive is being created
558 Christoph Langer SAP JDK-8239466 Loss of precision in counter decay calculation in 11u backport of JDK-8237375
558 Aleksey Shipilev Red Hat JDK-8239545 C2: assert(i >= req() || i == 0 || is_Region() || is_Phi()) with -XX:+VerifyGraphEdges
558 Aleksey Shipilev Red Hat JDK-8239542 Add exception for expiring DocuSign root to VerifyCACerts test
558 Aleksey Shipilev Red Hat JDK-8239541 Duplicated synchronized keywords in SSLSocketImpl
558 Aleksey Shipilev Red Hat JDK-8239540 CTW: C2 compilation fails with assert(just_allocated_object(alloc_ctl) == ptr) failed: most recent allo
558 Aleksey Shipilev Red Hat JDK-8239539 [TESTBUG] test/hotspot/jtreg/runtime/StackGuardPages/TestStackGuardPages.java: exeinvoke.c: must initialize static state before calling do_overflow()
558 Aleksey Shipilev Red Hat JDK-8239538 Hard coded loop limit prevents reading of smart card data greater than 8k
560 Christoph Langer SAP JDK-8239341 Problemlist SA tests with AOT
560 Christoph Langer SAP JDK-8239340 ActionListeners on JRadioButtons don't get notified when selection is changed with arrow keys
560 Christoph Langer SAP JDK-8239339 Some serviceability/sa/ tests intermittently fail with java.io.IOException: LingeredApp terminated with non-zero exit code 3
561 Paul Hohensee Amazon JDK-8239247 java.security.Provider.getService returns random result due to race condition with mutating methods in the same class
561 Paul Hohensee Amazon JDK-8239246 java.security.Provider#getServices order is no longer deterministic
561 Aleksey Shipilev Red Hat JDK-8239222 Errors in alert ssl message does not reflect the actual certificate status
561 Aleksey Shipilev Red Hat JDK-8239221 Wrong file headers with 8202414 fix changeset
561 Matthias Baesken SAP JDK-8239219 enable link-time section-gc for linux s390x to remove unused code
561 Christoph Langer SAP JDK-8239144 SocketListeningConnector does not allow invocations with port 0
564 Christoph Langer SAP JDK-8239078 SimpleThresholdPolicy misses CounterDecay timestamp initialization
564 Christoph Langer SAP JDK-8239077 ProblemList java/lang/reflect/PublicMethods/PublicMethodsTest.java
564 Christoph Langer SAP JDK-8239076 ProblemList java/lang/invoke/VarHandles tests
564 Christoph Langer SAP JDK-8239075 Improperly use of the Optional API
564 Matthias Baesken SAP JDK-8239065 nsk/jdb/locals/locals002: ERROR: Cannot find boolVar with expected value: false
564 Matthias Baesken SAP JDK-8239064 At step6,Click Add button,case failed automatically.
564 Matthias Baesken SAP JDK-8239063 JNI exception pending in DestroyXIMCallback of awt_InputMethod.c:1327
564 Aleksey Shipilev Red Hat JDK-8239061 Allow 204 responses with Content-Length:0
564 Aleksey Shipilev Red Hat JDK-8239060 CTW: Split applications/ctw/modules/jdk_localedata.java
564 Aleksey Shipilev Red Hat JDK-8239059 CTW runner should sweep nmethods more aggressively
564 Aleksey Shipilev Red Hat JDK-8239058 CTW runner closes standard output on exit
564 Aleksey Shipilev Red Hat JDK-8239057 AVX enabled by default for Skylake even when unsupported
567 Christoph Langer SAP JDK-8238865 Update arm devkits with libXrandr headers
567 Christoph Langer SAP JDK-8238864 Missing constant pool entry for a method in stacktrace
567 Matthias Baesken SAP JDK-8238850 remove obsolete NET_ReadV
567 Matthias Baesken SAP JDK-8238849 NET_Writev is declared, NET_WriteV is defined
567 Matthias Baesken SAP JDK-8238848 enhance print_rlimit_info in os_posix
568 Christoph Langer SAP JDK-8238772 Issues reported after replacing symlink at Contents/MacOS/libjli.dylib with binary
568 Christoph Langer SAP JDK-8238771 Support for configure option --with-native-debug-symbols=internal is impossible on Windows
568 Zhengyu Gu Red Hat JDK-8238767 (se) Stack overflow during selection operation leads to crash (win)
568 Mario Torre Red Hat JDK-8238754 Infinite loop when rendering huge lines
568 Aleksey Shipilev Red Hat JDK-8238748 Simplify JarFile.isInitializing
568 Aleksey Shipilev Red Hat JDK-8238747 Class loading deadlock involving X509Factory#commitEvent()
568 Aleksey Shipilev Red Hat JDK-8238746 java.lang.Class.isPrimitive() (C1) returns wrong result if Klass* is aligned to 32bit
568 Aleksey Shipilev Red Hat JDK-8238745 Update BCEL version to 6.3.1 in license file
571 Martin Balao Red Hat JDK-8237600 Test SunJSSEFIPSInit fails on Ubuntu
571 Jiangli Zhou Google JDK-8238701 runtime/appcds/cacheObject/DifferentHeapSizes.java crash
571 Matthias Baesken SAP JDK-8238672 s390x - remove unused pd_zero_to_words_large
571 Matthias Baesken SAP JDK-8238671 struct SwitchRange in HS violates C++ One Definition Rule
572 Roman Kennke Red Hat JDK-8238632 cleanup arguments to PhaseIdealLoop() constructor
572 Christoph Langer SAP JDK-8238619 sunmscapi.dll causing EXCEPTION_ACCESS_VIOLATION
572 Christoph Langer SAP JDK-8238618 exclude jtreg test security/infra/java/security/cert/CertPathValidator/certification/LuxTrustCA.java because of instabilities
572 Christoph Langer SAP JDK-8238616 jdi/EventQueue/remove/remove004 fails due to VMDisconnectedException
572 Christoph Langer SAP JDK-8238615 jdi/EventQueue/remove_l/remove_l004 failed due to "TIMEOUT while waiting for event"
572 Christoph Langer SAP JDK-8238614 jdi/EventQueue/remove/remove004 failed due to "ERROR: thread2 is not alive"
572 Christoph Langer SAP JDK-8238597 [macos] NPE was thrown at expanding Choice from maximized frame
573 Aleksey Shipilev Red Hat JDK-8238541 MaxVectorSize set wrongly when UseAVX=3 is specified after JDK-8221092
573 Aleksey Shipilev Red Hat JDK-8238540 C2: assert(con.basic_type() != T_ILLEGAL) failed: elembt=byte; loadbt=void; unsigned=0
573 Aleksey Shipilev Red Hat JDK-8238539 javadoc fails with ClassCastException on {@link byte[]}
573 Aleksey Shipilev Red Hat JDK-8238538 TestAbortVMOnSafepointTimeout.java failed due to "RuntimeException: 'Safepoint sync time longer than' missing from stdout/stderr"
573 Goetz Lindenmaier SAP JDK-8238529 2019-09-28 public suffix list update
573 Goetz Lindenmaier SAP JDK-8238528 [TESTBUG] appcds/SharedArchiveConsistency timed out
573 Goetz Lindenmaier SAP JDK-8238527 JVM fails to detect mismatched or corrupt CDS archive
574 Andrew Hughes Red Hat JDK-8238456 AArch64: fix warnings and errors with Clang and GCC 8.3
575 Paul Hohensee Amazon JDK-8238396 java.security.Provider.getService() is synchronized and became scalability bottleneck
575 Jiangli Zhou Google JDK-8238392 ArchivedKlassSubGraphInfoRecord is incomplete
579 Jiangli Zhou Google JDK-8238250 Make CDS archived heap regions usable even if compressed oop encoding has changed
581 Aleksey Shipilev Red Hat JDK-8237957 Test runtime/modules/getModuleJNI/GetModule fails with -Xcheck:jni
581 Aleksey Shipilev Red Hat JDK-8237956 Problem with NullPointerException in RMI TCPEndpoint.read
582 Christoph Langer SAP JDK-8237907 Algorithmic Italic font leans opposite angle in Printing
582 Christoph Langer SAP JDK-8237904 TestMetadataRetention fails due to missing symbol id
582 Christoph Langer SAP JDK-8237903 Incorrect method tag offset for big endian platform
582 Christoph Langer SAP JDK-8237902 OldObjectSample event creates unexpected amount of checkpoint data
582 Paul Hohensee Amazon JDK-8237893 (zipfs) Potential memory leak with zip provider
582 Paul Hohensee Amazon JDK-8237892 AVX 512 instructions inadvertently used on Xeon for small vector width operations
585 Paul Hohensee Amazon JDK-8237828 SUNPKCS11 Provider incorrectly check key length for PSS Signatures.
585 Matthias Baesken SAP JDK-8237822 handle return values of sscanf calls in hotspot
585 Aleksey Shipilev Red Hat JDK-8237810 Assert triggers with -XX:+StressReflectiveCode
586 Aleksey Shipilev Red Hat JDK-8237797 java.util.zip.CRC32 performance drop after 8200067
586 Aleksey Shipilev Red Hat JDK-8237796 assert(!VerifyHashTableKeys || _hash_lock == 0) failed: remove node from hash table before modifying it
586 Aleksey Shipilev Red Hat JDK-8237795 Missing -Xcheck:jni checking for DeleteWeakGlobalRef
586 Aleksey Shipilev Red Hat JDK-8237794 PIT: test/jdk/javax/swing/text/html/TestJLabelWithHTMLText.java times out in linux-x64
586 Aleksey Shipilev Red Hat JDK-8237793 Rendering HTML with empty img attribute and documentBaseKey cause Exception
586 Aleksey Shipilev Red Hat JDK-8237792 Improve the code coverage for ThreadLocal
586 Aleksey Shipilev Red Hat JDK-8237791 java/lang/ProcessBuilder/Basic.java#id1 failed with stream closed
586 Aleksey Shipilev Red Hat JDK-8237790 java/lang/reflect/PublicMethods/PublicMethodsTest.java times out
586 Aleksey Shipilev Red Hat JDK-8237789 tools/jimage/JImageExtractTest.java timed out
586 Aleksey Shipilev Red Hat JDK-8237788 jdk/internal/jimage/JImageOpenTest.java runs no test
586 Paul Hohensee Amazon JDK-8237773 Update Mesa 3-D Headers to version 19.2.1
586 Roman Kennke Red Hat JDK-8237772 Refactor arraycopy_prologue to allow ZGC read barriers on arraycopy
586 Paul Hohensee Amazon JDK-8237771 Worker has a deadlock bug
586 Christoph Langer SAP JDK-8236500 Windows ucrt.dll should be looked up in versioned WINSDK subdirectory
586 Christoph Langer SAP JDK-8237760 Refactor some com.sun.jdi tests to enable IDE integration
586 Christoph Langer SAP JDK-8237759 Visual Studio install found through --with-tools-dir value is discarded
589 Martin Doerr SAP JDK-8237541 Missing files in backport of JDK-8209499
589 Martin Doerr SAP JDK-8237540 Missing files in backport of JDK-8210910
589 Aleksey Shipilev Red Hat JDK-8237520 assert(in_bb(n)) failed: must be
589 Aleksey Shipilev Red Hat JDK-8237519 assert(d->is_CFG() && n->is_CFG()) failed: must have CFG nodes
589 Aleksey Shipilev Red Hat JDK-8237518 Modifying ArrayList.subList().subList() resets modCount of subList
589 Aleksey Shipilev Red Hat JDK-8237517 Intermittent NPE in Component.validate()
590 Goetz Lindenmaier SAP JDK-8237511 [TESTBUG] runtime/NMT/MallocStressTest.java timed out
590 Goetz Lindenmaier SAP JDK-8237510 runtime/NMT/MallocStressTest.java timed out
590 Goetz Lindenmaier SAP JDK-8237509 [TESTBUG] Bugs in runtime/NMT/MallocStressTest.java
592 Martin Doerr SAP JDK-8237478 Test failed to resume JVMCI CompilerThread
592 Martin Balao Red Hat JDK-8237476 Support cross-realm MSSFU
593 Andrew Hughes Red Hat JDK-8237387 JSSE Client does not accept status_request extension in CertificateRequest messages for TLS 1.3
593 Mario Torre Red Hat JDK-8237381 freetype seeks to index at the end of the font data
593 Martin Doerr SAP JDK-8237355 C1 register allocation failure with T_ADDRESS
593 Aleksey Shipilev Red Hat JDK-8237345 Incorrect G1StringDedupEntry type used in StringDedupTable destructor
593 Aleksey Shipilev Red Hat JDK-8237344 JFR file without license header
593 Aleksey Shipilev Red Hat JDK-8237343 infinite loop in LogOutputList::wait_until_no_readers()
593 Aleksey Shipilev Red Hat JDK-8237342 Crash in AdapterHandlerLibrary::get_adapter with CDS due to code cache exhaustion
593 Aleksey Shipilev Red Hat JDK-8237341 loopTransform.cpp:2984: Error: assert(p_f->Opcode() == Op_IfFalse) failed
593 Aleksey Shipilev Red Hat JDK-8237340 assert(mode == ControlAroundStripMined && (use == sfpt || !use->is_reachable_from_root())) failed: missed a node
593 Aleksey Shipilev Red Hat JDK-8237339 C1 compilation fails with -XX:+PrintIRDuringConstruction -XX:+Verbose
593 Aleksey Shipilev Red Hat JDK-8237338 C1: Incorrect result of field load due to missing narrowing conversion
593 Aleksey Shipilev Red Hat JDK-8237337 C2: Memory stomp in max_array_length() for T_ILLEGAL type
593 Matthias Baesken SAP JDK-8237336 use more Posix functionality in aix os::print_os_info
593 Matthias Baesken SAP JDK-8237335 add some initializations using sigemptyset in os_aix.cpp
593 Goetz Lindenmaier SAP JDK-8237334 Improve performance of ThreadMXBean.getThreadInfo(long ids[], int maxDepth)
593 Goetz Lindenmaier SAP JDK-8237333 Linux os::available_memory re-reads cgroup configuration on every invocation
593 Goetz Lindenmaier SAP JDK-8237332 [C2] Memory leaks during tracing after "8224193: stringStream should not use Resource Area".
593 Goetz Lindenmaier SAP JDK-8237324 Malformed copyright year range in a few files in java.base
594 Roman Kennke Red Hat JDK-8237251 ZGC: Broken oop map in C1 load barrier stub
598 Goetz Lindenmaier SAP JDK-8236972 Replace wildcard address with loopback or local host in tests - part 14
600 Severin Gehwolf Red Hat JDK-8236848 [JDK 11u] make run-test-tier1 fails after backport of JDK-8232834
600 Severin Gehwolf Red Hat JDK-8236185 Introduce a system property to disable eager lambda initialization
601 Goetz Lindenmaier SAP JDK-8236777 Use utility APIs introduced in org/netbeans/jemmy/util/LookAndFeel class in client sanity test cases
601 Goetz Lindenmaier SAP JDK-8236776 Reduce the timeout of tooltip in SwingSet2DemoTest
601 Goetz Lindenmaier SAP JDK-8236775 [TESTBUG] problemlist JFR TestLargeRootSet.java
601 Goetz Lindenmaier SAP JDK-8236774 [TESTBUG] Problemlist JFR compiler/TestCodeSweeper.java
601 Goetz Lindenmaier SAP JDK-8236773 RunTest sometimes fails to produce valid exitcode.txt
601 Goetz Lindenmaier SAP JDK-8236768 new sun.misc.Signal("INFO") throws IllegalArgumentException since JDK11
601 Goetz Lindenmaier SAP JDK-8236767 Some tests in serviceability/sa run with fixed -Xmx values and risk running out of memory
601 Goetz Lindenmaier SAP JDK-8236765 [Containers] Improve systemd slice memory limit support
601 Goetz Lindenmaier SAP JDK-8236764 GetOwnedMonitorInfoWithEATest.java fails with ZGC: Heap too small
601 Goetz Lindenmaier SAP JDK-8236763 Should disable Escape Analysis if JVMTI capability can_get_owned_monitor_info was taken
601 Goetz Lindenmaier SAP JDK-8236761 Replace wildcard address with loopback or local host in tests - part 6
601 Goetz Lindenmaier SAP JDK-8236760 SunMSCAPI keys are not cleaned up
602 Goetz Lindenmaier SAP JDK-8236724 Enable different look and feel tests in SwingSet3 demo test FileChooserDemoTest
602 Goetz Lindenmaier SAP JDK-8236723 Handle different look and feels in JInternalFrameOperator
602 Christoph Langer SAP JDK-8236713 Javac treats Manifest Class-Path entries as Paths instead of URLs
602 Christoph Langer SAP JDK-8236712 FSInfo#getJarClassPath throws an exception not declared in its throws clause
602 Christoph Langer SAP JDK-8236711 Garbage collectors should register JFR types themselves to avoid build errors.
603 Paul Hohensee Amazon JDK-8236684 Turkey Time Zone returns incorrect time zone name
603 Yasumasa Suenaga NTT DATA JDK-8236673 jhsdb jmap from OpenJDK 11.0.5 doesn't work if prelink is enabled
606 Matthias Baesken SAP JDK-8236640 fix minimal VM build on Linux s390x
607 Matthias Baesken SAP JDK-8236621 set relro in linker flags when building with gcc
607 Matthias Baesken SAP JDK-8236620 stack is executable when building with Clang on Linux
607 Christoph Langer SAP JDK-8236618 Rename vm_operations.?pp files to vmOperations.?pp files
610 Goetz Lindenmaier SAP JDK-8236590 jdk-13+20 bundle name contains null instead of ea
610 Goetz Lindenmaier SAP JDK-8236589 Improve version string for Oracle CI builds
610 Goetz Lindenmaier SAP JDK-8236588 Correct the format of ColorChooserDemoTest
610 Goetz Lindenmaier SAP JDK-8236587 Curve in certificate should not affect signature scheme when using TLSv1.3
610 Goetz Lindenmaier SAP JDK-8236586 RunTest documentation and usability update
610 Goetz Lindenmaier SAP JDK-8236585 Add key exchange algorithm to javax/net/ssl/TLSCommon/CipherSuite.java
610 Goetz Lindenmaier SAP JDK-8236584 exclude compiler/intrinsics/sha/sanity tests from AOT runs
610 Goetz Lindenmaier SAP JDK-8236583 [AOT] Problem list serviceability/sa tests failed with AOTed java.base
610 Christoph Langer SAP JDK-8236581 JFR calls virtual is_Java_thread from ~Thread()
611 Goetz Lindenmaier SAP JDK-8236577 [TESTBUG] compiler/aot/fingerprint/SelfChangedCDS.java fails when cds is disabled
611 Goetz Lindenmaier SAP JDK-8236576 SignedObject with invalid Key not throwing the InvalidKeyException in Windows
611 Goetz Lindenmaier SAP JDK-8236575 giflib legal file is missing attribution for openbsd-reallocarray.c.
611 Goetz Lindenmaier SAP JDK-8236574 [Graal] compiler/jvmci/compilerToVM/IsMatureVsReprofileTest.java fails with -XX:CompileThresholdScaling=0.1
611 Goetz Lindenmaier SAP JDK-8236573 test/jdk/demo/jfc/J2Ddemo/J2DdemoTest.java cannot find J2Ddemo.jar
611 Goetz Lindenmaier SAP JDK-8236572 Tests that need to be problem-listed or have printer resources
611 Goetz Lindenmaier SAP JDK-8236571 JInternalFrame : java.lang.AssertionError: cannot find the internal frame
611 Goetz Lindenmaier SAP JDK-8236570 Support CNG RSA keys
613 Goetz Lindenmaier SAP JDK-8236566 ButtonDemoScreenshotTest fails randomly with "still state to be reached"
613 Goetz Lindenmaier SAP JDK-8236565 javax/net/ssl/compatibility/Compatibility.java should be more flexible
613 Goetz Lindenmaier SAP JDK-8236564 Add intermittent test in the JavaSound to the ProblemList
613 Goetz Lindenmaier SAP JDK-8236563 javax/net/ssl/compatibility/Compatibility.java failed on some SNI cases
613 Goetz Lindenmaier SAP JDK-8236562 Two compiler/aot/verification/vmflags tests fail by timeout with UseAVX=3
613 Goetz Lindenmaier SAP JDK-8236561 Add support for multiple look and feel for SwingSet SliderDemoTest
613 Goetz Lindenmaier SAP JDK-8236560 Enable different look and feel tests in SwingSet3 demo test ToolTipDemoTest
613 Goetz Lindenmaier SAP JDK-8236559 add @file support to jaotc
613 Goetz Lindenmaier SAP JDK-8236558 [TESTBUG] runtime/NMT/MallocStressTest.java ran out of java heap
613 Goetz Lindenmaier SAP JDK-8236557 Enable different look and feels in SwingSet3 demo test InternalFrameDemoTest
613 Goetz Lindenmaier SAP JDK-8236556 Enable different look and feels in SwingSet3 demo test SplitPaneDemoTest
613 Christoph Langer SAP JDK-8236553 Improve iteration over non-JavaThreads
614 Goetz Lindenmaier SAP JDK-8236550 Contents/MacOS/libjli.dylib cannot be a symlink
614 Goetz Lindenmaier SAP JDK-8236549 Enable macOS codesigning for all libraries and executables
616 Goetz Lindenmaier SAP JDK-8236529 Some improvements in the EditorPaneDemotest
616 Goetz Lindenmaier SAP JDK-8236528 Create test for SwingSet3 EditorPaneDemo
616 Goetz Lindenmaier SAP JDK-8236527 Increase timeout value in all tests under jdk/sanity/client/SwingSet/src
616 Goetz Lindenmaier SAP JDK-8236526 Java does not render Myanmar script correctly
616 Goetz Lindenmaier SAP JDK-8236525 Docked MacBook cannot start any Java Swing applications
616 Goetz Lindenmaier SAP JDK-8236524 Memory leak due to vtable stubs not being shared on SPARC
616 Goetz Lindenmaier SAP JDK-8236523 improve handling exception in requires.VMProps
617 Goetz Lindenmaier SAP JDK-8236503 Supporting keys created with certmgr.exe
617 Goetz Lindenmaier SAP JDK-8236502 Refactoring existing SunMSCAPI classes
619 Goetz Lindenmaier SAP JDK-8236482 Enable different look and feel tests in SwingSet3 demo tests
619 Goetz Lindenmaier SAP JDK-8236481 Create test for FileChooserDemo
619 Goetz Lindenmaier SAP JDK-8236480 Create test for SwingSet3 FrameDemo
619 Goetz Lindenmaier SAP JDK-8236479 Enable testing for all the available look and feels in SwingSet3 demo tests
619 Goetz Lindenmaier SAP JDK-8236478 Create a test for SwingSet3 ToolTipDemo
619 Goetz Lindenmaier SAP JDK-8236477 Create a test for SwingSet3 InternalFrameDemo
619 Goetz Lindenmaier SAP JDK-8236476 Synchronize test/jdk/sanity/client/lib/jemmy with code-tools/jemmy/v2
619 Goetz Lindenmaier SAP JDK-8236475 Synchronize test/jdk/sanity/client/lib/jemmy with code-tools/jemmy/v2
620 Christoph Langer SAP JDK-8236447 Syntax error in toolchain_windows.m4
620 Christoph Langer SAP JDK-8236433 Allow NamedThreads to use GlobalCounter critical sections
620 Matthias Baesken SAP JDK-8236404 add OS uptime information to os::print_os_info output
620 Matthias Baesken SAP JDK-8236403 check ZALLOC return values in awt coding
621 Goetz Lindenmaier SAP JDK-8236262 sun/security/mscapi/PrngSlow.java fails with Still too slow
621 Goetz Lindenmaier SAP JDK-8236261 javax/net/ssl/compatibility/Compatibility.java supports TLS 1.3
621 Goetz Lindenmaier SAP JDK-8236260 Avoid native memory allocation in sun.security.mscapi.PRNG.generateSeed
621 Goetz Lindenmaier SAP JDK-8236258 UnsatisfiedLinkError or NoSuchAlgorithmException after removing sunec.dll
621 Goetz Lindenmaier SAP JDK-8236257 Further cleanup to test serviceability/sa/ClhsdbCDSCore.java
621 Goetz Lindenmaier SAP JDK-8236256 hs test serviceability/sa/ClhsdbCDSCore.java fails on macOS 10.15
621 Goetz Lindenmaier SAP JDK-8236255 Add Amazon Root CA certificates
621 Goetz Lindenmaier SAP JDK-8236247 requires.VMProps throws NPE for missing properties in "release" file
623 Goetz Lindenmaier SAP JDK-8236079 re-building fails after changing Graal sources
623 Goetz Lindenmaier SAP JDK-8236078 jdk.internal.vm.compiler.management service providers missing in module descriptor
624 Paul Hohensee Amazon JDK-8236027 Conversion of milliseconds to nanoseconds in UNIXProcess contains bug.
627 Paul Hohensee Amazon JDK-8235923 JTabbedPane preferred size calculation is wrong for SCROLL_TAB_LAYOUT
627 Christoph Langer SAP JDK-8235471 Hide the onjcmd option from the help output
627 Christoph Langer SAP JDK-8235470 Adjust permission for delayed starting of debugging
627 Christoph Langer SAP JDK-8235910 serviceability/sa/ClhsdbCDSCore.java failed with java.lang.Error: Couldn't find core file location in:
627 Andrew Brygin Azul JDK-8235902 Update Apache Santuario (XML Signature) to version 2.1.4
627 Christoph Langer SAP JDK-8235901 build failure on Linux after 8235243
627 Christoph Langer SAP JDK-8235478 handle VS2017 15.9 and VS2019 in abstract_vm_version
627 Christoph Langer SAP JDK-8235899 replace JLI_StrTok in java_md_solinux.c
627 Christoph Langer SAP JDK-8235898 NULL-check return value of SurfaceData_InitOps on macosx
628 Matthias Baesken SAP JDK-8235832 fix minimal VM build on Linux ppc64(le)
628 Matthias Baesken SAP JDK-8235830 enhance os::get_core_path on macOS
628 Goetz Lindenmaier SAP JDK-8235816 [TESTBUG] TestDivZeroCheckControl fails for client VMs due to Unrecognized VM option LoopUnrollLimit
630 Goetz Lindenmaier SAP JDK-8235664 java/awt/Focus/NoAutotransferToDisabledCompTest/NoAutotransferToDisabledCompTest.java fails linux-x64
630 Goetz Lindenmaier SAP JDK-8235663 test/jdk/java/awt/Focus/ModalExcludedWindowClickTest/ModalExcludedWindowClickTest.java fails on linux-x64
630 Goetz Lindenmaier SAP JDK-8235662 java/awt/print/PrinterJob/LandscapeStackOverflow.java may hang
630 Goetz Lindenmaier SAP JDK-8235661 java/awt/Focus/ShowFrameCheckForegroundTest/ShowFrameCheckForegroundTest.java fails in Windows 10
630 Goetz Lindenmaier SAP JDK-8235660 java/math/BigInteger/SymmetricRangeTests.java fails with ParseException
630 Goetz Lindenmaier SAP JDK-8235659 [macos] In Aqua L&F backspace key does not delete when Shift is pressed
630 Goetz Lindenmaier SAP JDK-8235658 Upgrade IANA Language Subtag Registry to the latest for JDK14
630 Goetz Lindenmaier SAP JDK-8235657 compiler/jvmci/compilerToVM/IsCompilableTest.java timed out
630 Goetz Lindenmaier SAP JDK-8235656 test/jdk/sanity/client/SwingSet/src/ColorChooserDemoTest.java failed
630 Goetz Lindenmaier SAP JDK-8235652 Object monitor deadlock with no threads holding the monitor (using jemalloc 5.1)
630 Goetz Lindenmaier SAP JDK-8235651 [AOT] TEST_OPTS_AOT_MODULES doesn't work on mac
630 Goetz Lindenmaier SAP JDK-8235650 Filter out VM flags which don't affect AOT code generation
630 Goetz Lindenmaier SAP JDK-8235649 [AOT] Update test batch definitions to include aot-ed java.base module mode into hs-comp testing
630 Goetz Lindenmaier SAP JDK-8235648 Problem list tests which times out in Xcomp mode
631 Martin Doerr SAP JDK-8235576 [ntintel] asserts about copying unaligned array
631 Goetz Lindenmaier SAP JDK-8235575 java/nio/channels/Selector/SelectWithConsumer.java failed at testTwoChannels()
631 Goetz Lindenmaier SAP JDK-8235574 vmTestbase/metaspace/stressDictionary/StressDictionary.java timeout
632 Fei Yang Huawei JDK-8235546 aarch64: remove unnecessary load of mdo when profiling return and parameters type
632 Fei Yang Huawei JDK-8235545 infinite recursion while checking super class
634 Jiangli Zhou Google JDK-8235508 Undefined reference to os::write after JDK-8209657 (filemap.hpp cleanup)
634 Jiangli Zhou Google JDK-8235509 Refactor filemap.hpp to simplify integration with Serviceability Agent
634 Jiangli Zhou Google JDK-8235507 CDS runtime classpath checking is too strict when only classes from the system modules are archived
634 Jiangli Zhou Google JDK-8235506 SIGSEGV in WalkOopAndArchiveClosure::do_oop_work
634 Severin Gehwolf Red Hat JDK-8235494 (fs) Files.write can leak file descriptor in the exception case
634 Christoph Langer SAP JDK-8235468 [Testbug] vmTestbase/nsk/jdi/ObjectReference/referringObjects/referringObjects002/referringObjects002.java fails with unexpected size of ClassLoaderReference.referringObjects
634 Yuri Nesterenko Azul JDK-8235465 AssertionError in DeferredAttr at setOverloadKind
635 Goetz Lindenmaier SAP JDK-8235420 Create automated test for SwingSet ColorChooserDemoTest
635 Goetz Lindenmaier SAP JDK-8235419 [AOT] compiler/intrinsics/bigInteger/TestMulAdd.java crashed with AOT enabled
635 Goetz Lindenmaier SAP JDK-8235418 Test8004741.java failed due to "Too few ThreadDeath hits; expected at least 6 but saw only 5"
635 Goetz Lindenmaier SAP JDK-8235417 Fix for JDK-8214578 breaks OS X 10.12 compatibility
635 Goetz Lindenmaier SAP JDK-8235416 [macos] Problem with backslashes on macOS/JIS keyboard: Java ignores system settings
635 Goetz Lindenmaier SAP JDK-8235415 [TestBug] Tests test/jdk/javax/swing/LookAndFeel/8145547/DemandGTK2.sh and DemandGTK3.sh fail on Ubuntu 18.04 LTS
635 Goetz Lindenmaier SAP JDK-8235412 JDK-8193255 backport broke bootstrap with JDK 10
635 Goetz Lindenmaier SAP JDK-8235411 ARM32: C1: PatchingStub for field access: not enough bytes
637 Dmitry Cherepanov Azul JDK-8235261 Deadlock with ClassLoader.findLibrary and System.loadLibrary call
637 Goetz Lindenmaier SAP JDK-8235236 [JVMCI] AllocateCompileIdTest.java failed to find DiagnosticCommand.class
637 Goetz Lindenmaier SAP JDK-8235235 [AOT] jdwp test cases are failing with error # ERROR: TEST FAILED: Cought IOException while receiving event packet: # ERROR: java.net.SocketTimeoutException: Read timed out
637 Goetz Lindenmaier SAP JDK-8235234 [AOT] breakpoint events are generated in different threads does not meet expected count when testcase vm/jvmti/Breakpoint/brkp001/brkp00102/brkp00102.html is executed
637 Goetz Lindenmaier SAP JDK-8235233 [AOT] Unexpected number of references for JVMTI_HEAP_REFERENCE_CONSTANT_POOL [111-->111]: 0 (expected at least 1)
637 Goetz Lindenmaier SAP JDK-8235232 compiler/jvmci/events/JvmciNotifyInstallEventTest.java failed with "Got unexpected event count after 2nd install attempt: expected 9 to equal 2"
637 Goetz Lindenmaier SAP JDK-8235231 nsk/jvmti/IterateThroughHeap/filter-* are broken
637 Goetz Lindenmaier SAP JDK-8235230 PKCS11 regression regarding checkKeySize
641 Goetz Lindenmaier SAP JDK-8235134 10 vmTestbase/nsk/jdi tests timed out when running with jtreg
641 Goetz Lindenmaier SAP JDK-8235133 [AOT] bug with multiple class loaders
641 Goetz Lindenmaier SAP JDK-8235132 gc/TestAllocateHeapAtMultiple.java fail with Agent 7 timed out
641 Goetz Lindenmaier SAP JDK-8235131 javax/swing/JSplitPane/4816114/bug4816114.java: The divider location is wrong
641 Matthias Baesken SAP JDK-8235130 check malloc/calloc results in java.desktop
641 Goetz Lindenmaier SAP JDK-8235129 Test javax/swing/GroupLayout/6613904/bug6613904.java is unstable
641 Goetz Lindenmaier SAP JDK-8235128 Test javax/swing/JColorChooser/Test6199676.java fails in mach5
641 Goetz Lindenmaier SAP JDK-8235127 javax/swing/JEditorPane/5076514/bug5076514.java fails
641 Goetz Lindenmaier SAP JDK-8235126 javax/swing/JInternalFrame/Test6325652.java fails
641 Goetz Lindenmaier SAP JDK-8235125 Regression automated test 'open/test/jdk/javax/swing/JInternalFrame/8145896/TestJInternalFrameMaximize.java' fails
641 Goetz Lindenmaier SAP JDK-8235123 java/awt/dnd/ImageTransferTest/ImageTransferTest.java fails for JFIF
641 Goetz Lindenmaier SAP JDK-8235122 jvmci/compilerToVM/MaterializeVirtualObjectTest.java fails with -XX:-EliminateAllocations
641 Goetz Lindenmaier SAP JDK-8235121 [AOT] NullPointerException in compiler/whitebox/GetCodeHeapEntriesTest.java
641 Goetz Lindenmaier SAP JDK-8235120 [TEST_BUG] Test javax/swing/plaf/basic/BasicMenuUI/4983388/bug4983388.java fails with shortcuts on menus do not work
642 Severin Gehwolf Red Hat JDK-8234972 JTreg Failure: serviceability/sa/ClhsdbJstack.java causes NPE
642 Martin Doerr SAP JDK-8234970 CriticalJNINatives: dll handling should be done in native thread state
642 Martin Doerr SAP JDK-8234969 NativeLookup::lookup_critical_entry() should only load shared library once
643 Goetz Lindenmaier SAP JDK-8234895 Fix for JDK-8032832 caused a deadlock
643 Goetz Lindenmaier SAP JDK-8234340 Bump update version for OpenJDK: jdk-11.0.7

No changesets log

JDK-8223671 The latest Java 8 is not ready to use in applications on future macOS versions

Committer push log

Andrew Hughes, Red Hat

Bug Summary
JDK-8242743 (bf) Heap buffer state changes could provoke unexpected exceptions
JDK-8238456 AArch64: fix warnings and errors with Clang and GCC 8.3
JDK-8242753 Add support for generating compile_commands.json
JDK-8242757 Add Visual Studio Code workspace generation support (for native code)
JDK-8242750 Event descriptions are truncated in logs
JDK-8242749 FLAGS_COMPILER_CHECK_ARGUMENTS doesn't handle cross-compilation
JDK-8242759 java/util/Arrays/TimSortStackSize2.java times out with fastdebug build
JDK-8237387 JSSE Client does not accept status_request extension in CertificateRequest messages for TLS 1.3
JDK-8242761 make 4.3 breaks build
JDK-8242756 Refactor CacheFind
JDK-8242751 Setting of THIS_FILE in the build is broken
JDK-8242754 Speed up incremental rerun of "make hotspot"
JDK-8242752 Use of THIS_FILE in hotspot invalidates precompiled header on Linux/GCC
JDK-8242758 Various minor fixes
JDK-8242755 Windows incremental build is broken with JDK-8217728

Andrew Haley, @littlepinkcloud.com

Bug Summary
JDK-8241501 Segfault in JNIHandleBlock::oops_do()

Andrew Brygin, Azul

Bug Summary
JDK-8235902 Update Apache Santuario (XML Signature) to version 2.1.4

Christoph Langer, SAP

Bug Summary
JDK-8238597 [macos] NPE was thrown at expanding Choice from maximized frame
JDK-8241198 [TESTBUG] appcds/CommandLineFlagComboNegative.java does not handle archive mapping failure
JDK-8235468 [Testbug] vmTestbase/nsk/jdi/ObjectReference/referringObjects/referringObjects002/referringObjects002.java fails with unexpected size of ClassLoaderReference.referringObjects
JDK-8239340 ActionListeners on JRadioButtons don't get notified when selection is changed with arrow keys
JDK-8235470 Adjust permission for delayed starting of debugging
JDK-8237907 Algorithmic Italic font leans opposite angle in Printing
JDK-8236433 Allow NamedThreads to use GlobalCounter critical sections
JDK-8235901 build failure on Linux after 8235243
JDK-8239820 Deep sign macOS bundles before bundle archive is being created
JDK-8238618 exclude jtreg test security/infra/java/security/cert/CertPathValidator/certification/LuxTrustCA.java because of instabilities
JDK-8236712 FSInfo#getJarClassPath throws an exception not declared in its throws clause
JDK-8236711 Garbage collectors should register JFR types themselves to avoid build errors.
JDK-8235478 handle VS2017 15.9 and VS2019 in abstract_vm_version
JDK-8235471 Hide the onjcmd option from the help output
JDK-8239075 Improperly use of the Optional API
JDK-8236553 Improve iteration over non-JavaThreads
JDK-8237903 Incorrect method tag offset for big endian platform
JDK-8238772 Issues reported after replacing symlink at Contents/MacOS/libjli.dylib with binary
JDK-8240288 java/nio/channels/SocketChannel/AdaptSocket.java fails on Windows 10
JDK-8236713 Javac treats Manifest Class-Path entries as Paths instead of URLs
JDK-8238614 jdi/EventQueue/remove/remove004 failed due to "ERROR: thread2 is not alive"
JDK-8238616 jdi/EventQueue/remove/remove004 fails due to VMDisconnectedException
JDK-8238615 jdi/EventQueue/remove_l/remove_l004 failed due to "TIMEOUT while waiting for event"
JDK-8236581 JFR calls virtual is_Java_thread from ~Thread()
JDK-8239466 Loss of precision in counter decay calculation in 11u backport of JDK-8237375
JDK-8238864 Missing constant pool entry for a method in stacktrace
JDK-8235898 NULL-check return value of SurfaceData_InitOps on macosx
JDK-8237902 OldObjectSample event creates unexpected amount of checkpoint data
JDK-8239076 ProblemList java/lang/invoke/VarHandles tests
JDK-8239077 ProblemList java/lang/reflect/PublicMethods/PublicMethodsTest.java
JDK-8239341 Problemlist SA tests with AOT
JDK-8237760 Refactor some com.sun.jdi tests to enable IDE integration
JDK-8236618 Rename vm_operations.?pp files to vmOperations.?pp files
JDK-8235899 replace JLI_StrTok in java_md_solinux.c
JDK-8235910 serviceability/sa/ClhsdbCDSCore.java failed with java.lang.Error: Couldn't find core file location in:
JDK-8239078 SimpleThresholdPolicy misses CounterDecay timestamp initialization
JDK-8239144 SocketListeningConnector does not allow invocations with port 0
JDK-8239339 Some serviceability/sa/ tests intermittently fail with java.io.IOException: LingeredApp terminated with non-zero exit code 3
JDK-8238619 sunmscapi.dll causing EXCEPTION_ACCESS_VIOLATION
JDK-8238771 Support for configure option --with-native-debug-symbols=internal is impossible on Windows
JDK-8236447 Syntax error in toolchain_windows.m4
JDK-8237904 TestMetadataRetention fails due to missing symbol id
JDK-8238865 Update arm devkits with libXrandr headers
JDK-8240880 Update test documentation with additional settings for client UI tooltip tests
JDK-8237759 Visual Studio install found through --with-tools-dir value is discarded
JDK-8236500 Windows ucrt.dll should be looked up in versioned WINSDK subdirectory

Dmitry Cherepanov, Azul

Bug Summary
JDK-8235261 Deadlock with ClassLoader.findLibrary and System.loadLibrary call

Fei Yang, Huawei

Bug Summary
JDK-8235546 aarch64: remove unnecessary load of mdo when profiling return and parameters type
JDK-8235545 infinite recursion while checking super class

Goetz Lindenmaier, SAP

Bug Summary
JDK-8235134 10 vmTestbase/nsk/jdi tests timed out when running with jtreg
JDK-8238529 2019-09-28 public suffix list update
JDK-8235234 [AOT] breakpoint events are generated in different threads does not meet expected count when testcase vm/jvmti/Breakpoint/brkp001/brkp00102/brkp00102.html is executed
JDK-8235133 [AOT] bug with multiple class loaders
JDK-8235419 [AOT] compiler/intrinsics/bigInteger/TestMulAdd.java crashed with AOT enabled
JDK-8235235 [AOT] jdwp test cases are failing with error # ERROR: TEST FAILED: Cought IOException while receiving event packet: # ERROR: java.net.SocketTimeoutException: Read timed out
JDK-8235121 [AOT] NullPointerException in compiler/whitebox/GetCodeHeapEntriesTest.java
JDK-8236583 [AOT] Problem list serviceability/sa tests failed with AOTed java.base
JDK-8235651 [AOT] TEST_OPTS_AOT_MODULES doesn't work on mac
JDK-8235233 [AOT] Unexpected number of references for JVMTI_HEAP_REFERENCE_CONSTANT_POOL [111-->111]: 0 (expected at least 1)
JDK-8235649 [AOT] Update test batch definitions to include aot-ed java.base module mode into hs-comp testing
JDK-8237332 [C2] Memory leaks during tracing after "8224193: stringStream should not use Resource Area".
JDK-8236765 [Containers] Improve systemd slice memory limit support
JDK-8236574 [Graal] compiler/jvmci/compilerToVM/IsMatureVsReprofileTest.java fails with -XX:CompileThresholdScaling=0.1
JDK-8235236 [JVMCI] AllocateCompileIdTest.java failed to find DiagnosticCommand.class
JDK-8235659 [macos] In Aqua L&F backspace key does not delete when Shift is pressed
JDK-8235416 [macos] Problem with backslashes on macOS/JIS keyboard: Java ignores system settings
JDK-8235120 [TEST_BUG] Test javax/swing/plaf/basic/BasicMenuUI/4983388/bug4983388.java fails with shortcuts on menus do not work
JDK-8238528 [TESTBUG] appcds/SharedArchiveConsistency timed out
JDK-8237509 [TESTBUG] Bugs in runtime/NMT/MallocStressTest.java
JDK-8236577 [TESTBUG] compiler/aot/fingerprint/SelfChangedCDS.java fails when cds is disabled
JDK-8236774 [TESTBUG] Problemlist JFR compiler/TestCodeSweeper.java
JDK-8236775 [TESTBUG] problemlist JFR TestLargeRootSet.java
JDK-8236558 [TESTBUG] runtime/NMT/MallocStressTest.java ran out of java heap
JDK-8237511 [TESTBUG] runtime/NMT/MallocStressTest.java timed out
JDK-8235816 [TESTBUG] TestDivZeroCheckControl fails for client VMs due to Unrecognized VM option LoopUnrollLimit
JDK-8235415 [TestBug] Tests test/jdk/javax/swing/LookAndFeel/8145547/DemandGTK2.sh and DemandGTK3.sh fail on Ubuntu 18.04 LTS
JDK-8236559 add @file support to jaotc
JDK-8236255 Add Amazon Root CA certificates
JDK-8236564 Add intermittent test in the JavaSound to the ProblemList
JDK-8236585 Add key exchange algorithm to javax/net/ssl/TLSCommon/CipherSuite.java
JDK-8236561 Add support for multiple look and feel for SwingSet SliderDemoTest
JDK-8235411 ARM32: C1: PatchingStub for field access: not enough bytes
JDK-8236260 Avoid native memory allocation in sun.security.mscapi.PRNG.generateSeed
JDK-8234340 Bump update version for OpenJDK: jdk-11.0.7
JDK-8236566 ButtonDemoScreenshotTest fails randomly with "still state to be reached"
JDK-8235657 compiler/jvmci/compilerToVM/IsCompilableTest.java timed out
JDK-8235232 compiler/jvmci/events/JvmciNotifyInstallEventTest.java failed with "Got unexpected event count after 2nd install attempt: expected 9 to equal 2"
JDK-8236550 Contents/MacOS/libjli.dylib cannot be a symlink
JDK-8236588 Correct the format of ColorChooserDemoTest
JDK-8236477 Create a test for SwingSet3 InternalFrameDemo
JDK-8236478 Create a test for SwingSet3 ToolTipDemo
JDK-8235420 Create automated test for SwingSet ColorChooserDemoTest
JDK-8236481 Create test for FileChooserDemo
JDK-8236528 Create test for SwingSet3 EditorPaneDemo
JDK-8236480 Create test for SwingSet3 FrameDemo
JDK-8236587 Curve in certificate should not affect signature scheme when using TLSv1.3
JDK-8236525 Docked MacBook cannot start any Java Swing applications
JDK-8236724 Enable different look and feel tests in SwingSet3 demo test FileChooserDemoTest
JDK-8236560 Enable different look and feel tests in SwingSet3 demo test ToolTipDemoTest
JDK-8236482 Enable different look and feel tests in SwingSet3 demo tests
JDK-8236557 Enable different look and feels in SwingSet3 demo test InternalFrameDemoTest
JDK-8236556 Enable different look and feels in SwingSet3 demo test SplitPaneDemoTest
JDK-8236549 Enable macOS codesigning for all libraries and executables
JDK-8236479 Enable testing for all the available look and feels in SwingSet3 demo tests
JDK-8236584 exclude compiler/intrinsics/sha/sanity tests from AOT runs
JDK-8235650 Filter out VM flags which don't affect AOT code generation
JDK-8234895 Fix for JDK-8032832 caused a deadlock
JDK-8235417 Fix for JDK-8214578 breaks OS X 10.12 compatibility
JDK-8236257 Further cleanup to test serviceability/sa/ClhsdbCDSCore.java
JDK-8235132 gc/TestAllocateHeapAtMultiple.java fail with Agent 7 timed out
JDK-8236764 GetOwnedMonitorInfoWithEATest.java fails with ZGC: Heap too small
JDK-8236575 giflib legal file is missing attribution for openbsd-reallocarray.c.
JDK-8236723 Handle different look and feels in JInternalFrameOperator
JDK-8236256 hs test serviceability/sa/ClhsdbCDSCore.java fails on macOS 10.15
JDK-8236523 improve handling exception in requires.VMProps
JDK-8237334 Improve performance of ThreadMXBean.getThreadInfo(long ids[], int maxDepth)
JDK-8236589 Improve version string for Oracle CI builds
JDK-8236527 Increase timeout value in all tests under jdk/sanity/client/SwingSet/src
JDK-8236526 Java does not render Myanmar script correctly
JDK-8235123 java/awt/dnd/ImageTransferTest/ImageTransferTest.java fails for JFIF
JDK-8235664 java/awt/Focus/NoAutotransferToDisabledCompTest/NoAutotransferToDisabledCompTest.java fails linux-x64
JDK-8235661 java/awt/Focus/ShowFrameCheckForegroundTest/ShowFrameCheckForegroundTest.java fails in Windows 10
JDK-8235662 java/awt/print/PrinterJob/LandscapeStackOverflow.java may hang
JDK-8235660 java/math/BigInteger/SymmetricRangeTests.java fails with ParseException
JDK-8235575 java/nio/channels/Selector/SelectWithConsumer.java failed at testTwoChannels()
JDK-8236563 javax/net/ssl/compatibility/Compatibility.java failed on some SNI cases
JDK-8236565 javax/net/ssl/compatibility/Compatibility.java should be more flexible
JDK-8236261 javax/net/ssl/compatibility/Compatibility.java supports TLS 1.3
JDK-8235127 javax/swing/JEditorPane/5076514/bug5076514.java fails
JDK-8235126 javax/swing/JInternalFrame/Test6325652.java fails
JDK-8235131 javax/swing/JSplitPane/4816114/bug4816114.java: The divider location is wrong
JDK-8236590 jdk-13+20 bundle name contains null instead of ea
JDK-8235412 JDK-8193255 backport broke bootstrap with JDK 10
JDK-8236078 jdk.internal.vm.compiler.management service providers missing in module descriptor
JDK-8236571 JInternalFrame : java.lang.AssertionError: cannot find the internal frame
JDK-8238527 JVM fails to detect mismatched or corrupt CDS archive
JDK-8235122 jvmci/compilerToVM/MaterializeVirtualObjectTest.java fails with -XX:-EliminateAllocations
JDK-8237333 Linux os::available_memory re-reads cgroup configuration on every invocation
JDK-8237324 Malformed copyright year range in a few files in java.base
JDK-8236524 Memory leak due to vtable stubs not being shared on SPARC
JDK-8236768 new sun.misc.Signal("INFO") throws IllegalArgumentException since JDK11
JDK-8235231 nsk/jvmti/IterateThroughHeap/filter-* are broken
JDK-8235652 Object monitor deadlock with no threads holding the monitor (using jemalloc 5.1)
JDK-8235230 PKCS11 regression regarding checkKeySize
JDK-8235648 Problem list tests which times out in Xcomp mode
JDK-8236079 re-building fails after changing Graal sources
JDK-8236776 Reduce the timeout of tooltip in SwingSet2DemoTest
JDK-8236502 Refactoring existing SunMSCAPI classes
JDK-8235125 Regression automated test 'open/test/jdk/javax/swing/JInternalFrame/8145896/TestJInternalFrameMaximize.java' fails
JDK-8236972 Replace wildcard address with loopback or local host in tests - part 14
JDK-8236761 Replace wildcard address with loopback or local host in tests - part 6
JDK-8236247 requires.VMProps throws NPE for missing properties in "release" file
JDK-8236586 RunTest documentation and usability update
JDK-8236773 RunTest sometimes fails to produce valid exitcode.txt
JDK-8237510 runtime/NMT/MallocStressTest.java timed out
JDK-8236763 Should disable Escape Analysis if JVMTI capability can_get_owned_monitor_info was taken
JDK-8236576 SignedObject with invalid Key not throwing the InvalidKeyException in Windows
JDK-8236529 Some improvements in the EditorPaneDemotest
JDK-8236767 Some tests in serviceability/sa run with fixed -Xmx values and risk running out of memory
JDK-8236262 sun/security/mscapi/PrngSlow.java fails with Still too slow
JDK-8236760 SunMSCAPI keys are not cleaned up
JDK-8240727 SuperWord::co_locate_pack picks memory state of first instead of last load
JDK-8236570 Support CNG RSA keys
JDK-8236503 Supporting keys created with certmgr.exe
JDK-8236476 Synchronize test/jdk/sanity/client/lib/jemmy with code-tools/jemmy/v2
JDK-8235129 Test javax/swing/GroupLayout/6613904/bug6613904.java is unstable
JDK-8235128 Test javax/swing/JColorChooser/Test6199676.java fails in mach5
JDK-8236573 test/jdk/demo/jfc/J2Ddemo/J2DdemoTest.java cannot find J2Ddemo.jar
JDK-8235663 test/jdk/java/awt/Focus/ModalExcludedWindowClickTest/ModalExcludedWindowClickTest.java fails on linux-x64
JDK-8235656 test/jdk/sanity/client/SwingSet/src/ColorChooserDemoTest.java failed
JDK-8235418 Test8004741.java failed due to "Too few ThreadDeath hits; expected at least 6 but saw only 5"
JDK-8236572 Tests that need to be problem-listed or have printer resources
JDK-8236562 Two compiler/aot/verification/vmflags tests fail by timeout with UseAVX=3
JDK-8236258 UnsatisfiedLinkError or NoSuchAlgorithmException after removing sunec.dll
JDK-8235658 Upgrade IANA Language Subtag Registry to the latest for JDK14
JDK-8236777 Use utility APIs introduced in org/netbeans/jemmy/util/LookAndFeel class in client sanity test cases
JDK-8235574 vmTestbase/metaspace/stressDictionary/StressDictionary.java timeout

Jiangli Zhou, Google

Bug Summary
JDK-8238392 ArchivedKlassSubGraphInfoRecord is incomplete
JDK-8235507 CDS runtime classpath checking is too strict when only classes from the system modules are archived
JDK-8238250 Make CDS archived heap regions usable even if compressed oop encoding has changed
JDK-8235509 Refactor filemap.hpp to simplify integration with Serviceability Agent
JDK-8238701 runtime/appcds/cacheObject/DifferentHeapSizes.java crash
JDK-8235506 SIGSEGV in WalkOopAndArchiveClosure::do_oop_work
JDK-8235508 Undefined reference to os::write after JDK-8209657 (filemap.hpp cleanup)

Matthias Baesken, SAP

Bug Summary
JDK-8240525 (zipfs) Updating an existing zip file does not preserve original permissions
JDK-8240183 [macos 10.15] java/awt/Window/LocationAtScreenCorner/LocationAtScreenCorner.java may fail
JDK-8240182 [macos 10.15] Windows in fullscreen tests jumps around the screen
JDK-8240365 [macosx] Two apostrophes are entered instead of one with "U.S. International - PC" layout
JDK-8240724 [test] jdk11 downport of 8224475 misses binary file test/jdk/javax/swing/JTextPane/arrow.png
JDK-8240367 Access Bridge lacks html tags parsing
JDK-8236404 add OS uptime information to os::print_os_info output
JDK-8237335 add some initializations using sigemptyset in os_aix.cpp
JDK-8239064 At step6,Click Add button,case failed automatically.
JDK-8239851 build broken when configured with --with-zlib=bundled on gcc 7.3
JDK-8235130 check malloc/calloc results in java.desktop
JDK-8236403 check ZALLOC return values in awt coding
JDK-8240186 Duplicate attribution in freetype.md
JDK-8239219 enable link-time section-gc for linux s390x to remove unused code
JDK-8235830 enhance os::get_core_path on macOS
JDK-8238848 enhance print_rlimit_info in os_posix
JDK-8235832 fix minimal VM build on Linux ppc64(le)
JDK-8236640 fix minimal VM build on Linux s390x
JDK-8237822 handle return values of sscanf calls in hotspot
JDK-8240946 javax/net/ssl/templates/SSLSocketSSLEngineTemplate.java fails intermittently with "java.lang.Exception: Unexpected EOF"
JDK-8240944 javax/net/ssl/templates/SSLSocketSSLEngineTemplate.java supports TLSv1.3
JDK-8240945 javax/net/ssl/TLS tests support TLSv1.3
JDK-8239063 JNI exception pending in DestroyXIMCallback of awt_InputMethod.c:1327
JDK-8240366 JTextPane does not show images in HTML rendering
JDK-8238849 NET_Writev is declared, NET_WriteV is defined
JDK-8239065 nsk/jdb/locals/locals002: ERROR: Cannot find boolVar with expected value: false
JDK-8238850 remove obsolete NET_ReadV
JDK-8238672 s390x - remove unused pd_zero_to_words_large
JDK-8236621 set relro in linker flags when building with gcc
JDK-8236620 stack is executable when building with Clang on Linux
JDK-8238671 struct SwitchRange in HS violates C++ One Definition Rule
JDK-8240184 Update CUP to v0.11b
JDK-8240368 Update GIFlib library to the 5.2.1
JDK-8240728 Update ProblemList.txt to exclude failing headful tests on macos
JDK-8240185 Upgrade to freetype 2.10.1
JDK-8237336 use more Posix functionality in aix os::print_os_info

Martin Balao, Red Hat

Bug Summary
JDK-8237476 Support cross-realm MSSFU
JDK-8237600 Test SunJSSEFIPSInit fails on Ubuntu

Martin Doerr, SAP

Bug Summary
JDK-8235576 [ntintel] asserts about copying unaligned array
JDK-8240740 [ntintel] asserts about copying unaligned array element
JDK-8237355 C1 register allocation failure with T_ADDRESS
JDK-8241428 com/sun/jndi/ldap/privconn/RunTest.java failed due to hang in LdapRequest.getReplyBer
JDK-8234970 CriticalJNINatives: dll handling should be done in native thread state
JDK-8237541 Missing files in backport of JDK-8209499
JDK-8237540 Missing files in backport of JDK-8210910
JDK-8234969 NativeLookup::lookup_critical_entry() should only load shared library once
JDK-8237478 Test failed to resume JVMCI CompilerThread

Mario Torre, Red Hat

Bug Summary
JDK-8237381 freetype seeks to index at the end of the font data
JDK-8238754 Infinite loop when rendering huge lines

Paul Hohensee, Amazon

Bug Summary
JDK-8237893 (zipfs) Potential memory leak with zip provider
JDK-8237892 AVX 512 instructions inadvertently used on Xeon for small vector width operations
JDK-8236027 Conversion of milliseconds to nanoseconds in UNIXProcess contains bug.
JDK-8239246 java.security.Provider#getServices order is no longer deterministic
JDK-8239247 java.security.Provider.getService returns random result due to race condition with mutating methods in the same class
JDK-8238396 java.security.Provider.getService() is synchronized and became scalability bottleneck
JDK-8235923 JTabbedPane preferred size calculation is wrong for SCROLL_TAB_LAYOUT
JDK-8237828 SUNPKCS11 Provider incorrectly check key length for PSS Signatures.
JDK-8236684 Turkey Time Zone returns incorrect time zone name
JDK-8237773 Update Mesa 3-D Headers to version 19.2.1
JDK-8237771 Worker has a deadlock bug

Roman Kennke, Red Hat

Bug Summary
JDK-8238632 cleanup arguments to PhaseIdealLoop() constructor
JDK-8237772 Refactor arraycopy_prologue to allow ZGC read barriers on arraycopy
JDK-8237251 ZGC: Broken oop map in C1 load barrier stub

Severin Gehwolf, Red Hat

Bug Summary
JDK-8235494 (fs) Files.write can leak file descriptor in the exception case
JDK-8236848 [JDK 11u] make run-test-tier1 fails after backport of JDK-8232834
JDK-8236185 Introduce a system property to disable eager lambda initialization
JDK-8234972 JTreg Failure: serviceability/sa/ClhsdbJstack.java causes NPE
JDK-8240453 NamingManager should cache InitialContextFactory

Aleksey Shipilev, Red Hat

Bug Summary
JDK-8239539 [TESTBUG] test/hotspot/jtreg/runtime/StackGuardPages/TestStackGuardPages.java: exeinvoke.c: must initialize static state before calling do_overflow()
JDK-8239847 Add a new test to verify that DatagramSocket is not interruptible
JDK-8240359 Add exception for expiring Comodo roots to VerifyCACerts test
JDK-8239542 Add exception for expiring DocuSign root to VerifyCACerts test
JDK-8239061 Allow 204 responses with Content-Length:0
JDK-8237810 Assert triggers with -XX:+StressReflectiveCode
JDK-8237796 assert(!VerifyHashTableKeys || _hash_lock == 0) failed: remove node from hash table before modifying it
JDK-8237519 assert(d->is_CFG() && n->is_CFG()) failed: must have CFG nodes
JDK-8239917 assert(false) failed: Bad graph detected in get_early_ctrl_for_expensive
JDK-8237520 assert(in_bb(n)) failed: must be
JDK-8237340 assert(mode == ControlAroundStripMined && (use == sfpt || !use->is_reachable_from_root())) failed: missed a node
JDK-8239057 AVX enabled by default for Skylake even when unsupported
JDK-8237339 C1 compilation fails with -XX:+PrintIRDuringConstruction -XX:+Verbose
JDK-8237338 C1: Incorrect result of field load due to missing narrowing conversion
JDK-8238540 C2: assert(con.basic_type() != T_ILLEGAL) failed: elembt=byte; loadbt=void; unsigned=0
JDK-8239545 C2: assert(i >= req() || i == 0 || is_Region() || is_Phi()) with -XX:+VerifyGraphEdges
JDK-8237337 C2: Memory stomp in max_array_length() for T_ILLEGAL type
JDK-8238747 Class loading deadlock involving X509Factory#commitEvent()
JDK-8237342 Crash in AdapterHandlerLibrary::get_adapter with CDS due to code cache exhaustion
JDK-8239058 CTW runner closes standard output on exit
JDK-8239059 CTW runner should sweep nmethods more aggressively
JDK-8239540 CTW: C2 compilation fails with assert(just_allocated_object(alloc_ctl) == ptr) failed: most recent allo
JDK-8239060 CTW: Split applications/ctw/modules/jdk_localedata.java
JDK-8239541 Duplicated synchronized keywords in SSLSocketImpl
JDK-8239222 Errors in alert ssl message does not reflect the actual certificate status
JDK-8239538 Hard coded loop limit prevents reading of smart card data greater than 8k
JDK-8237792 Improve the code coverage for ThreadLocal
JDK-8237345 Incorrect G1StringDedupEntry type used in StringDedupTable destructor
JDK-8237343 infinite loop in LogOutputList::wait_until_no_readers()
JDK-8237517 Intermittent NPE in Component.validate()
JDK-8238746 java.lang.Class.isPrimitive() (C1) returns wrong result if Klass* is aligned to 32bit
JDK-8237797 java.util.zip.CRC32 performance drop after 8200067
JDK-8237791 java/lang/ProcessBuilder/Basic.java#id1 failed with stream closed
JDK-8237790 java/lang/reflect/PublicMethods/PublicMethodsTest.java times out
JDK-8239848 java/net/DatagramPacket/ReuseBuf.java failed due to timeout
JDK-8238539 javadoc fails with ClassCastException on {@link byte[]}
JDK-8237788 jdk/internal/jimage/JImageOpenTest.java runs no test
JDK-8237344 JFR file without license header
JDK-8237341 loopTransform.cpp:2984: Error: assert(p_f->Opcode() == Op_IfFalse) failed
JDK-8238541 MaxVectorSize set wrongly when UseAVX=3 is specified after JDK-8221092
JDK-8237795 Missing -Xcheck:jni checking for DeleteWeakGlobalRef
JDK-8237518 Modifying ArrayList.subList().subList() resets modCount of subList
JDK-8237794 PIT: test/jdk/javax/swing/text/html/TestJLabelWithHTMLText.java times out in linux-x64
JDK-8237956 Problem with NullPointerException in RMI TCPEndpoint.read
JDK-8237793 Rendering HTML with empty img attribute and documentBaseKey cause Exception
JDK-8238748 Simplify JarFile.isInitializing
JDK-8237957 Test runtime/modules/getModuleJNI/GetModule fails with -Xcheck:jni
JDK-8238538 TestAbortVMOnSafepointTimeout.java failed due to "RuntimeException: 'Safepoint sync time longer than' missing from stdout/stderr"
JDK-8237789 tools/jimage/JImageExtractTest.java timed out
JDK-8238745 Update BCEL version to 6.3.1 in license file
JDK-8239221 Wrong file headers with 8202414 fix changeset

Thomas Stuefe, SAP

Bug Summary
JDK-8238531 Create new switch to redirect error reporting output to stdout or stderr

Yuri Nesterenko, Azul

Bug Summary
JDK-8235465 AssertionError in DeferredAttr at setOverloadKind

Yasumasa Suenaga, NTT DATA

Bug Summary
JDK-8236673 jhsdb jmap from OpenJDK 11.0.5 doesn't work if prelink is enabled

Zhengyu Gu, Red Hat

Bug Summary
JDK-8238767 (se) Stack overflow during selection operation leads to crash (win)