PUSHES REPORT: 11.0.9

This report shows who pushed the backports to the given release. This usually shows who did the backporting, testing, and review work.

Report generated: Wed Sep 01 03:31:07 CEST 2021

Distribution by priority

Count Priority
1 P1
30 P2
90 P3
110 P4
1 P5

Distribution by components

Count Component
232 Total
92 (39.7%) hotspot
32 (13.8%) hotspot/compiler
23 (9.9%) hotspot/runtime
17 (7.3%) hotspot/gc
7 (3.0%) hotspot/jfr
6 (2.6%) hotspot/svc-agent
4 (1.7%) hotspot/svc
2 (0.9%) hotspot/jvmti
1 (0.4%) hotspot
31 (13.4%) core-libs
7 (3.0%) core-libs/java.net
7 (3.0%) core-libs/javax.naming
4 (1.7%) core-libs/java.nio
3 (1.3%) core-libs
3 (1.3%) core-libs/java.util:i18n
2 (0.9%) core-libs/java.nio.charsets
2 (0.9%) core-libs/java.lang
1 (0.4%) core-libs/java.rmi
1 (0.4%) core-libs/java.math
1 (0.4%) core-libs/java.text
31 (13.4%) security-libs
16 (6.9%) security-libs/java.security
9 (3.9%) security-libs/javax.net.ssl
2 (0.9%) security-libs/org.ietf.jgss:krb5
1 (0.4%) security-libs/javax.smartcardio
1 (0.4%) security-libs/javax.security
1 (0.4%) security-libs/javax.crypto:pkcs11
1 (0.4%) security-libs/javax.crypto
26 (11.2%) core-svc
18 (7.8%) core-svc/debugger
5 (2.2%) core-svc/java.lang.management
2 (0.9%) core-svc/tools
1 (0.4%) core-svc/javax.management
20 (8.6%) tools
10 (4.3%) tools/jshell
6 (2.6%) tools/javac
2 (0.9%) tools/javadoc(tool)
1 (0.4%) tools/jar
1 (0.4%) tools/launcher
17 (7.3%) client-libs
6 (2.6%) client-libs/javax.swing
5 (2.2%) client-libs/2d
2 (0.9%) client-libs
2 (0.9%) client-libs/javax.imageio
1 (0.4%) client-libs/java.awt
1 (0.4%) client-libs/javax.accessibility
10 (4.3%) infrastructure
8 (3.4%) infrastructure/build
2 (0.9%) infrastructure
5 (2.2%) xml
3 (1.3%) xml/jaxp
1 (0.4%) xml/javax.xml.transform
1 (0.4%) xml/javax.xml.stream

Distribution by affiliation

Count Committer
232 Total
111 (47.8%) SAP
83 (35.8%) Goetz Lindenmaier
19 (8.2%) Matthias Baesken
8 (3.4%) Christoph Langer
1 (0.4%) Thomas Stuefe
91 (39.2%) Red Hat
62 (26.7%) Aleksey Shipilev
10 (4.3%) Andrew Hughes
7 (3.0%) Severin Gehwolf
4 (1.7%) Zhengyu Gu
3 (1.3%) Martin Balao
3 (1.3%) Roman Kennke
2 (0.9%) Roland Westrelin
10 (4.3%) Amazon
7 (3.0%) Paul Hohensee
3 (1.3%) Volker Simonis
6 (2.6%) NTT DATA
6 (2.6%) Yasumasa Suenaga
5 (2.2%) Huawei
5 (2.2%) Fei Yang
3 (1.3%) Azul
3 (1.3%) Vladimir Kempik
2 (0.9%) DataDog
2 (0.9%) Jaroslav Bachorík
1 (0.4%) Google
1 (0.4%) Jiangli Zhou
1 (0.4%) IBM
1 (0.4%) Ichiroh Takiguchi
1 (0.4%) Independent
1 (0.4%) Bernard Blaser
1 (0.4%) Twitter
1 (0.4%) Christian Thalinger

Chronological push log:

Days Ago Committer Affiliation Bug Summary
335 Goetz Lindenmaier SAP JDK-8253813 Backout JDK-8244287 from 11u: it causes several crashes
341 Paul Hohensee Amazon JDK-8253613 Provider.put no longer registering aliases in FIPS env
343 Jaroslav Bachorík DataDog JDK-8244287 JFR: Methods samples have line number 0
343 Christoph Langer SAP JDK-8253283 [11u] Test build/translations/VerifyTranslations.java failing after JDK-8252258
349 Paul Hohensee Amazon JDK-8253134 JMM_VERSION should remain at 0x20020000 (JDK 10) in JDK 11
352 Andrew Hughes Red Hat JDK-8252258 [11u] JDK-8242154 changes the default vendor
358 Volker Simonis Amazon JDK-8252804 [test] Fix 'ReleaseDeflater.java' test after downport of 8234011
362 Goetz Lindenmaier SAP JDK-8252751 Fix exception message to correctly represent LDAP connection failure
364 Aleksey Shipilev Red Hat JDK-8252632 [TEST BUG] javax/swing/text/html/parser/Test8017492.java fails
364 Christoph Langer SAP JDK-8252631 com/sun/jndi/ldap/LdapTimeoutTest.java failed due to timeout on DeadServerNoTimeoutTest is incorrect
364 Goetz Lindenmaier SAP JDK-8252623 Upgrade to jQuery 3.5.1
364 Christoph Langer SAP JDK-8252622 javac cannot find non-ASCII module name under non-UTF8 environment
364 Christoph Langer SAP JDK-8252621 java --describe-module failed with non-ASCII module name under non-UTF8 environment
364 Christoph Langer SAP JDK-8252620 Cross compilation fails due to missing CFLAGS for the BUILD_CC
365 Martin Balao Red Hat JDK-8252579 Revert Principal Name type to NT-UNKNOWN when requesting TGS Kerberos tickets
365 Christoph Langer SAP JDK-8251344 Add capability to custom resolve host/domain names within the default JNDI LDAP provider
365 Goetz Lindenmaier SAP JDK-8252560 com.sun.jndi.ldap.EventSupport.removeDeadNotifier: java.lang.NullPointerException
368 Volker Simonis Amazon JDK-8252503 Initialize the bytes left for the heap sampler
368 Aleksey Shipilev Red Hat JDK-8252488 vmTestbase/nsk/jvmti/scenarios/allocation/AP10/ap10t001/TestDescription.java failed with ObjectFree: GetCurrentThreadCpuTimerInfo returned unexpected error code
369 Paul Hohensee Amazon JDK-8252157 JDK-8231209 11u backport breaks jmm binary compatibility
369 Yasumasa Suenaga NTT DATA JDK-8252454 JFrame::setVisible crashed with -Dfile.encoding=UTF-8 on Japanese Windows.
369 Zhengyu Gu Red Hat JDK-8251487 Shenandoah: missing detail timing tracking for final mark cleaning phase
369 Zhengyu Gu Red Hat JDK-8252450 Update MUSCLE PC/SC-Lite headers to the latest release 1.8.26
369 Aleksey Shipilev Red Hat JDK-8252444 Circular reference in printed stack trace is not correctly indented & ambiguous
369 Aleksey Shipilev Red Hat JDK-8252443 CTW: C2 (Shenandoah) compilation fails with SEGV in SBC2Support::pin_and_expand
369 Aleksey Shipilev Red Hat JDK-8252442 com/sun/jdi/DeferredStepTest.java: jj1 (line 57) - unexpected. lastLine=52, minLine=52, maxLine=55
369 Aleksey Shipilev Red Hat JDK-8252441 [TEST] wrong breakpoint in test/jdk/com/sun/jdi/DeferredStepTest
369 Aleksey Shipilev Red Hat JDK-8252440 [TEST] convert com/sun/jdi/DeferredStepTest.sh test
369 Aleksey Shipilev Red Hat JDK-8252439 [TEST] test/jdk/com/sun/jdi/CatchPatternTest.sh is incorrect
369 Aleksey Shipilev Red Hat JDK-8252438 [Test] Convert non-JDB scaffolding serviceability shell script tests to java
369 Aleksey Shipilev Red Hat JDK-8252437 [TEST] rewrite com/sun/jdi shell tests to java version - step4
369 Aleksey Shipilev Red Hat JDK-8252436 [TESTBUG] lib.jdb.Jdb.waitForPrompt() should clarify which output is the pending reply after a timeout
369 Aleksey Shipilev Red Hat JDK-8252435 com/sun/jdi/RedefineClearBreakpoint.java fails with waitForPrompt timed out after 60 seconds
369 Aleksey Shipilev Red Hat JDK-8252434 [TEST] convert com/sun/jdi redefineClass-related tests
369 Aleksey Shipilev Red Hat JDK-8252433 [TEST] rewrite com/sun/jdi shell tests to java version - step3
369 Aleksey Shipilev Red Hat JDK-8252432 com/sun/jdi/GetLocalVariables4Test.sh failed
369 Aleksey Shipilev Red Hat JDK-8252431 [TEST] rewrite com/sun/jdi shell tests to java version - step2
369 Aleksey Shipilev Red Hat JDK-8252430 com/sun/jdi/JdbMethodExitTest.sh and JdbExprTest.sh fail due to timeout
369 Aleksey Shipilev Red Hat JDK-8252429 com/sun/jdi/BreakpointWithFullGC.java fails with ZGC
369 Aleksey Shipilev Red Hat JDK-8252428 Problem list com/sun/jdi/BreakpointWithFullGC.java
369 Aleksey Shipilev Red Hat JDK-8252427 com/sun/jdi/BreakpointWithFullGC.java fails with timeout
369 Aleksey Shipilev Red Hat JDK-8252426 [TEST] rewrite com/sun/jdi shell tests to java version - step1
369 Aleksey Shipilev Red Hat JDK-8252425 Better cleanup for test/jdk/javax/imageio/SetOutput.java
369 Aleksey Shipilev Red Hat JDK-8252424 compiler/oracle/TestCompileCommand.java misspells "occured"
369 Aleksey Shipilev Red Hat JDK-8252423 http.nonProxyHosts=* causes StringIndexOutOfBoundsException in DefaultProxySelector
369 Aleksey Shipilev Red Hat JDK-8252422 Shenandoah: remove resolve paths from SBSA::generate_shenandoah_lrb
369 Aleksey Shipilev Red Hat JDK-8252421 Make sure {type,obj}ArrayOopDesc accessors check the bounds
369 Aleksey Shipilev Red Hat JDK-8252420 Shenandoah: check class unloading flag early in concurrent code root scan
369 Aleksey Shipilev Red Hat JDK-8252419 Shenandoah: Remark ObjectSynchronizer roots with I-U
369 Aleksey Shipilev Red Hat JDK-8252418 Shenandoah: remove leftover code after JDK-8231086
376 Roman Kennke Red Hat JDK-8252115 Don't use memset to initialize fields decode_env constructor in disassembler.cpp
379 Volker Simonis Amazon JDK-8251897 (zipfs) Memory leak in ZipFileSystem.releaseDeflater()
379 Aleksey Shipilev Red Hat JDK-8251880 some httpclients testng tests run zero test
379 Aleksey Shipilev Red Hat JDK-8251879 Shenandoah: Fix racy GC request handling
379 Aleksey Shipilev Red Hat JDK-8251878 GIF reader throws misleading exception with truncated images
379 Aleksey Shipilev Red Hat JDK-8251877 LingeredApp doesn't log stdout/stderr if exits with non-zero code
379 Aleksey Shipilev Red Hat JDK-8251876 Shenandoah: remove ShenandoahCriticalControlThreadPriority support
379 Aleksey Shipilev Red Hat JDK-8251875 Shenandoah: remove ShenandoahAssertToSpaceClosure
382 Roman Kennke Red Hat JDK-8251354 Shenandoah: Fix JFR test failures
382 Matthias Baesken SAP JDK-8251571 [macos] Sound Recording and playback is not working
382 Yasumasa Suenaga NTT DATA JDK-8251565 jhsdb does not work with coredump which comes from Substrate VM
385 Martin Balao Red Hat JDK-8251413 Cannot check P11Key size in P11Cipher and P11AEADCipher
385 Aleksey Shipilev Red Hat JDK-8251390 vmTestbase/gc/gctests/Steal/steal001/steal001.java fails with OOME
385 Aleksey Shipilev Red Hat JDK-8251389 Wrong assumption in assertion in oop::register_oop
385 Aleksey Shipilev Red Hat JDK-8251388 CCE in createXMLEventWriter(Result) over an arbitrary XMLStreamWriter
390 Matthias Baesken SAP JDK-8251237 Add SSL root certificates to Oracle Root CA program
390 Matthias Baesken SAP JDK-8251236 AOT's Linker.java seems to eagerly fail-fast on Windows.
390 Aleksey Shipilev Red Hat JDK-8251226 Shenandoah: gc/shenandoah/mxbeans tests should account for corner cases
390 Aleksey Shipilev Red Hat JDK-8251225 Shenandoah: Clear soft-refs on requested GC cycle
391 Aleksey Shipilev Red Hat JDK-8251150 tools/jar/multiRelease/Basic.java times out
391 Aleksey Shipilev Red Hat JDK-8251149 JShell: crash on the instantiation of raw anonymous class
391 Aleksey Shipilev Red Hat JDK-8251148 jshell missing word in /help help
391 Aleksey Shipilev Red Hat JDK-8251147 JShell: NullPointerException in jdk.jshell.Eval.translateExceptionStack
391 Aleksey Shipilev Red Hat JDK-8251146 JShell: Redeclared variable should be reset
391 Aleksey Shipilev Red Hat JDK-8251145 change javap reporting on unknown attributes
391 Aleksey Shipilev Red Hat JDK-8251144 java.net.JarURLConnection::getJarEntry() throws NullPointerException
391 Aleksey Shipilev Red Hat JDK-8251143 WB_GetCodeBlob doesn't have ResourceMark
391 Aleksey Shipilev Red Hat JDK-8251142 C1 emits an empty message when it inlines successfully
391 Aleksey Shipilev Red Hat JDK-8251141 TEST_BUG: java/rmi/transport/closeServerSocket/CloseServerSocket.java fails intermittently with Address already in use
391 Aleksey Shipilev Red Hat JDK-8251140 com/sun/jndi/ldap/RemoveNamingListenerTest.java fails intermittently: Connection reset
392 Ichiroh Takiguchi IBM JDK-8245689 Align some one-way conversion in MS950 charset with Windows
392 Fei Yang Huawei JDK-8251053 aarch64: add necessary predicate for ubfx patterns
392 Fei Yang Huawei JDK-8251051 C2 crash in IfNode::fold_compares
392 Zhengyu Gu Red Hat JDK-8250827 Shenandoah: needs to reset/finish StringTable's dead count before/after parallel walk
392 Zhengyu Gu Red Hat JDK-8251042 Better cleanup for jdk/test/javax/imageio/plugins/shared/CanWriteSequence.java
392 Severin Gehwolf Red Hat JDK-8251028 Use -XX:+/-UseContainerSupport for enabling/disabling Java container metrics
392 Aleksey Shipilev Red Hat JDK-8251014 javax/xml/jaxp/unittest/transform/SecureProcessingTest.java runs zero test
392 Aleksey Shipilev Red Hat JDK-8251013 Remove jdk8037819/BasicTest1.java
392 Aleksey Shipilev Red Hat JDK-8251012 java/nio/channels/AsynchronousSocketChannel/Basic.java timed out
392 Aleksey Shipilev Red Hat JDK-8251011 XML transformer uses excessive amount of memory
392 Aleksey Shipilev Red Hat JDK-8251010 Initialize NULL fields for unused decorations
392 Aleksey Shipilev Red Hat JDK-8251009 (zipfs) Add a ZIP FS test that is similar to test/jdk/java/util/zip/EntryCount64k.java
392 Aleksey Shipilev Red Hat JDK-8251008 Crash when completing "java.io.File.path"
392 Aleksey Shipilev Red Hat JDK-8251007 PhaseStringOpts crashes while optimising effectively dead code
392 Aleksey Shipilev Red Hat JDK-8251006 Catch OOM from deopt that fails rematerializing objects
392 Aleksey Shipilev Red Hat JDK-8251005 Add Entrust root CA - G4 to Oracle Root CA program
398 Roman Kennke Red Hat JDK-8250784 Shenandoah: A Low-Pause-Time Garbage Collector
398 Christoph Langer SAP JDK-8250771 Update copyright header for shenandoah and epsilon files
398 Christoph Langer SAP JDK-8246145 AArch64: jaotc generates incorrect code for compressed OOPs with non-zero heap base
404 Paul Hohensee Amazon JDK-8250231 compiler/codegen/TestCharVect2.java fails in test_mulc
404 Paul Hohensee Amazon JDK-8250230 Enhance auto vectorization for x86
404 Matthias Baesken SAP JDK-8249972 Build fails if source code in cygwin home dir
404 Goetz Lindenmaier SAP JDK-8249968 Rewrite javax/net/ssl/compatibility/Compatibility.java with a flexible interop test framework
404 Thomas Stuefe SAP JDK-8249947 In posix_spawn mode, failing to exec() jspawnhelper may not result in an error
405 Matthias Baesken SAP JDK-8249863 Cannot load RSASSA-PSS public key with non-null params from byte array
405 Vladimir Kempik Azul JDK-8249861 [macos] Zero VM build fails due to an obvious typo
405 Matthias Baesken SAP JDK-8249857 SA might fail to attach to process with "Windbg Error: WaitForEvent failed"
406 Vladimir Kempik Azul JDK-8249819 [macos] zerovm is broken due to libffi headers location
406 Fei Yang Huawei JDK-8248851 CMS: Missing memory fences between free chunk check and klass read
406 Fei Yang Huawei JDK-8249802 aarch64: missing side effect of killing flags for clearArray_reg_reg
406 Yasumasa Suenaga NTT DATA JDK-8249795 libj2gss/NativeFunc.o "multiple definition" link errors with GCC10
406 Yasumasa Suenaga NTT DATA JDK-8249794 (sctp) jdk.sctp/unix/native/libsctp/SctpNet.c "multiple definition" link errors with GCC10
406 Yasumasa Suenaga NTT DATA JDK-8249792 java.base/unix/native/libjava/childproc.c "multiple definition" link errors with GCC10
406 Matthias Baesken SAP JDK-8249788 Revert JDK-8226253 which breaks the spec of AccessibleState.SHOWING for JList
407 Severin Gehwolf Red Hat JDK-8249770 jtreg test containers/docker/TestMemoryAwareness.java fails after 8226575
407 Severin Gehwolf Red Hat JDK-8248803 OperatingSystemMXBean should be made container aware
407 Goetz Lindenmaier SAP JDK-8249765 [dark_mode ubuntu 20.04] The selected menu is not highlighted in GTKLookAndFeel
407 Goetz Lindenmaier SAP JDK-8249764 Regression caused by the update to BCEL 6.0
407 Goetz Lindenmaier SAP JDK-8249763 Update --release 8 symbol information after JSR 337 MR3
407 Goetz Lindenmaier SAP JDK-8249762 jarsigner should not raise duplicate warnings on verification
407 Goetz Lindenmaier SAP JDK-8249761 "Turkey" meta time zone does not generate composed localized names
407 Goetz Lindenmaier SAP JDK-8248860 Localized time zone name inconsistency between English and other locales
407 Matthias Baesken SAP JDK-8249758 LambdaConversionException: Invalid receiver type not a subtype of implementation type interface
407 Aleksey Shipilev Red Hat JDK-8249745 Minimal VM build failure after JDK-8212200 (assert when shared java.lang.Object is redefined by JVMTI agent)
407 Goetz Lindenmaier SAP JDK-8249277 TestVerifyIterativeGVN.java is failing with timeout in OpenJDK 11
410 Goetz Lindenmaier SAP JDK-8249654 Add TLS Tests for Legacy ECDSA curves
410 Goetz Lindenmaier SAP JDK-8249159 Downport test rework for SSLSocketTemplate from 8224650
413 Andrew Hughes Red Hat JDK-8249393 Unexpected NoSuchAlgorithmException when using secure random impl from BCFIPS provider
413 Goetz Lindenmaier SAP JDK-8249274 SO_LINGER option is ignored by SSLSocket in JDK 11
414 Goetz Lindenmaier SAP JDK-8249252 Set -Djava.io.tmpdir= when running tests
414 Goetz Lindenmaier SAP JDK-8249250 javadoc fails to link to docs with non-matching modularity
414 Goetz Lindenmaier SAP JDK-8249249 keytool/fakegen/DefaultSignatureAlgorithm.java fails due to "exitValue = 6"
417 Paul Hohensee Amazon JDK-8247809 getCurrentThreadAllocatedBytes default implementation s/b getThreadAllocatedBytes
417 Paul Hohensee Amazon JDK-8247806 [REDO] JDK-8207266 ThreadMXBean::getThreadAllocatedBytes() can be quicker for self thread
419 Matthias Baesken SAP JDK-8249056 runtime/SharedArchiveFile/serviceability/ReplaceCriticalClasses.java fails: Shared archive not found
419 Matthias Baesken SAP JDK-8249055 runtime/SharedArchiveFile/serviceability/ReplaceCriticalClasses.java fails with ClassNotFoundException: jdk.internal.vm.PostVMInitHook
419 Matthias Baesken SAP JDK-8213164 assert(on_stack()) failed when shared java.lang.object is redefined by JVMTI agent
419 Vladimir Kempik Azul JDK-8249049 [macos] bring back O2 opt level for unsafe.cpp
419 Severin Gehwolf Red Hat JDK-8249047 [JVMCI] `ResolvedJavaType.getDeclaredMethod()` can throw NoClassDefFoundError.
419 Severin Gehwolf Red Hat JDK-8249044 [TESTBUG] TestJFRNetworkEvents should not rely on hostname command
419 Goetz Lindenmaier SAP JDK-8249042 [Windows] JComboBox change in ui when editor.setBorder() is called
419 Matthias Baesken SAP JDK-8249041 Test runtime/NMT/HugeArenaTracking.java is failing on 32bit Windows
419 Goetz Lindenmaier SAP JDK-8249027 Segmentation fault in verification due to stack overflow with -XX:+VerifyIterativeGVN
419 Goetz Lindenmaier SAP JDK-8249026 CTW: C2 compilation fails with "assert(!VerifyHashTableKeys || _hash_lock == 0) failed: remove node from hash table before modifying it"
419 Goetz Lindenmaier SAP JDK-8249025 Default signature algorithm for an RSASSA-PSS key
419 Goetz Lindenmaier SAP JDK-8249023 hs_err elapsed time in seconds is not accurate enough
419 Goetz Lindenmaier SAP JDK-8249022 RSASSA-PSS signature verification fail when using certain odd key sizes
419 Goetz Lindenmaier SAP JDK-8249021 Improve WindbgDebuggerLocal implementation
419 Goetz Lindenmaier SAP JDK-8249020 sun/security/tools/keytool/DefaultSignatureAlgorithm.java timed out
421 Fei Yang Huawei JDK-8248883 aarch64: missing memory barrier in fast_storefield and fast_accessfield
423 Andrew Hughes Red Hat JDK-8248824 SimpleDateFormat :: format - Zone Names are not reflected correctly during run time
427 Roland Westrelin Red Hat JDK-8248569 Meet not symmetric failure when running lucene on jdk8
427 Goetz Lindenmaier SAP JDK-8248214 Add paddings for TaskQueueSuper to reduce false-sharing cache contention
428 Matthias Baesken SAP JDK-8248479 Rename SystemDictionary::initialize_wk_klass to resolve_wk_klass
428 Goetz Lindenmaier SAP JDK-8248472 javax/management/MBeanServer/OldMBeanServerTest fails with AssertionError
428 Goetz Lindenmaier SAP JDK-8248471 [aarch64] assert(false) failed: wrong size of mach node
428 Goetz Lindenmaier SAP JDK-8248469 java.net HTTP/2 client does not decrease stream count when receives 204 response
431 Goetz Lindenmaier SAP JDK-8248385 [testbug][11u] Adapt TestInitiExceptions to jtreg 5.1
433 Goetz Lindenmaier SAP JDK-8248229 2020-04-24 public suffix list update v ff6fcea
433 Matthias Baesken SAP JDK-8248222 [macos] Java2D Queue Flusher crash while moving application window to external monitor
433 Goetz Lindenmaier SAP JDK-8248213 TestEliminateArrayCopy fails with -XX:+StressReflectiveCode
433 Severin Gehwolf Red Hat JDK-8248212 JDK build make-static-libs should build all JDK libraries
433 Goetz Lindenmaier SAP JDK-8248210 TestClone crashes with "all collected exceptions must come from the same place"
433 Goetz Lindenmaier SAP JDK-8248209 C1 assert(known_holder == NULL || (known_holder->is_instance_klass() && (!known_holder->is_interface() || ((ciInstanceKlass*)known_holder)->has_nonstatic_concrete_methods())), "should be non-static concrete method");
433 Goetz Lindenmaier SAP JDK-8248208 Possible NPE in ENC-PA-REP search in AS-REQ
433 Goetz Lindenmaier SAP JDK-8248207 Minimal fastdebug build broken after JDK-8245801
433 Goetz Lindenmaier SAP JDK-8248206 StressRecompilation triggers assert "redundunt OSR recompilation detected. memory leak in CodeCache!"
433 Goetz Lindenmaier SAP JDK-8248204 Enhance BaseLdapServer to support starttls extended request
433 Goetz Lindenmaier SAP JDK-8248203 [macos] macos10.14 Mojave returns anti-aliased glyphs instead of aliased B&W glyphs
433 Goetz Lindenmaier SAP JDK-8248202 Jconsole can't connect to itself
433 Goetz Lindenmaier SAP JDK-8248201 java.rmi.NoSuchObjectException: no such object in table
433 Goetz Lindenmaier SAP JDK-8248197 Choose the default SecureRandom algo based on registration ordering
433 Goetz Lindenmaier SAP JDK-8248196 SSLSocket.getSession() doesn't close connection for timeout/ interrupts
434 Goetz Lindenmaier SAP JDK-8248141 HttpConnection not returned to the pool after 204 response
434 Goetz Lindenmaier SAP JDK-8246690 Tools should warn if weak algorithms are used before restricting them
434 Severin Gehwolf Red Hat JDK-8247874 Replacement in VersionProps.java.template not working when --with-vendor-bug-url contains '&'
435 Goetz Lindenmaier SAP JDK-8248002 Test javax/swing/border/TestTitledBorderLeak.java should be marked as headful
439 Goetz Lindenmaier SAP JDK-8247841 [TESTBUG] java/awt/EventQueue/6980209/bug6980209.java fails in linux nightly
440 Andrew Hughes Red Hat JDK-8247794 javax.swing.border.TitledBorder has a memory leak
440 Andrew Hughes Red Hat JDK-8247793 Trust/Key store and SSL context utilities for tests
440 Andrew Hughes Red Hat JDK-8247792 FlightRecorderListener returns null recording
440 Andrew Hughes Red Hat JDK-8247791 Memory retention due to HttpsURLConnection finalizer that serves no purpose
440 Andrew Hughes Red Hat JDK-8247783 jdwp library loader in linker_md.c quietly truncates on buffer overflow
440 Matthias Baesken SAP JDK-8247769 adjust output in os_linux
440 Matthias Baesken SAP JDK-8247765 enhance os::pd_print_cpu_info on linux
440 Matthias Baesken SAP JDK-8247764 NativeLibraryEvent has wrong library name on Linux
447 Goetz Lindenmaier SAP JDK-8247331 Remove Comodo root certificate that is expiring in May 2020
447 Goetz Lindenmaier SAP JDK-8247330 ldap over a TLS connection negotiate failed with "javax.net.ssl.SSLPeerUnverifiedException: hostname of the server '' does not match the hostname in the server's certificate"
447 Goetz Lindenmaier SAP JDK-8247329 New System Properties to configure the TLS signature schemes
447 Goetz Lindenmaier SAP JDK-8247318 "platform encoding not initialized" exceptions with debugger, JNI
447 Goetz Lindenmaier SAP JDK-8247317 stringop-overflow warning on strncpy call from compile_the_world_in
447 Goetz Lindenmaier SAP JDK-8247316 [TESTBUG]Several swing regression tests do not dispose Frame at end
447 Matthias Baesken SAP JDK-8247308 Private key not supported by chosen signature algorithm
449 Jiangli Zhou Google JDK-8246786 Deadlock in string table expansion when dumping lots of CDS classes
449 Roland Westrelin Red Hat JDK-8246748 "Bad graph detected in build_loop_late" when loads are pinned on loop limit check uncommon branch
449 Matthias Baesken SAP JDK-8246746 security/infra/java/security/cert/CertPathValidator/certification/LuxTrustCA.java fails when checking validity interval
449 Goetz Lindenmaier SAP JDK-8246744 RunTest.gmk might set concurrency level to 1 on Windows
449 Goetz Lindenmaier SAP JDK-8246649 Disable weak named curves by default in TLS, CertPath, and Signed JAR
452 Yasumasa Suenaga NTT DATA JDK-8246680 Can't start JVM when java home path includes non-ASCII character
452 Goetz Lindenmaier SAP JDK-8246660 [TEST BUG]: java/awt/print/PageFormat/PDialogTest.java needs update by removing a infinite loop
452 Goetz Lindenmaier SAP JDK-8246659 Toolkit#getScreenInsets() returns wrong value on HiDPI screens (Windows)
452 Goetz Lindenmaier SAP JDK-8246658 Allocation of compile task fails with assert: "Leaking compilation tasks?"
452 Goetz Lindenmaier SAP JDK-8246657 TestJmapCoreMetaspace.java timed out
452 Goetz Lindenmaier SAP JDK-8246656 Further update javax/net/ssl/compatibility/Compatibility.java
452 Goetz Lindenmaier SAP JDK-8246655 java.math.BigDecimal.sqrt() with RoundingMode.FLOOR results in incorrect result
452 Goetz Lindenmaier SAP JDK-8246654 AES Countermode (CTR) optimization using AVX512 + VAES instructions
452 Goetz Lindenmaier SAP JDK-8246653 AES Electronic Codebook (ECB) encryption and decryption optimization using AVX512 + VAES instructions
452 Goetz Lindenmaier SAP JDK-8246652 Several tests which need the @key headful keyword are missing it.
453 Goetz Lindenmaier SAP JDK-8246554 Small charset issues (ISO8859-16, x-eucJP-Open, x-IBM834 and x-IBM949C)
454 Martin Balao Red Hat JDK-8246470 Support the 'canonicalize' setting (krb5.conf) in the Kerberos client
454 Jaroslav Bachorík DataDog JDK-8246407 Thread CPU Load event may contain wrong data for CPU time under certain conditions
456 Goetz Lindenmaier SAP JDK-8246237 runtime/CompressedOops/CompressedClassPointers.java fails with 'Narrow klass base: 0x0000000000000000' missing from stdout/stderr
456 Goetz Lindenmaier SAP JDK-8246236 Upgrade Jline to 3.12.1
456 Goetz Lindenmaier SAP JDK-8246235 OopMapSet::all_do does oms.next() twice during iteration
456 Goetz Lindenmaier SAP JDK-8246234 Minimal VM is broken after JDK-8231586
456 Goetz Lindenmaier SAP JDK-8246233 enlarge encoding space for OopMapValue offsets
456 Goetz Lindenmaier SAP JDK-8246232 jshell got IOException at exiting with AIX
456 Goetz Lindenmaier SAP JDK-8246231 jdk/jshell/ToolBasicTest.java testHistoryReference failed
456 Goetz Lindenmaier SAP JDK-8246230 code_size2 (defined in stub_routines_x86.hpp) is too small on new Skylake CPUs
456 Goetz Lindenmaier SAP JDK-8246229 x86_32 build failures after JDK-8214074 (Ghash optimization using AVX instructions)
456 Goetz Lindenmaier SAP JDK-8246228 Optimize Ghash using AVX instructions
459 Christian Thalinger Twitter JDK-8246180 jdk/jfr/event/oldobject/TestThreadLocalLeak.java fails to find ThreadLocalObject
459 Goetz Lindenmaier SAP JDK-8246178 jshell tool: Ctrl-D causes EOF
459 Goetz Lindenmaier SAP JDK-8246177 JShell tests failing intermitently with "Problem cleaning up the following threads:"
459 Goetz Lindenmaier SAP JDK-8246176 Upgrade to JLine 3.9.0
459 Goetz Lindenmaier SAP JDK-8246175 Problemlist SA tests on Solaris due to Error attaching to process: Can't create thread_db agent!
459 Goetz Lindenmaier SAP JDK-8246174 Tier1 SA tests fail
459 Goetz Lindenmaier SAP JDK-8246173 Remove SymbolTable dependency from serviceability agent
461 Goetz Lindenmaier SAP JDK-8245616 Bump update version for OpenJDK: jdk-11.0.9
462 Andrew Hughes Red Hat JDK-8245879 x86_32 build failure after JDK-8227269
462 Andrew Hughes Red Hat JDK-8245878 Slow class loading when running with JDWP
948 Bernard Blaser Independent JDK-8193367 annotated type variables bounds crash javac

No changesets log

Committer push log

Andrew Hughes, Red Hat

Bug Summary
JDK-8252258 [11u] JDK-8242154 changes the default vendor
JDK-8247792 FlightRecorderListener returns null recording
JDK-8247794 javax.swing.border.TitledBorder has a memory leak
JDK-8247783 jdwp library loader in linker_md.c quietly truncates on buffer overflow
JDK-8247791 Memory retention due to HttpsURLConnection finalizer that serves no purpose
JDK-8248824 SimpleDateFormat :: format - Zone Names are not reflected correctly during run time
JDK-8245878 Slow class loading when running with JDWP
JDK-8247793 Trust/Key store and SSL context utilities for tests
JDK-8249393 Unexpected NoSuchAlgorithmException when using secure random impl from BCFIPS provider
JDK-8245879 x86_32 build failure after JDK-8227269

Bernard Blaser, Independent

Bug Summary
JDK-8193367 annotated type variables bounds crash javac

Christoph Langer, SAP

Bug Summary
JDK-8253283 [11u] Test build/translations/VerifyTranslations.java failing after JDK-8252258
JDK-8246145 AArch64: jaotc generates incorrect code for compressed OOPs with non-zero heap base
JDK-8251344 Add capability to custom resolve host/domain names within the default JNDI LDAP provider
JDK-8252631 com/sun/jndi/ldap/LdapTimeoutTest.java failed due to timeout on DeadServerNoTimeoutTest is incorrect
JDK-8252620 Cross compilation fails due to missing CFLAGS for the BUILD_CC
JDK-8252621 java --describe-module failed with non-ASCII module name under non-UTF8 environment
JDK-8252622 javac cannot find non-ASCII module name under non-UTF8 environment
JDK-8250771 Update copyright header for shenandoah and epsilon files

Fei Yang, Huawei

Bug Summary
JDK-8251053 aarch64: add necessary predicate for ubfx patterns
JDK-8248883 aarch64: missing memory barrier in fast_storefield and fast_accessfield
JDK-8249802 aarch64: missing side effect of killing flags for clearArray_reg_reg
JDK-8251051 C2 crash in IfNode::fold_compares
JDK-8248851 CMS: Missing memory fences between free chunk check and klass read

Goetz Lindenmaier, SAP

Bug Summary
JDK-8247318 "platform encoding not initialized" exceptions with debugger, JNI
JDK-8249761 "Turkey" meta time zone does not generate composed localized names
JDK-8248229 2020-04-24 public suffix list update v ff6fcea
JDK-8248471 [aarch64] assert(false) failed: wrong size of mach node
JDK-8249765 [dark_mode ubuntu 20.04] The selected menu is not highlighted in GTKLookAndFeel
JDK-8248203 [macos] macos10.14 Mojave returns anti-aliased glyphs instead of aliased B&W glyphs
JDK-8246660 [TEST BUG]: java/awt/print/PageFormat/PDialogTest.java needs update by removing a infinite loop
JDK-8247841 [TESTBUG] java/awt/EventQueue/6980209/bug6980209.java fails in linux nightly
JDK-8248385 [testbug][11u] Adapt TestInitiExceptions to jtreg 5.1
JDK-8247316 [TESTBUG]Several swing regression tests do not dispose Frame at end
JDK-8249042 [Windows] JComboBox change in ui when editor.setBorder() is called
JDK-8248214 Add paddings for TaskQueueSuper to reduce false-sharing cache contention
JDK-8249654 Add TLS Tests for Legacy ECDSA curves
JDK-8246654 AES Countermode (CTR) optimization using AVX512 + VAES instructions
JDK-8246653 AES Electronic Codebook (ECB) encryption and decryption optimization using AVX512 + VAES instructions
JDK-8246658 Allocation of compile task fails with assert: "Leaking compilation tasks?"
JDK-8253813 Backout JDK-8244287 from 11u: it causes several crashes
JDK-8245616 Bump update version for OpenJDK: jdk-11.0.9
JDK-8248209 C1 assert(known_holder == NULL || (known_holder->is_instance_klass() && (!known_holder->is_interface() || ((ciInstanceKlass*)known_holder)->has_nonstatic_concrete_methods())), "should be non-static concrete method");
JDK-8248197 Choose the default SecureRandom algo based on registration ordering
JDK-8246230 code_size2 (defined in stub_routines_x86.hpp) is too small on new Skylake CPUs
JDK-8252560 com.sun.jndi.ldap.EventSupport.removeDeadNotifier: java.lang.NullPointerException
JDK-8249026 CTW: C2 compilation fails with "assert(!VerifyHashTableKeys || _hash_lock == 0) failed: remove node from hash table before modifying it"
JDK-8249025 Default signature algorithm for an RSASSA-PSS key
JDK-8246649 Disable weak named curves by default in TLS, CertPath, and Signed JAR
JDK-8249159 Downport test rework for SSLSocketTemplate from 8224650
JDK-8248204 Enhance BaseLdapServer to support starttls extended request
JDK-8246233 enlarge encoding space for OopMapValue offsets
JDK-8252751 Fix exception message to correctly represent LDAP connection failure
JDK-8246656 Further update javax/net/ssl/compatibility/Compatibility.java
JDK-8249023 hs_err elapsed time in seconds is not accurate enough
JDK-8248141 HttpConnection not returned to the pool after 204 response
JDK-8249021 Improve WindbgDebuggerLocal implementation
JDK-8249762 jarsigner should not raise duplicate warnings on verification
JDK-8246655 java.math.BigDecimal.sqrt() with RoundingMode.FLOOR results in incorrect result
JDK-8248469 java.net HTTP/2 client does not decrease stream count when receives 204 response
JDK-8248201 java.rmi.NoSuchObjectException: no such object in table
JDK-8249250 javadoc fails to link to docs with non-matching modularity
JDK-8248472 javax/management/MBeanServer/OldMBeanServerTest fails with AssertionError
JDK-8248202 Jconsole can't connect to itself
JDK-8246231 jdk/jshell/ToolBasicTest.java testHistoryReference failed
JDK-8246232 jshell got IOException at exiting with AIX
JDK-8246177 JShell tests failing intermitently with "Problem cleaning up the following threads:"
JDK-8246178 jshell tool: Ctrl-D causes EOF
JDK-8249249 keytool/fakegen/DefaultSignatureAlgorithm.java fails due to "exitValue = 6"
JDK-8247330 ldap over a TLS connection negotiate failed with "javax.net.ssl.SSLPeerUnverifiedException: hostname of the server '' does not match the hostname in the server's certificate"
JDK-8248860 Localized time zone name inconsistency between English and other locales
JDK-8248207 Minimal fastdebug build broken after JDK-8245801
JDK-8246234 Minimal VM is broken after JDK-8231586
JDK-8247329 New System Properties to configure the TLS signature schemes
JDK-8246235 OopMapSet::all_do does oms.next() twice during iteration
JDK-8246228 Optimize Ghash using AVX instructions
JDK-8248208 Possible NPE in ENC-PA-REP search in AS-REQ
JDK-8246175 Problemlist SA tests on Solaris due to Error attaching to process: Can't create thread_db agent!
JDK-8249764 Regression caused by the update to BCEL 6.0
JDK-8247331 Remove Comodo root certificate that is expiring in May 2020
JDK-8246173 Remove SymbolTable dependency from serviceability agent
JDK-8249968 Rewrite javax/net/ssl/compatibility/Compatibility.java with a flexible interop test framework
JDK-8249022 RSASSA-PSS signature verification fail when using certain odd key sizes
JDK-8246744 RunTest.gmk might set concurrency level to 1 on Windows
JDK-8246237 runtime/CompressedOops/CompressedClassPointers.java fails with 'Narrow klass base: 0x0000000000000000' missing from stdout/stderr
JDK-8249027 Segmentation fault in verification due to stack overflow with -XX:+VerifyIterativeGVN
JDK-8249252 Set -Djava.io.tmpdir= when running tests
JDK-8246652 Several tests which need the @key headful keyword are missing it.
JDK-8246554 Small charset issues (ISO8859-16, x-eucJP-Open, x-IBM834 and x-IBM949C)
JDK-8249274 SO_LINGER option is ignored by SSLSocket in JDK 11
JDK-8248196 SSLSocket.getSession() doesn't close connection for timeout/ interrupts
JDK-8248206 StressRecompilation triggers assert "redundunt OSR recompilation detected. memory leak in CodeCache!"
JDK-8247317 stringop-overflow warning on strncpy call from compile_the_world_in
JDK-8249020 sun/security/tools/keytool/DefaultSignatureAlgorithm.java timed out
JDK-8248002 Test javax/swing/border/TestTitledBorderLeak.java should be marked as headful
JDK-8248210 TestClone crashes with "all collected exceptions must come from the same place"
JDK-8248213 TestEliminateArrayCopy fails with -XX:+StressReflectiveCode
JDK-8246657 TestJmapCoreMetaspace.java timed out
JDK-8249277 TestVerifyIterativeGVN.java is failing with timeout in OpenJDK 11
JDK-8246174 Tier1 SA tests fail
JDK-8246659 Toolkit#getScreenInsets() returns wrong value on HiDPI screens (Windows)
JDK-8246690 Tools should warn if weak algorithms are used before restricting them
JDK-8249763 Update --release 8 symbol information after JSR 337 MR3
JDK-8246236 Upgrade Jline to 3.12.1
JDK-8246176 Upgrade to JLine 3.9.0
JDK-8252623 Upgrade to jQuery 3.5.1
JDK-8246229 x86_32 build failures after JDK-8214074 (Ghash optimization using AVX instructions)

Ichiroh Takiguchi, IBM

Bug Summary
JDK-8245689 Align some one-way conversion in MS950 charset with Windows

Jaroslav Bachorík, DataDog

Bug Summary
JDK-8244287 JFR: Methods samples have line number 0
JDK-8246407 Thread CPU Load event may contain wrong data for CPU time under certain conditions

Jiangli Zhou, Google

Bug Summary
JDK-8246786 Deadlock in string table expansion when dumping lots of CDS classes

Matthias Baesken, SAP

Bug Summary
JDK-8248222 [macos] Java2D Queue Flusher crash while moving application window to external monitor
JDK-8251571 [macos] Sound Recording and playback is not working
JDK-8251237 Add SSL root certificates to Oracle Root CA program
JDK-8247769 adjust output in os_linux
JDK-8251236 AOT's Linker.java seems to eagerly fail-fast on Windows.
JDK-8213164 assert(on_stack()) failed when shared java.lang.object is redefined by JVMTI agent
JDK-8249972 Build fails if source code in cygwin home dir
JDK-8249863 Cannot load RSASSA-PSS public key with non-null params from byte array
JDK-8247765 enhance os::pd_print_cpu_info on linux
JDK-8249758 LambdaConversionException: Invalid receiver type not a subtype of implementation type interface
JDK-8247764 NativeLibraryEvent has wrong library name on Linux
JDK-8247308 Private key not supported by chosen signature algorithm
JDK-8248479 Rename SystemDictionary::initialize_wk_klass to resolve_wk_klass
JDK-8249788 Revert JDK-8226253 which breaks the spec of AccessibleState.SHOWING for JList
JDK-8249055 runtime/SharedArchiveFile/serviceability/ReplaceCriticalClasses.java fails with ClassNotFoundException: jdk.internal.vm.PostVMInitHook
JDK-8249056 runtime/SharedArchiveFile/serviceability/ReplaceCriticalClasses.java fails: Shared archive not found
JDK-8249857 SA might fail to attach to process with "Windbg Error: WaitForEvent failed"
JDK-8246746 security/infra/java/security/cert/CertPathValidator/certification/LuxTrustCA.java fails when checking validity interval
JDK-8249041 Test runtime/NMT/HugeArenaTracking.java is failing on 32bit Windows

Martin Balao, Red Hat

Bug Summary
JDK-8251413 Cannot check P11Key size in P11Cipher and P11AEADCipher
JDK-8252579 Revert Principal Name type to NT-UNKNOWN when requesting TGS Kerberos tickets
JDK-8246470 Support the 'canonicalize' setting (krb5.conf) in the Kerberos client

Paul Hohensee, Amazon

Bug Summary
JDK-8247806 [REDO] JDK-8207266 ThreadMXBean::getThreadAllocatedBytes() can be quicker for self thread
JDK-8250231 compiler/codegen/TestCharVect2.java fails in test_mulc
JDK-8250230 Enhance auto vectorization for x86
JDK-8247809 getCurrentThreadAllocatedBytes default implementation s/b getThreadAllocatedBytes
JDK-8252157 JDK-8231209 11u backport breaks jmm binary compatibility
JDK-8253134 JMM_VERSION should remain at 0x20020000 (JDK 10) in JDK 11
JDK-8253613 Provider.put no longer registering aliases in FIPS env

Roman Kennke, Red Hat

Bug Summary
JDK-8252115 Don't use memset to initialize fields decode_env constructor in disassembler.cpp
JDK-8250784 Shenandoah: A Low-Pause-Time Garbage Collector
JDK-8251354 Shenandoah: Fix JFR test failures

Roland Westrelin, Red Hat

Bug Summary
JDK-8246748 "Bad graph detected in build_loop_late" when loads are pinned on loop limit check uncommon branch
JDK-8248569 Meet not symmetric failure when running lucene on jdk8

Severin Gehwolf, Red Hat

Bug Summary
JDK-8249047 [JVMCI] `ResolvedJavaType.getDeclaredMethod()` can throw NoClassDefFoundError.
JDK-8249044 [TESTBUG] TestJFRNetworkEvents should not rely on hostname command
JDK-8248212 JDK build make-static-libs should build all JDK libraries
JDK-8249770 jtreg test containers/docker/TestMemoryAwareness.java fails after 8226575
JDK-8248803 OperatingSystemMXBean should be made container aware
JDK-8247874 Replacement in VersionProps.java.template not working when --with-vendor-bug-url contains '&'
JDK-8251028 Use -XX:+/-UseContainerSupport for enabling/disabling Java container metrics

Aleksey Shipilev, Red Hat

Bug Summary
JDK-8251009 (zipfs) Add a ZIP FS test that is similar to test/jdk/java/util/zip/EntryCount64k.java
JDK-8252632 [TEST BUG] javax/swing/text/html/parser/Test8017492.java fails
JDK-8252434 [TEST] convert com/sun/jdi redefineClass-related tests
JDK-8252440 [TEST] convert com/sun/jdi/DeferredStepTest.sh test
JDK-8252438 [Test] Convert non-JDB scaffolding serviceability shell script tests to java
JDK-8252426 [TEST] rewrite com/sun/jdi shell tests to java version - step1
JDK-8252431 [TEST] rewrite com/sun/jdi shell tests to java version - step2
JDK-8252433 [TEST] rewrite com/sun/jdi shell tests to java version - step3
JDK-8252437 [TEST] rewrite com/sun/jdi shell tests to java version - step4
JDK-8252439 [TEST] test/jdk/com/sun/jdi/CatchPatternTest.sh is incorrect
JDK-8252441 [TEST] wrong breakpoint in test/jdk/com/sun/jdi/DeferredStepTest
JDK-8252436 [TESTBUG] lib.jdb.Jdb.waitForPrompt() should clarify which output is the pending reply after a timeout
JDK-8251005 Add Entrust root CA - G4 to Oracle Root CA program
JDK-8252425 Better cleanup for test/jdk/javax/imageio/SetOutput.java
JDK-8251142 C1 emits an empty message when it inlines successfully
JDK-8251006 Catch OOM from deopt that fails rematerializing objects
JDK-8251388 CCE in createXMLEventWriter(Result) over an arbitrary XMLStreamWriter
JDK-8251145 change javap reporting on unknown attributes
JDK-8252444 Circular reference in printed stack trace is not correctly indented & ambiguous
JDK-8252427 com/sun/jdi/BreakpointWithFullGC.java fails with timeout
JDK-8252429 com/sun/jdi/BreakpointWithFullGC.java fails with ZGC
JDK-8252442 com/sun/jdi/DeferredStepTest.java: jj1 (line 57) - unexpected. lastLine=52, minLine=52, maxLine=55
JDK-8252432 com/sun/jdi/GetLocalVariables4Test.sh failed
JDK-8252430 com/sun/jdi/JdbMethodExitTest.sh and JdbExprTest.sh fail due to timeout
JDK-8252435 com/sun/jdi/RedefineClearBreakpoint.java fails with waitForPrompt timed out after 60 seconds
JDK-8251140 com/sun/jndi/ldap/RemoveNamingListenerTest.java fails intermittently: Connection reset
JDK-8252424 compiler/oracle/TestCompileCommand.java misspells "occured"
JDK-8251008 Crash when completing "java.io.File.path"
JDK-8252443 CTW: C2 (Shenandoah) compilation fails with SEGV in SBC2Support::pin_and_expand
JDK-8251878 GIF reader throws misleading exception with truncated images
JDK-8252423 http.nonProxyHosts=* causes StringIndexOutOfBoundsException in DefaultProxySelector
JDK-8251010 Initialize NULL fields for unused decorations
JDK-8251144 java.net.JarURLConnection::getJarEntry() throws NullPointerException
JDK-8251012 java/nio/channels/AsynchronousSocketChannel/Basic.java timed out
JDK-8251014 javax/xml/jaxp/unittest/transform/SecureProcessingTest.java runs zero test
JDK-8251148 jshell missing word in /help help
JDK-8251149 JShell: crash on the instantiation of raw anonymous class
JDK-8251147 JShell: NullPointerException in jdk.jshell.Eval.translateExceptionStack
JDK-8251146 JShell: Redeclared variable should be reset
JDK-8251877 LingeredApp doesn't log stdout/stderr if exits with non-zero code
JDK-8252421 Make sure {type,obj}ArrayOopDesc accessors check the bounds
JDK-8249745 Minimal VM build failure after JDK-8212200 (assert when shared java.lang.Object is redefined by JVMTI agent)
JDK-8251007 PhaseStringOpts crashes while optimising effectively dead code
JDK-8252428 Problem list com/sun/jdi/BreakpointWithFullGC.java
JDK-8251013 Remove jdk8037819/BasicTest1.java
JDK-8252420 Shenandoah: check class unloading flag early in concurrent code root scan
JDK-8251225 Shenandoah: Clear soft-refs on requested GC cycle
JDK-8251879 Shenandoah: Fix racy GC request handling
JDK-8251226 Shenandoah: gc/shenandoah/mxbeans tests should account for corner cases
JDK-8252419 Shenandoah: Remark ObjectSynchronizer roots with I-U
JDK-8252418 Shenandoah: remove leftover code after JDK-8231086
JDK-8252422 Shenandoah: remove resolve paths from SBSA::generate_shenandoah_lrb
JDK-8251875 Shenandoah: remove ShenandoahAssertToSpaceClosure
JDK-8251876 Shenandoah: remove ShenandoahCriticalControlThreadPriority support
JDK-8251880 some httpclients testng tests run zero test
JDK-8251141 TEST_BUG: java/rmi/transport/closeServerSocket/CloseServerSocket.java fails intermittently with Address already in use
JDK-8251150 tools/jar/multiRelease/Basic.java times out
JDK-8251390 vmTestbase/gc/gctests/Steal/steal001/steal001.java fails with OOME
JDK-8252488 vmTestbase/nsk/jvmti/scenarios/allocation/AP10/ap10t001/TestDescription.java failed with ObjectFree: GetCurrentThreadCpuTimerInfo returned unexpected error code
JDK-8251143 WB_GetCodeBlob doesn't have ResourceMark
JDK-8251389 Wrong assumption in assertion in oop::register_oop
JDK-8251011 XML transformer uses excessive amount of memory

Volker Simonis, Amazon

Bug Summary
JDK-8251897 (zipfs) Memory leak in ZipFileSystem.releaseDeflater()
JDK-8252804 [test] Fix 'ReleaseDeflater.java' test after downport of 8234011
JDK-8252503 Initialize the bytes left for the heap sampler

Thomas Stuefe, SAP

Bug Summary
JDK-8249947 In posix_spawn mode, failing to exec() jspawnhelper may not result in an error

Christian Thalinger, Twitter

Bug Summary
JDK-8246180 jdk/jfr/event/oldobject/TestThreadLocalLeak.java fails to find ThreadLocalObject

Vladimir Kempik, Azul

Bug Summary
JDK-8249049 [macos] bring back O2 opt level for unsafe.cpp
JDK-8249861 [macos] Zero VM build fails due to an obvious typo
JDK-8249819 [macos] zerovm is broken due to libffi headers location

Yasumasa Suenaga, NTT DATA

Bug Summary
JDK-8249794 (sctp) jdk.sctp/unix/native/libsctp/SctpNet.c "multiple definition" link errors with GCC10
JDK-8246680 Can't start JVM when java home path includes non-ASCII character
JDK-8249792 java.base/unix/native/libjava/childproc.c "multiple definition" link errors with GCC10
JDK-8252454 JFrame::setVisible crashed with -Dfile.encoding=UTF-8 on Japanese Windows.
JDK-8251565 jhsdb does not work with coredump which comes from Substrate VM
JDK-8249795 libj2gss/NativeFunc.o "multiple definition" link errors with GCC10

Zhengyu Gu, Red Hat

Bug Summary
JDK-8251042 Better cleanup for jdk/test/javax/imageio/plugins/shared/CanWriteSequence.java
JDK-8251487 Shenandoah: missing detail timing tracking for final mark cleaning phase
JDK-8250827 Shenandoah: needs to reset/finish StringTable's dead count before/after parallel walk
JDK-8252450 Update MUSCLE PC/SC-Lite headers to the latest release 1.8.26