PUSHES REPORT: 13.0.1

This report shows who pushed the backports to the given release. This usually shows who did the backporting, testing, and review work.

Report generated: Wed Sep 01 03:54:23 CEST 2021

Distribution by priority

Count Priority
1 P3

Distribution by components

Count Component
1 Total
1 (100.0%) client-libs
1 (100.0%) client-libs/javax.swing

Distribution by affiliation

Count Committer
1 Total
1 (100.0%) Amazon
1 (100.0%) Sergey Bylokhov

Chronological push log:

Days Ago Committer Affiliation Bug Summary
802 Sergey Bylokhov Amazon JDK-8226609 Accessibility issues in javax/swing/plaf/nimbus/doc-files/properties.html

No changesets log

JDK-8231639 Release Note: Text Visibility Issues in macOS Dark Mode
JDK-8230487 java.lang.UnsatisfiedLinkError: net.dll: Can't find dependent libraries
JDK-8230247 Resolve permissions for code source URLs lazily
JDK-8230245 Reduce minRefreshTime for updating remote printer list on Windows
JDK-8229528 JDK 13.0.1 L10n resource files update msg drop 10
JDK-8229513 JDK 13 L10n resource files update - msg drop 20
JDK-8229512 [TESTBUG] jdk.jfr.e.g.c.TestGCHeapConfigurationEventWith32BitOops.java does not expect MinHeapSize to be aligned to HeapAlignment
JDK-8229511 C2 compilation fails with assert: Bad graph detected in build_loop_late
JDK-8229510 Locale API doc has redundant hyphens for some parameters
JDK-8229508 (tz) Upgrade time-zone data to tzdata2019b
JDK-8229196 jdk/net/Sockets/Test.java fails after JDK-8227642
JDK-8229195 [TESTBUG] Make docker tests podman compatible
JDK-8229194 Switching to an infinite socket timeout on Windows leads to high CPU load
JDK-8229097 [Yaru] GTK L&F: There is no difference between menu selected and de-selected
JDK-8229096 jdk/internal/platform/cgroup/TestCgroupMetrics.java - NumberFormatException because of large long values (memory limit_in_bytes)
JDK-8229095 runtime/SharedArchiveFile/CheckDefaultArchiveFile.java test fails on AIX
JDK-8229094 test GetTotalSafepointTime.java fails on fast Linux machines with Total safepoint time 0 ms
JDK-8229093 Regression caused by JDK-8214542 not installing complete checkpoint data to candidates
JDK-8229092 8213232 causes crashes on solaris sparc64
JDK-8229091 New library dependencies due to JDK-8222720
JDK-8229090 Kitchensink fails "assert((((klass)->trace_id() & (JfrTraceIdEpoch::leakp_in_use_this_epoch_bit())) != 0)) failed: invariant"
JDK-8229089 AArch64: Fix interpreter code at JVMCI deoptimization entry
JDK-8229088 [aix] loadquery failed error reported
JDK-8229087 Disable AggressiveUnboxing until JDK-8224957 is fixed
JDK-8229086 s390: c1/c2 fail to add a metadata relocation in the static call stub.
JDK-8229085 ZGC: C2 loads and load barriers can get separated by safepoints
JDK-8229084 SignTwice.java failed with java.io.FileNotFoundException: File name too long
JDK-8229083 Update copyright year to 2019 for several java properties file
JDK-8229082 JVM crashes with shared archive file mismatch
JDK-8229081 Add sun/security/tools/jarsigner/PreserveRawManifestEntryAndDigest.java to problem list
JDK-8229080 Missing license copyright header in some properties files
JDK-8229079 unproblem list applications/ctw/modules/* tests on windows
JDK-8229078 JNI upcalls should bypass class initialization barrier in c2i adapter
JDK-8229077 SignTwice.java fails intermittently on Windows
JDK-8229076 keytool/fakegen/DefaultSignatureAlgorithm.java fails due to "exitValue = 6"
JDK-8229075 Update nroff version of man pages
JDK-8229073 Remove mistaken open.iml
JDK-8229072 unicode.md and icu.md text should be pre-formatted
JDK-8229071 tools/sjavac/IdleShutdown.java fails with AssertionError: Error too big on windows
JDK-8229070 sun/management/jmxremote/bootstrap/JMXInterfaceBindingTest.java fails due to java.rmi.server.ExportException: Port already in use
JDK-8229069 make it possible to use jtreg's -match via run-test framework
JDK-8229068 JVMCI deleteGlobalHandle doesn't delete the handle
JDK-8229067 runtime/memory/RunUnitTestsConcurrently.java has a memory leak
JDK-8229066 NMethod state machine is not monotonic
JDK-8229065 Add SignTwice.java to problem list
JDK-8229064 jarsigner breaks old signature with long lines in manifest
JDK-8229063 S4U2proxy cannot continue because server's TGT cannot be found
JDK-8229061 Updates to Stateless Resumption
JDK-8229060 Session Resumption without Server-Side State off by default
JDK-8229059 JVM crashes when bootstrap method for condy triggers loading of class whose static initializer throws exception
JDK-8228345 Reduce GC pressure during message digest calculations in password-based encryption
JDK-8228115 [TESTBUG] appcds/SharedArchiveConsistency timed out
JDK-8228114 java/awt/Color/AlphaColorTest.java fails in linux-x64 system
JDK-8228113 Colors with alpha are painted incorrectly on Linux, after JDK-8214579
JDK-8228112 javac crashes on text blocks with invalid escapes.
JDK-8228110 Update NUM_CDS_REGIONS and CURRENT_CDS_ARCHIVE_VERSION in cds.h
JDK-8228109 EnumSet.class serialization broken in JDK 9+
JDK-8228108 Fix output dir for jlink_jre target in Images.gmk
JDK-8228107 [aix] Disable jdk/java/lang/reflect/exeCallerAccessTest
JDK-8228106 JVM fails to detect mismatched or corrupt CDS archive
JDK-8228105 Wrong JRE targets in Images.gmk after JDK-8219971
JDK-8228104 sun/net/www/protocol/file/DirPermissionDenied.java failed on Windows 2016 because DirPermissionDenied directory has no read permission
JDK-8228103 GTK L&F: JSplitPane: There is no divider shown
JDK-8228102 NoSuchAlgorithmException exception for SHA256withECDSA with RSASSA-PSS support
JDK-8228100 Update double-conversion to version 3.1.5
JDK-8228099 HotSpot compile-time error for x86-32
JDK-8228097 CipherSpi ByteBuffer to byte array conversion fails for certain data overlap conditions
JDK-8228096 Catch OOM from deopt that fails rematerializing objects
JDK-8228095 tzdata2018i integration causes test failures on jdk-13
JDK-8228094 NullPointerException at jdk.compiler/com.sun.tools.javac.jvm.Code.emitop0
JDK-8228093 sun/security/tools/keytool/DefaultSignatureAlgorithm.java timed out
JDK-8228092 GSS login fails with PREAUTH_FAILED
JDK-8228091 Newly added sspi.cpp in JDK-6722928 still contains some small errors
JDK-8228090 vmTestbase/jit/FloatingPoint/gen_math/Loops04/Loops04.java hits assert(((!attributes->uses_vl()) || (attributes->get_vector_len() == AVX_512bit) || (!_legacy_mode_vl) || (attributes->is_legacy_mode()))) failed: XMM register should be 0-15
JDK-8228089 Graal crash with gcbasher
JDK-8228088 [Graal] org.graalvm.compiler.api.directives.test.ProbabilityDirectiveTest fails with -Xcomp
JDK-8228087 SEGV while collecting Klass statistics
JDK-8228086 HeapInspection::find_instances_at_safepoint walks dead objects
JDK-8228085 Era designator not displayed correctly using the COMPAT provider
JDK-8228084 normal interpreter table is not restored after single stepping with TLH
JDK-8228083 [Graal] Implement basic type consistency checks for Low level MH intrinsics
JDK-8228082 Test failures on IBM platforms (power and s/390) after JDK-8223837
JDK-8228081 [Graal] java/lang/String/CompactString/ tests fail with "GraalError: failed guarantee: no FrameState at DeoptimizingNode" in Graal -Xcomp mode
JDK-8228080 compiler/graalunit/HotspotJdk9Test.java is timing out intermittently
JDK-8228079 [Graal] Application SEGV in G1ParScanThreadState::copy_to_survivor_space(G1HeapRegionAttr, oopDesc*, markOopDesc*)+0x48
JDK-8228078 Some swing gtk regression tests fail with "java.lang.InternalError: Unable to load native GTK libraries"
JDK-8228077 Krb5Util::getTicketFromSubjectAndTgs is useless
JDK-8228076 ZGC: ZHeapIterator visits potentially dead objects
JDK-8228075 ZGC: C2: Generates on_weak barrier for WeakCompareAndSwap
JDK-8228074 ZGC: C2: Generates on_weak instead of on_strong barriers
JDK-8228073 Minor edits to launcher help text
JDK-8228072 More clarification on possible sequencing error in GSSContext::unwrap
JDK-8228071 KDC.java test behaves incorrectly when AS-REQ contains a PAData not PA-ENC-TS-ENC
JDK-8228070 [JVMCI] java.* classes are no longer necessarily resolved by the boot class loader
JDK-8228069 Shenandoah: trashing "Collection Set, Pinned" region during Degenerated GC
JDK-8228068 JFR: Old Object Sample event slow on a deep heap in debug builds
JDK-8228067 Kerberos login to Windows 2000 failed with "Inappropriate type of checksum in message"
JDK-8228066 Excessive ServiceThread wakeups for OopStorage cleanup
JDK-8228065 Accessibility errors in jdwp-protocol.html
JDK-8228064 exclude compiler/intrinsics/sha/sanity tests from AOT runs
JDK-8228063 reference to http://java.sun.com/products/JavaManagement/download.html
JDK-8228062 Starting a JFR recording in response to JVMTI VMInit and / or Java agent premain corrupts memory
JDK-8228061 JFR RootResolver resets CLD claims with no restore
JDK-8228060 ZGC: Crash due to bad oops being spilled to stack in load barriers
JDK-8228059 G1 asserts nmethod should not be unloaded during parallel code cache unloading
JDK-8228058 No compilation error reported when yield is used in incorrect context
JDK-8228057 Adjust permission for delayed starting of debugging
JDK-8228056 Node budget asserts on x86_32/64
JDK-8228055 compile error in libfollowref003.cpp with XCode 10.2 on macosx
JDK-8228053 Make process_users_of_allocation handle gc barriers
JDK-8228052 [JVMCI] Handle unpacking properly in Deoptimiziation::get_cached_box()
JDK-8228051 jvmti/scenarios/contention/TC04/tc04t001/TestDescription.java fails on jvmti->InterruptThread (JVMTI_ERROR_THREAD_NOT_ALIVE)
JDK-8228050 JVMCI: findUniqueConcreteMethod should handle statically bindable methods directly
JDK-8228049 Test java/util/Locale/LocaleProvidersRun.java should enable assertions
JDK-8228048 Setting the mgfHash in CK_RSA_PKCS_PSS_PARAMS has no effect
JDK-8228047 Assertion in sun/util/locale/provider/CalendarDataUtility on Windows after JDK-8218960
JDK-8228046 No compilation error when switch expression has no result expressions
JDK-8228045 Add tests to support X25519 and X448 in TLS
JDK-8228044 GTK is not being returned as the System L&F on Gnome.
JDK-8228043 Hide the onjcmd option from the help output
JDK-8228042 Safepoint counter can't be used for safepoint detection
JDK-8228041 Create jtreg test for JDK-8222252
JDK-8228040 AArch64: float point register corruption in ZBarrierSetAssembler::load_at
JDK-8228039 Inconsistent info between pcsclite.md and MUSCLE headers
JDK-8228038 [TESTBUG] runtime/appcds/sharedStrings/SysDictCrash.java failed with Cannot dump shared archive
JDK-8228037 Missing `@` in code tags
JDK-8228036 [BACKOUT] JDK-8221734 Deoptimize with handshakes
JDK-8228034 The copyright footer should be enclosed in
JDK-8228033 [TESTBUG] TestDockerMemoryMetrics.java fails with exitValue = 137
JDK-8228032 [TESTBUG] JDK docker test TestSystemMetrics.java fails with access issues and OOM
JDK-8228031 Provide specific links in KeyManagerFactory and TrustManagerFactory to the Standard Algorithm Names Specification
JDK-8228030 jvmti/scenarios/contention/TC04/tc04t001/TestDescription.java still fails due to wrong number of MonitorContendedEntered events
JDK-8228029 vmTestbase/nsk/jvmti/scenarios/contention/TC02/tc02t001/TestDescription.java failed
JDK-8228028 Fix HTML in com/sun/jdi/doc-files/signature.html
JDK-8228027 Fix HTML in table for jdk.zipfs module-info
JDK-8228026 Race in SetupProcessMarkdown
JDK-8228025 sun/security/tools/keytool/PSS.java timed out
JDK-8228023 (bf) MappedByteBuffer.force method may have no effect on implementation specific map modes
JDK-8228022 find-files.gmk gets corrupted if tab completion is used before running make first
JDK-8228021 jvmti/scenarios/contention/TC04/tc04t001/TestDescription.java fails due to wrong number of MonitorContendedEntered events
JDK-8228020 serviceability/dcmd/framework/VMVersionTest.java fails with a timeout
JDK-8228019 Fix command-line help text for javac -target
JDK-8228018 [AOT] Problem list serviceability/sa tests failed with AOTed java.base
JDK-8228016 bootcycle build uses wrong CDS archive
JDK-8228015 Curve in certificate should not affect signature scheme when using TLSv1.3
JDK-8228014 G1 GC: Undefined behaviour in G1BlockOffsetTablePart::block_at_or_preceding
JDK-8228013 ProblemList java/lang/constant/MethodTypeDescTest.java
JDK-8228012 ProblemList java/lang/reflect/PublicMethods/PublicMethodsTest.java
JDK-8228011 merge entries in hotspot problem lists
JDK-8228010 Reference to JNI spec on java.sun.com
JDK-8228009 problem list compiler/types/correctness tests
JDK-8228008 JFR crashed in JfrPeriodicEventSet::requestProtectionDomainCacheTableStatistics()
JDK-8228007 use of & instead of && in LibraryCallKit::arraycopy_restore_alloc_state
JDK-8228006 JShell : Stack trace of exception has wrong line number
JDK-8228005 JShell: corralled declarations do not have correct source to wrapper mapping
JDK-8228004 jdk/jshell/ExceptionsTest.java fails on Windows, after JDK-8198801
JDK-8228003 assert(thread->is_Java_thread()) failed: just checking
JDK-8228002 Jcmd fails to attach to the Java process on Linux using the main class name if whitespace options were used to launch the process
JDK-8228001 [Graal] compiler/jvmci/SecurityRestrictionsTest.java fails with AccessControlException
JDK-8228000 Shenandoah: Adjust SA to reflect recent forwarding pointer changes
JDK-8227999 Comparison builds are failing due to cacerts file
JDK-8227998 AsyncSSLSocketClose.java has timing issue
JDK-8227997 32-bit build failures after JDK-8080462 (Update SunPKCS11 provider with PKCS11 v2.40 support)
JDK-8227995 Add sun/security/pkcs11/tls/tls12/FipsModeTLS12.java to ProblemList for linux
JDK-8227993 Serial spec should be updated to reflect API generification
JDK-8227992 No documented method for setting module addexports to JNI_CreateJavaVM
JDK-8227989 (tz) Upgrade time-zone data to tzdata2019a
JDK-8227988 JDK 13 L10n resource files update - msgdrop 10
JDK-8227985 Update javac man page with info about compilation modes
JDK-8227984 assert(t->singleton()) failed: must be a constant
JDK-8227983 Several corrections to java FlightRecorderOptions section
JDK-8227974 Accessibility issues in specs/serialization/*.html
JDK-8227973 CTW of SPECjvm2008 hangs on windows-x64-debug
JDK-8227971 MethodTypeDesc::resolveConstantDesc needs access check per the specification
JDK-8227957 Incorrect parameters in Javadoc documentation
JDK-8227956 Use SHA-256 for javap classfile checksum
JDK-8227953 hotspot problem lists list unexciting tests
JDK-8225376 invalid HTML in AWT_Native_Interface.html
JDK-8224505 TestQuotedLogOutput failure after ProcessBuilder changes
JDK-8217676 Upgrade libpng to 1.6.37

Committer push log

Sergey Bylokhov, Amazon

Bug Summary
JDK-8226609 Accessibility issues in javax/swing/plaf/nimbus/doc-files/properties.html