PUSHES REPORT: 13.0.2

This report shows who pushed the backports to the given release. This usually shows who did the backporting, testing, and review work.

Report generated: Wed Sep 01 03:56:07 CEST 2021

Distribution by priority

Count Priority
6 P1
52 P2
88 P3
54 P4

Distribution by components

Count Component
200 Total
89 (44.5%) hotspot
28 (14.0%) hotspot/compiler
23 (11.5%) hotspot/runtime
17 (8.5%) hotspot/gc
8 (4.0%) hotspot/jfr
5 (2.5%) hotspot/jvmti
4 (2.0%) hotspot/svc-agent
3 (1.5%) hotspot/svc
1 (0.5%) hotspot
34 (17.0%) core-libs
9 (4.5%) core-libs/java.net
5 (2.5%) core-libs/java.time
4 (2.0%) core-libs
4 (2.0%) core-libs/java.util:i18n
3 (1.5%) core-libs/java.util.jar
3 (1.5%) core-libs/java.nio
2 (1.0%) core-libs/jdk.nashorn
1 (0.5%) core-libs/java.util:collections
1 (0.5%) core-libs/java.lang:reflect
1 (0.5%) core-libs/java.text
1 (0.5%) core-libs/java.lang
29 (14.5%) security-libs
10 (5.0%) security-libs/java.security
4 (2.0%) security-libs/jdk.security
4 (2.0%) security-libs/javax.net.ssl
4 (2.0%) security-libs/org.ietf.jgss
3 (1.5%) security-libs/org.ietf.jgss:krb5
2 (1.0%) security-libs/javax.crypto
1 (0.5%) security-libs/javax.smartcardio
1 (0.5%) security-libs/javax.crypto:pkcs11
21 (10.5%) client-libs
9 (4.5%) client-libs/2d
6 (3.0%) client-libs/java.awt
5 (2.5%) client-libs/javax.swing
1 (0.5%) client-libs
8 (4.0%) core-svc
5 (2.5%) core-svc/debugger
2 (1.0%) core-svc/javax.management
1 (0.5%) core-svc/tools
8 (4.0%) infrastructure
6 (3.0%) infrastructure/build
2 (1.0%) infrastructure
5 (2.5%) globalization
5 (2.5%) globalization/translation
5 (2.5%) tools
4 (2.0%) tools/javac
1 (0.5%) tools/launcher
1 (0.5%) other-libs
1 (0.5%) other-libs

Distribution by affiliation

Count Committer
200 Total
149 (74.5%) Oracle
119 (59.5%) Sean Coffey
25 (12.5%) Robert Mckenna
2 (1.0%) Dmitry Markov
1 (0.5%) Per Liden
1 (0.5%) Philip Race
1 (0.5%) Alexey Ivanov
30 (15.0%) SAP
30 (15.0%) Christoph Langer
8 (4.0%) Red Hat
8 (4.0%) Aleksey Shipilev
3 (1.5%) Google
3 (1.5%) Ivan Gerasimov
3 (1.5%) IBM
3 (1.5%) Ramanand Patil
2 (1.0%) Amazon
2 (1.0%) Sergey Bylokhov
2 (1.0%) Azul
2 (1.0%) Vladimir Kempik
2 (1.0%) Independent
2 (1.0%) Laurent Bourgès
1 (0.5%) NTT DATA
1 (0.5%) Yasumasa Suenaga

Chronological push log:

Days Ago Committer Affiliation Bug Summary
594 Robert Mckenna Oracle JDK-8233611 Fontmetrics for large Fonts has zero width
594 Robert Mckenna Oracle JDK-8231204 (fs) FileStore::isReadOnly is always true on macOS Catalina
594 Robert Mckenna Oracle JDK-8230955 HOST locale provider holds wrong era name for GregorianCalendar in US locale
627 Christoph Langer SAP JDK-8235706 Add Amazon Root CA certificates
642 Christoph Langer SAP JDK-8234976 sun/security/lib/cacerts/VerifyCACerts.java fails due to wrong checksum
642 Christoph Langer SAP JDK-8234853 Add LuxTrust certificate updates to the existing root program
656 Vladimir Kempik Azul JDK-8234164 Proxied HttpsURLConnection doesn't send BODY when retrying POST request
658 Ivan Gerasimov Google JDK-8234007 TEST_BUG jdk/java/net/CookieHandler/B6791927.java hit hardcoded expiration date
659 Christoph Langer SAP JDK-8233898 exclude javax/swing/plaf/basic/BasicGraphicsUtils/8132119/bug8132119.java
659 Christoph Langer SAP JDK-8233897 [ppc]: Align ReservedCodeCacheSize default value with other platforms
662 Sean Coffey Oracle JDK-8233505 Upgrading Joni License version to 2.1.16
666 Christoph Langer SAP JDK-8233461 [s390, PPC64] More exception checks missing in interpreter
673 Sergey Bylokhov Amazon JDK-8233060 [macos] java/awt/GraphicsDevice/CheckDisplayModes.java fails
677 Aleksey Shipilev Red Hat JDK-8232971 Epsilon should warn about Xms/Xmx/AlwaysPreTouch configuration
678 Christoph Langer SAP JDK-8232911 [x86] C2: SIGILL due to usage of SSSE3 instructions on processors which don't support it
680 Sergey Bylokhov Amazon JDK-8232750 [macos 10.15] The String "X Y Z" was not set to application's icon in the taskbar
685 Robert Mckenna Oracle JDK-8230049 Resolve permissions for code source URLs lazily
685 Robert Mckenna Oracle JDK-8229987 java.lang.UnsatisfiedLinkError: net.dll: Can't find dependent libraries
685 Robert Mckenna Oracle JDK-8229242 JDK 13.0.1 L10n resource files update msg drop 10
685 Robert Mckenna Oracle JDK-8227662 freetype seeks to index at the end of the font data
686 Per Liden Oracle JDK-8232269 ZGC: Redesign C2 load barrier to expand on the MachNode level
688 Christoph Langer SAP JDK-8232191 Windows build fails after JDK-8191521
688 Christoph Langer SAP JDK-8232190 Fix/remove malformed assert in os_windows.cpp
688 Christoph Langer SAP JDK-8232189 handle long relative path specified in -Xbootclasspath/a on windows
690 Sean Coffey Oracle JDK-8232059 Test java/util/zip/FlaterTest.java fails with -Xcheck:jni
690 Christoph Langer SAP JDK-8232160 Test security/infra/java/security/cert/CertPathValidator/certification/ComodoCA.java fails because certificate was revoked
690 Christoph Langer SAP JDK-8232159 provide function names in native stack trace on aix with xlc16
692 Christoph Langer SAP JDK-8232054 [PPC64] SA reads wrong slots from interpreter frames
694 Vladimir Kempik Azul JDK-8231944 (fs) Increase buffer size used with getmntent
697 Dmitry Markov Oracle JDK-8231876 Robot.createScreenCapture() fails if “awt.robot.gtk” is set to false
698 Ramanand Patil IBM JDK-8231838 (tz) Upgrade time-zone data to tzdata2019c
698 Ramanand Patil IBM JDK-8231833 TZ database in "vanguard" format support
698 Christoph Langer SAP JDK-8231832 Exclude serviceability/sa/TestInstanceKlassSize.java on linuxppc64 and linuxppc64le
698 Christoph Langer SAP JDK-8231831 [TESTBUG] runtime/containers/docker/TestMemoryAwareness.java test fails on SLES12
698 Christoph Langer SAP JDK-8231830 Problem list java/awt/FontMetrics/MaxAdvanceIsMax.java on more platforms
699 Laurent Bourgès Independent JDK-8231771 Thin stroked shapes are not rendered if affine transform has flip bit
699 Aleksey Shipilev Red Hat JDK-8231763 Shenandoah: Fix register clash in SBSA::resolve_forwarding_pointer() borrowing
699 Aleksey Shipilev Red Hat JDK-8231762 Shenandoah: JVMTI heap walking cleanup crashes with NULL forwardee
699 Aleksey Shipilev Red Hat JDK-8231761 [Shenandoah] guarantee(d != NULL) failed: Null dominator info
699 Aleksey Shipilev Red Hat JDK-8231760 Shenandoah: Missing node types in ShenandoahLoadReferenceBarrier::needs_barrier_impl()
699 Christoph Langer SAP JDK-8231759 TestLinkageErrorInGenerateOopMap times out
699 Christoph Langer SAP JDK-8231758 False deadlock detection with -XX:+CIPrintCompileQueue after JDK-8163511
707 Christoph Langer SAP JDK-8231408 [TESTBUG] jdk/internal/platform/cgroup/TestCgroupMetrics.java fails for - memory:getMemoryUsage
711 Christoph Langer SAP JDK-8231308 Test sun/tools/jcmd/TestProcessHelper.java fails intermittently
711 Christoph Langer SAP JDK-8231307 Problemlist JFR TestNetworkUtilization test
711 Christoph Langer SAP JDK-8231306 [TESTBUG] serviceability/sa/ClhsdbFindPC fails on AArch64
715 Ivan Gerasimov Google JDK-8231091 JDB hangs when running monitor command
715 Christoph Langer SAP JDK-8231062 ZipFile reads wrong entry size from ZIP64 entries
722 Christoph Langer SAP JDK-8230753 (zipfs) zip file corruption when replacing an existing STORED entry
722 Aleksey Shipilev Red Hat JDK-8230745 Epsilon does not extend TLABs to max size
727 Christoph Langer SAP JDK-8230295 SA tools not providing option to connect to debug server
727 Christoph Langer SAP JDK-8230534 Perf::attach() should not throw a java.lang.Exception
728 Aleksey Shipilev Red Hat JDK-8230488 Shenandoah forces +UseNUMAInterleaving even after explicitly disabled
732 Laurent Bourgès Independent JDK-8230399 Path rendered incorrectly when it goes outside the clipping region
732 Christoph Langer SAP JDK-8230384 jdk/jfr/event/runtime/TestShutdownEvent.java failed in validateStackTrace()
732 Christoph Langer SAP JDK-8230383 java/net/MulticastSocket/NoLoopbackPackets.java fails on some AIX machines
732 Christoph Langer SAP JDK-8230381 [s390, PPC64] Exception check missing in interpreter
733 Yasumasa Suenaga NTT DATA JDK-8230375 sadebugd/DebugdConnectTest.java fails due to "java.rmi.NotBoundException: SARemoteDebugger"
733 Philip Race Oracle JDK-8230358 WindowsServerCore 1809 does not provide d2d1.dll library required by awt.dll
734 Dmitry Markov Oracle JDK-8230300 ctrl-F1 does not show the tooltip of a menu item (JMenuItems)
735 Robert Mckenna Oracle JDK-8230276 setRequestProperty(key, null) results in HTTP header without colon in request
735 Sean Coffey Oracle JDK-8230022 ByteArrayPublisher is not thread-safe resulting in broken re-use of HttpRequests
742 Alexey Ivanov Oracle JDK-8229950 Reduce minRefreshTime for updating remote printer list on Windows
749 Robert Mckenna Oracle JDK-8229505 JDK 13 L10n resource files update - msg drop 20
749 Robert Mckenna Oracle JDK-8229504 [TESTBUG] jdk.jfr.e.g.c.TestGCHeapConfigurationEventWith32BitOops.java does not expect MinHeapSize to be aligned to HeapAlignment
749 Robert Mckenna Oracle JDK-8229503 C2 compilation fails with assert: Bad graph detected in build_loop_late
749 Robert Mckenna Oracle JDK-8229502 Locale API doc has redundant hyphens for some parameters
754 Ramanand Patil IBM JDK-8229323 (tz) Upgrade time-zone data to tzdata2019b
756 Robert Mckenna Oracle JDK-8229199 jdk/net/Sockets/Test.java fails after JDK-8227642
756 Robert Mckenna Oracle JDK-8229198 [TESTBUG] Make docker tests podman compatible
756 Robert Mckenna Oracle JDK-8229197 Switching to an infinite socket timeout on Windows leads to high CPU load
759 Robert Mckenna Oracle JDK-8229107 [Yaru] GTK L&F: There is no difference between menu selected and de-selected
759 Robert Mckenna Oracle JDK-8229106 jdk/internal/platform/cgroup/TestCgroupMetrics.java - NumberFormatException because of large long values (memory limit_in_bytes)
759 Robert Mckenna Oracle JDK-8229105 runtime/SharedArchiveFile/CheckDefaultArchiveFile.java test fails on AIX
759 Robert Mckenna Oracle JDK-8229104 test GetTotalSafepointTime.java fails on fast Linux machines with Total safepoint time 0 ms
759 Robert Mckenna Oracle JDK-8229103 Regression caused by JDK-8214542 not installing complete checkpoint data to candidates
759 Robert Mckenna Oracle JDK-8229102 8213232 causes crashes on solaris sparc64
759 Robert Mckenna Oracle JDK-8229101 New library dependencies due to JDK-8222720
759 Robert Mckenna Oracle JDK-8229100 Upgrade libpng to 1.6.37
759 Robert Mckenna Oracle JDK-8229099 Kitchensink fails "assert((((klass)->trace_id() & (JfrTraceIdEpoch::leakp_in_use_this_epoch_bit())) != 0)) failed: invariant"
759 Robert Mckenna Oracle JDK-8229098 AArch64: Fix interpreter code at JVMCI deoptimization entry
762 Christoph Langer SAP JDK-8228896 [aix] loadquery failed error reported
763 Sean Coffey Oracle JDK-8228813 Disable AggressiveUnboxing until JDK-8224957 is fixed
763 Sean Coffey Oracle JDK-8228812 s390: c1/c2 fail to add a metadata relocation in the static call stub.
763 Sean Coffey Oracle JDK-8228811 ZGC: C2 loads and load barriers can get separated by safepoints
763 Sean Coffey Oracle JDK-8228810 SignTwice.java failed with java.io.FileNotFoundException: File name too long
763 Sean Coffey Oracle JDK-8228809 Update copyright year to 2019 for several java properties file
763 Sean Coffey Oracle JDK-8228808 JVM crashes with shared archive file mismatch
763 Sean Coffey Oracle JDK-8228807 Add sun/security/tools/jarsigner/PreserveRawManifestEntryAndDigest.java to problem list
763 Sean Coffey Oracle JDK-8228806 Missing license copyright header in some properties files
763 Sean Coffey Oracle JDK-8228805 unproblem list applications/ctw/modules/* tests on windows
763 Sean Coffey Oracle JDK-8228804 JNI upcalls should bypass class initialization barrier in c2i adapter
763 Sean Coffey Oracle JDK-8228803 SignTwice.java fails intermittently on Windows
763 Sean Coffey Oracle JDK-8228802 keytool/fakegen/DefaultSignatureAlgorithm.java fails due to "exitValue = 6"
763 Sean Coffey Oracle JDK-8228801 Update nroff version of man pages
763 Sean Coffey Oracle JDK-8228799 Remove mistaken open.iml
763 Sean Coffey Oracle JDK-8228798 unicode.md and icu.md text should be pre-formatted
763 Sean Coffey Oracle JDK-8228797 tools/sjavac/IdleShutdown.java fails with AssertionError: Error too big on windows
763 Sean Coffey Oracle JDK-8228796 sun/management/jmxremote/bootstrap/JMXInterfaceBindingTest.java fails due to java.rmi.server.ExportException: Port already in use
763 Sean Coffey Oracle JDK-8228795 make it possible to use jtreg's -match via run-test framework
763 Sean Coffey Oracle JDK-8228794 JVMCI deleteGlobalHandle doesn't delete the handle
763 Sean Coffey Oracle JDK-8228793 runtime/memory/RunUnitTestsConcurrently.java has a memory leak
763 Sean Coffey Oracle JDK-8228792 NMethod state machine is not monotonic
763 Sean Coffey Oracle JDK-8228791 Add SignTwice.java to problem list
763 Sean Coffey Oracle JDK-8228790 jarsigner breaks old signature with long lines in manifest
763 Sean Coffey Oracle JDK-8228789 S4U2proxy cannot continue because server's TGT cannot be found
763 Sean Coffey Oracle JDK-8228787 Updates to Stateless Resumption
763 Sean Coffey Oracle JDK-8228786 Session Resumption without Server-Side State off by default
763 Sean Coffey Oracle JDK-8228334 [TESTBUG] appcds/SharedArchiveConsistency timed out
763 Sean Coffey Oracle JDK-8228330 java/awt/Color/AlphaColorTest.java fails in linux-x64 system
763 Sean Coffey Oracle JDK-8228329 Colors with alpha are painted incorrectly on Linux, after JDK-8214579
763 Sean Coffey Oracle JDK-8228328 javac crashes on text blocks with invalid escapes.
763 Sean Coffey Oracle JDK-8228326 Update NUM_CDS_REGIONS and CURRENT_CDS_ARCHIVE_VERSION in cds.h
763 Sean Coffey Oracle JDK-8228325 EnumSet.class serialization broken in JDK 9+
763 Sean Coffey Oracle JDK-8228324 Fix output dir for jlink_jre target in Images.gmk
763 Sean Coffey Oracle JDK-8228323 [aix] Disable jdk/java/lang/reflect/exeCallerAccessTest
763 Sean Coffey Oracle JDK-8228322 JVM fails to detect mismatched or corrupt CDS archive
763 Sean Coffey Oracle JDK-8228321 Wrong JRE targets in Images.gmk after JDK-8219971
763 Sean Coffey Oracle JDK-8228320 sun/net/www/protocol/file/DirPermissionDenied.java failed on Windows 2016 because DirPermissionDenied directory has no read permission
763 Sean Coffey Oracle JDK-8228319 GTK L&F: JSplitPane: There is no divider shown
763 Sean Coffey Oracle JDK-8228318 NoSuchAlgorithmException exception for SHA256withECDSA with RSASSA-PSS support
763 Sean Coffey Oracle JDK-8228316 Update double-conversion to version 3.1.5
763 Sean Coffey Oracle JDK-8228315 HotSpot compile-time error for x86-32
763 Sean Coffey Oracle JDK-8228313 CipherSpi ByteBuffer to byte array conversion fails for certain data overlap conditions
763 Sean Coffey Oracle JDK-8228312 Catch OOM from deopt that fails rematerializing objects
763 Sean Coffey Oracle JDK-8228311 tzdata2018i integration causes test failures on jdk-13
763 Sean Coffey Oracle JDK-8228310 NullPointerException at jdk.compiler/com.sun.tools.javac.jvm.Code.emitop0
763 Sean Coffey Oracle JDK-8228309 sun/security/tools/keytool/DefaultSignatureAlgorithm.java timed out
763 Sean Coffey Oracle JDK-8228308 GSS login fails with PREAUTH_FAILED
763 Sean Coffey Oracle JDK-8228307 Newly added sspi.cpp in JDK-6722928 still contains some small errors
763 Sean Coffey Oracle JDK-8228306 vmTestbase/jit/FloatingPoint/gen_math/Loops04/Loops04.java hits assert(((!attributes->uses_vl()) || (attributes->get_vector_len() == AVX_512bit) || (!_legacy_mode_vl) || (attributes->is_legacy_mode()))) failed: XMM register should be 0-15
763 Sean Coffey Oracle JDK-8228305 Graal crash with gcbasher
763 Sean Coffey Oracle JDK-8228304 [Graal] org.graalvm.compiler.api.directives.test.ProbabilityDirectiveTest fails with -Xcomp
763 Sean Coffey Oracle JDK-8228303 SEGV while collecting Klass statistics
763 Sean Coffey Oracle JDK-8228302 HeapInspection::find_instances_at_safepoint walks dead objects
763 Sean Coffey Oracle JDK-8228301 Era designator not displayed correctly using the COMPAT provider
763 Sean Coffey Oracle JDK-8228300 normal interpreter table is not restored after single stepping with TLH
763 Sean Coffey Oracle JDK-8228299 [Graal] Implement basic type consistency checks for Low level MH intrinsics
763 Sean Coffey Oracle JDK-8228298 Test failures on IBM platforms (power and s/390) after JDK-8223837
763 Sean Coffey Oracle JDK-8228297 [Graal] java/lang/String/CompactString/ tests fail with "GraalError: failed guarantee: no FrameState at DeoptimizingNode" in Graal -Xcomp mode
763 Sean Coffey Oracle JDK-8228296 compiler/graalunit/HotspotJdk9Test.java is timing out intermittently
763 Sean Coffey Oracle JDK-8228295 [Graal] Application SEGV in G1ParScanThreadState::copy_to_survivor_space(G1HeapRegionAttr, oopDesc*, markOopDesc*)+0x48
763 Sean Coffey Oracle JDK-8228294 Some swing gtk regression tests fail with "java.lang.InternalError: Unable to load native GTK libraries"
763 Sean Coffey Oracle JDK-8228293 Krb5Util::getTicketFromSubjectAndTgs is useless
763 Sean Coffey Oracle JDK-8228292 ZGC: ZHeapIterator visits potentially dead objects
763 Sean Coffey Oracle JDK-8228291 ZGC: C2: Generates on_weak barrier for WeakCompareAndSwap
763 Sean Coffey Oracle JDK-8228290 ZGC: C2: Generates on_weak instead of on_strong barriers
763 Sean Coffey Oracle JDK-8228289 Minor edits to launcher help text
763 Sean Coffey Oracle JDK-8228288 More clarification on possible sequencing error in GSSContext::unwrap
763 Sean Coffey Oracle JDK-8228287 KDC.java test behaves incorrectly when AS-REQ contains a PAData not PA-ENC-TS-ENC
763 Sean Coffey Oracle JDK-8228286 [JVMCI] java.* classes are no longer necessarily resolved by the boot class loader
763 Sean Coffey Oracle JDK-8228285 Shenandoah: trashing "Collection Set, Pinned" region during Degenerated GC
763 Sean Coffey Oracle JDK-8228284 JFR: Old Object Sample event slow on a deep heap in debug builds
763 Sean Coffey Oracle JDK-8228283 Kerberos login to Windows 2000 failed with "Inappropriate type of checksum in message"
763 Sean Coffey Oracle JDK-8228282 Excessive ServiceThread wakeups for OopStorage cleanup
763 Sean Coffey Oracle JDK-8228281 Accessibility errors in jdwp-protocol.html
763 Sean Coffey Oracle JDK-8228280 exclude compiler/intrinsics/sha/sanity tests from AOT runs
763 Sean Coffey Oracle JDK-8228279 reference to http://java.sun.com/products/JavaManagement/download.html
763 Sean Coffey Oracle JDK-8228278 Starting a JFR recording in response to JVMTI VMInit and / or Java agent premain corrupts memory
763 Sean Coffey Oracle JDK-8228277 JFR RootResolver resets CLD claims with no restore
763 Sean Coffey Oracle JDK-8228276 ZGC: Crash due to bad oops being spilled to stack in load barriers
763 Sean Coffey Oracle JDK-8228275 G1 asserts nmethod should not be unloaded during parallel code cache unloading
763 Sean Coffey Oracle JDK-8228274 No compilation error reported when yield is used in incorrect context
763 Sean Coffey Oracle JDK-8228273 Adjust permission for delayed starting of debugging
763 Sean Coffey Oracle JDK-8228272 Node budget asserts on x86_32/64
763 Sean Coffey Oracle JDK-8228271 compile error in libfollowref003.cpp with XCode 10.2 on macosx
763 Sean Coffey Oracle JDK-8228269 Make process_users_of_allocation handle gc barriers
763 Sean Coffey Oracle JDK-8228268 [JVMCI] Handle unpacking properly in Deoptimiziation::get_cached_box()
763 Sean Coffey Oracle JDK-8228267 jvmti/scenarios/contention/TC04/tc04t001/TestDescription.java fails on jvmti->InterruptThread (JVMTI_ERROR_THREAD_NOT_ALIVE)
763 Sean Coffey Oracle JDK-8228266 JVMCI: findUniqueConcreteMethod should handle statically bindable methods directly
763 Sean Coffey Oracle JDK-8228265 Test java/util/Locale/LocaleProvidersRun.java should enable assertions
763 Sean Coffey Oracle JDK-8228264 Setting the mgfHash in CK_RSA_PKCS_PSS_PARAMS has no effect
763 Sean Coffey Oracle JDK-8228263 Assertion in sun/util/locale/provider/CalendarDataUtility on Windows after JDK-8218960
763 Sean Coffey Oracle JDK-8228262 No compilation error when switch expression has no result expressions
763 Sean Coffey Oracle JDK-8228261 Add tests to support X25519 and X448 in TLS
763 Sean Coffey Oracle JDK-8228260 GTK is not being returned as the System L&F on Gnome.
763 Sean Coffey Oracle JDK-8228259 Hide the onjcmd option from the help output
763 Sean Coffey Oracle JDK-8228258 Safepoint counter can't be used for safepoint detection
763 Sean Coffey Oracle JDK-8228257 Create jtreg test for JDK-8222252
763 Sean Coffey Oracle JDK-8228256 AArch64: float point register corruption in ZBarrierSetAssembler::load_at
763 Sean Coffey Oracle JDK-8228255 Inconsistent info between pcsclite.md and MUSCLE headers
763 Sean Coffey Oracle JDK-8228254 [TESTBUG] runtime/appcds/sharedStrings/SysDictCrash.java failed with Cannot dump shared archive
763 Sean Coffey Oracle JDK-8228253 Missing `@` in code tags
763 Sean Coffey Oracle JDK-8228252 [BACKOUT] JDK-8221734 Deoptimize with handshakes
763 Sean Coffey Oracle JDK-8228250 The copyright footer should be enclosed in
763 Sean Coffey Oracle JDK-8228249 [TESTBUG] TestDockerMemoryMetrics.java fails with exitValue = 137
763 Sean Coffey Oracle JDK-8228248 [TESTBUG] JDK docker test TestSystemMetrics.java fails with access issues and OOM
763 Sean Coffey Oracle JDK-8228247 Provide specific links in KeyManagerFactory and TrustManagerFactory to the Standard Algorithm Names Specification
763 Sean Coffey Oracle JDK-8228246 jvmti/scenarios/contention/TC04/tc04t001/TestDescription.java still fails due to wrong number of MonitorContendedEntered events
763 Sean Coffey Oracle JDK-8228245 vmTestbase/nsk/jvmti/scenarios/contention/TC02/tc02t001/TestDescription.java failed
763 Sean Coffey Oracle JDK-8228244 Accessibility issues in javax/swing/plaf/nimbus/doc-files/properties.html
763 Sean Coffey Oracle JDK-8228243 Fix HTML in com/sun/jdi/doc-files/signature.html
763 Sean Coffey Oracle JDK-8228242 Fix HTML in table for jdk.zipfs module-info
763 Sean Coffey Oracle JDK-8228241 Race in SetupProcessMarkdown
763 Sean Coffey Oracle JDK-8228153 (tz) Upgrade time-zone data to tzdata2019a
763 Sean Coffey Oracle JDK-8228152 JDK 13 L10n resource files update - msgdrop 10
763 Sean Coffey Oracle JDK-8228148 assert(t->singleton()) failed: must be a constant
763 Sean Coffey Oracle JDK-8228135 MethodTypeDesc::resolveConstantDesc needs access check per the specification
764 Aleksey Shipilev Red Hat JDK-8228714 JVM crashes when bootstrap method for condy triggers loading of class whose static initializer throws exception
789 Ivan Gerasimov Google JDK-8227245 Reduce GC pressure during message digest calculations in password-based encryption

No changesets log

JDK-8234775 Release Note: Added 4 Amazon Root CA Certificates
JDK-8234216 Release Note: Added LuxTrust Global Root 2 Certificate
JDK-8228240 sun/security/tools/keytool/PSS.java timed out
JDK-8228238 (bf) MappedByteBuffer.force method may have no effect on implementation specific map modes
JDK-8228237 find-files.gmk gets corrupted if tab completion is used before running make first
JDK-8228236 jvmti/scenarios/contention/TC04/tc04t001/TestDescription.java fails due to wrong number of MonitorContendedEntered events
JDK-8228235 serviceability/dcmd/framework/VMVersionTest.java fails with a timeout
JDK-8228234 Fix command-line help text for javac -target
JDK-8228233 [AOT] Problem list serviceability/sa tests failed with AOTed java.base
JDK-8228231 bootcycle build uses wrong CDS archive
JDK-8228230 Curve in certificate should not affect signature scheme when using TLSv1.3
JDK-8228229 G1 GC: Undefined behaviour in G1BlockOffsetTablePart::block_at_or_preceding
JDK-8228228 ProblemList java/lang/constant/MethodTypeDescTest.java
JDK-8228227 ProblemList java/lang/reflect/PublicMethods/PublicMethodsTest.java
JDK-8228226 merge entries in hotspot problem lists
JDK-8228225 Reference to JNI spec on java.sun.com
JDK-8228224 problem list compiler/types/correctness tests
JDK-8228223 JFR crashed in JfrPeriodicEventSet::requestProtectionDomainCacheTableStatistics()
JDK-8228222 use of & instead of && in LibraryCallKit::arraycopy_restore_alloc_state
JDK-8228221 JShell : Stack trace of exception has wrong line number
JDK-8228220 JShell: corralled declarations do not have correct source to wrapper mapping
JDK-8228219 jdk/jshell/ExceptionsTest.java fails on Windows, after JDK-8198801
JDK-8228218 assert(thread->is_Java_thread()) failed: just checking
JDK-8228217 Jcmd fails to attach to the Java process on Linux using the main class name if whitespace options were used to launch the process
JDK-8228216 [Graal] compiler/jvmci/SecurityRestrictionsTest.java fails with AccessControlException
JDK-8228215 Shenandoah: Adjust SA to reflect recent forwarding pointer changes
JDK-8228214 Comparison builds are failing due to cacerts file
JDK-8228213 AsyncSSLSocketClose.java has timing issue
JDK-8228211 32-bit build failures after JDK-8080462 (Update SunPKCS11 provider with PKCS11 v2.40 support)
JDK-8228209 Add sun/security/pkcs11/tls/tls12/FipsModeTLS12.java to ProblemList for linux
JDK-8228157 Serial spec should be updated to reflect API generification
JDK-8228156 No documented method for setting module addexports to JNI_CreateJavaVM
JDK-8228149 Update javac man page with info about compilation modes
JDK-8228147 Several corrections to java FlightRecorderOptions section
JDK-8228138 Accessibility issues in specs/serialization/*.html
JDK-8228137 CTW of SPECjvm2008 hangs on windows-x64-debug
JDK-8228132 invalid HTML in AWT_Native_Interface.html
JDK-8228120 Incorrect parameters in Javadoc documentation
JDK-8228119 Use SHA-256 for javap classfile checksum
JDK-8228116 hotspot problem lists list unexciting tests

Committer push log

Alexey Ivanov, Oracle

Bug Summary
JDK-8229950 Reduce minRefreshTime for updating remote printer list on Windows

Christoph Langer, SAP

Bug Summary
JDK-8230753 (zipfs) zip file corruption when replacing an existing STORED entry
JDK-8228896 [aix] loadquery failed error reported
JDK-8232054 [PPC64] SA reads wrong slots from interpreter frames
JDK-8233897 [ppc]: Align ReservedCodeCacheSize default value with other platforms
JDK-8230381 [s390, PPC64] Exception check missing in interpreter
JDK-8233461 [s390, PPC64] More exception checks missing in interpreter
JDK-8231408 [TESTBUG] jdk/internal/platform/cgroup/TestCgroupMetrics.java fails for - memory:getMemoryUsage
JDK-8231831 [TESTBUG] runtime/containers/docker/TestMemoryAwareness.java test fails on SLES12
JDK-8231306 [TESTBUG] serviceability/sa/ClhsdbFindPC fails on AArch64
JDK-8232911 [x86] C2: SIGILL due to usage of SSSE3 instructions on processors which don't support it
JDK-8235706 Add Amazon Root CA certificates
JDK-8234853 Add LuxTrust certificate updates to the existing root program
JDK-8233898 exclude javax/swing/plaf/basic/BasicGraphicsUtils/8132119/bug8132119.java
JDK-8231832 Exclude serviceability/sa/TestInstanceKlassSize.java on linuxppc64 and linuxppc64le
JDK-8231758 False deadlock detection with -XX:+CIPrintCompileQueue after JDK-8163511
JDK-8232190 Fix/remove malformed assert in os_windows.cpp
JDK-8232189 handle long relative path specified in -Xbootclasspath/a on windows
JDK-8230383 java/net/MulticastSocket/NoLoopbackPackets.java fails on some AIX machines
JDK-8230384 jdk/jfr/event/runtime/TestShutdownEvent.java failed in validateStackTrace()
JDK-8230534 Perf::attach() should not throw a java.lang.Exception
JDK-8231830 Problem list java/awt/FontMetrics/MaxAdvanceIsMax.java on more platforms
JDK-8231307 Problemlist JFR TestNetworkUtilization test
JDK-8232159 provide function names in native stack trace on aix with xlc16
JDK-8230295 SA tools not providing option to connect to debug server
JDK-8234976 sun/security/lib/cacerts/VerifyCACerts.java fails due to wrong checksum
JDK-8232160 Test security/infra/java/security/cert/CertPathValidator/certification/ComodoCA.java fails because certificate was revoked
JDK-8231308 Test sun/tools/jcmd/TestProcessHelper.java fails intermittently
JDK-8231759 TestLinkageErrorInGenerateOopMap times out
JDK-8232191 Windows build fails after JDK-8191521
JDK-8231062 ZipFile reads wrong entry size from ZIP64 entries

Sean Coffey, Oracle

Bug Summary
JDK-8228153 (tz) Upgrade time-zone data to tzdata2019a
JDK-8228323 [aix] Disable jdk/java/lang/reflect/exeCallerAccessTest
JDK-8228252 [BACKOUT] JDK-8221734 Deoptimize with handshakes
JDK-8228295 [Graal] Application SEGV in G1ParScanThreadState::copy_to_survivor_space(G1HeapRegionAttr, oopDesc*, markOopDesc*)+0x48
JDK-8228299 [Graal] Implement basic type consistency checks for Low level MH intrinsics
JDK-8228297 [Graal] java/lang/String/CompactString/ tests fail with "GraalError: failed guarantee: no FrameState at DeoptimizingNode" in Graal -Xcomp mode
JDK-8228304 [Graal] org.graalvm.compiler.api.directives.test.ProbabilityDirectiveTest fails with -Xcomp
JDK-8228268 [JVMCI] Handle unpacking properly in Deoptimiziation::get_cached_box()
JDK-8228286 [JVMCI] java.* classes are no longer necessarily resolved by the boot class loader
JDK-8228334 [TESTBUG] appcds/SharedArchiveConsistency timed out
JDK-8228248 [TESTBUG] JDK docker test TestSystemMetrics.java fails with access issues and OOM
JDK-8228254 [TESTBUG] runtime/appcds/sharedStrings/SysDictCrash.java failed with Cannot dump shared archive
JDK-8228249 [TESTBUG] TestDockerMemoryMetrics.java fails with exitValue = 137
JDK-8228256 AArch64: float point register corruption in ZBarrierSetAssembler::load_at
JDK-8228281 Accessibility errors in jdwp-protocol.html
JDK-8228244 Accessibility issues in javax/swing/plaf/nimbus/doc-files/properties.html
JDK-8228791 Add SignTwice.java to problem list
JDK-8228807 Add sun/security/tools/jarsigner/PreserveRawManifestEntryAndDigest.java to problem list
JDK-8228261 Add tests to support X25519 and X448 in TLS
JDK-8228273 Adjust permission for delayed starting of debugging
JDK-8228148 assert(t->singleton()) failed: must be a constant
JDK-8228263 Assertion in sun/util/locale/provider/CalendarDataUtility on Windows after JDK-8218960
JDK-8230022 ByteArrayPublisher is not thread-safe resulting in broken re-use of HttpRequests
JDK-8228312 Catch OOM from deopt that fails rematerializing objects
JDK-8228313 CipherSpi ByteBuffer to byte array conversion fails for certain data overlap conditions
JDK-8228329 Colors with alpha are painted incorrectly on Linux, after JDK-8214579
JDK-8228271 compile error in libfollowref003.cpp with XCode 10.2 on macosx
JDK-8228296 compiler/graalunit/HotspotJdk9Test.java is timing out intermittently
JDK-8228257 Create jtreg test for JDK-8222252
JDK-8228813 Disable AggressiveUnboxing until JDK-8224957 is fixed
JDK-8228325 EnumSet.class serialization broken in JDK 9+
JDK-8228301 Era designator not displayed correctly using the COMPAT provider
JDK-8228282 Excessive ServiceThread wakeups for OopStorage cleanup
JDK-8228280 exclude compiler/intrinsics/sha/sanity tests from AOT runs
JDK-8228243 Fix HTML in com/sun/jdi/doc-files/signature.html
JDK-8228242 Fix HTML in table for jdk.zipfs module-info
JDK-8228324 Fix output dir for jlink_jre target in Images.gmk
JDK-8228275 G1 asserts nmethod should not be unloaded during parallel code cache unloading
JDK-8228305 Graal crash with gcbasher
JDK-8228308 GSS login fails with PREAUTH_FAILED
JDK-8228260 GTK is not being returned as the System L&F on Gnome.
JDK-8228319 GTK L&F: JSplitPane: There is no divider shown
JDK-8228302 HeapInspection::find_instances_at_safepoint walks dead objects
JDK-8228259 Hide the onjcmd option from the help output
JDK-8228315 HotSpot compile-time error for x86-32
JDK-8228255 Inconsistent info between pcsclite.md and MUSCLE headers
JDK-8228790 jarsigner breaks old signature with long lines in manifest
JDK-8228330 java/awt/Color/AlphaColorTest.java fails in linux-x64 system
JDK-8228328 javac crashes on text blocks with invalid escapes.
JDK-8228152 JDK 13 L10n resource files update - msgdrop 10
JDK-8228277 JFR RootResolver resets CLD claims with no restore
JDK-8228284 JFR: Old Object Sample event slow on a deep heap in debug builds
JDK-8228804 JNI upcalls should bypass class initialization barrier in c2i adapter
JDK-8228808 JVM crashes with shared archive file mismatch
JDK-8228322 JVM fails to detect mismatched or corrupt CDS archive
JDK-8228794 JVMCI deleteGlobalHandle doesn't delete the handle
JDK-8228266 JVMCI: findUniqueConcreteMethod should handle statically bindable methods directly
JDK-8228267 jvmti/scenarios/contention/TC04/tc04t001/TestDescription.java fails on jvmti->InterruptThread (JVMTI_ERROR_THREAD_NOT_ALIVE)
JDK-8228246 jvmti/scenarios/contention/TC04/tc04t001/TestDescription.java still fails due to wrong number of MonitorContendedEntered events
JDK-8228287 KDC.java test behaves incorrectly when AS-REQ contains a PAData not PA-ENC-TS-ENC
JDK-8228283 Kerberos login to Windows 2000 failed with "Inappropriate type of checksum in message"
JDK-8228802 keytool/fakegen/DefaultSignatureAlgorithm.java fails due to "exitValue = 6"
JDK-8228293 Krb5Util::getTicketFromSubjectAndTgs is useless
JDK-8228795 make it possible to use jtreg's -match via run-test framework
JDK-8228269 Make process_users_of_allocation handle gc barriers
JDK-8228135 MethodTypeDesc::resolveConstantDesc needs access check per the specification
JDK-8228289 Minor edits to launcher help text
JDK-8228253 Missing `@` in code tags
JDK-8228806 Missing license copyright header in some properties files
JDK-8228288 More clarification on possible sequencing error in GSSContext::unwrap
JDK-8228307 Newly added sspi.cpp in JDK-6722928 still contains some small errors
JDK-8228792 NMethod state machine is not monotonic
JDK-8228274 No compilation error reported when yield is used in incorrect context
JDK-8228262 No compilation error when switch expression has no result expressions
JDK-8228272 Node budget asserts on x86_32/64
JDK-8228300 normal interpreter table is not restored after single stepping with TLH
JDK-8228318 NoSuchAlgorithmException exception for SHA256withECDSA with RSASSA-PSS support
JDK-8228310 NullPointerException at jdk.compiler/com.sun.tools.javac.jvm.Code.emitop0
JDK-8228247 Provide specific links in KeyManagerFactory and TrustManagerFactory to the Standard Algorithm Names Specification
JDK-8228241 Race in SetupProcessMarkdown
JDK-8228279 reference to http://java.sun.com/products/JavaManagement/download.html
JDK-8228799 Remove mistaken open.iml
JDK-8228793 runtime/memory/RunUnitTestsConcurrently.java has a memory leak
JDK-8228812 s390: c1/c2 fail to add a metadata relocation in the static call stub.
JDK-8228789 S4U2proxy cannot continue because server's TGT cannot be found
JDK-8228258 Safepoint counter can't be used for safepoint detection
JDK-8228303 SEGV while collecting Klass statistics
JDK-8228786 Session Resumption without Server-Side State off by default
JDK-8228264 Setting the mgfHash in CK_RSA_PKCS_PSS_PARAMS has no effect
JDK-8228285 Shenandoah: trashing "Collection Set, Pinned" region during Degenerated GC
JDK-8228810 SignTwice.java failed with java.io.FileNotFoundException: File name too long
JDK-8228803 SignTwice.java fails intermittently on Windows
JDK-8228294 Some swing gtk regression tests fail with "java.lang.InternalError: Unable to load native GTK libraries"
JDK-8228278 Starting a JFR recording in response to JVMTI VMInit and / or Java agent premain corrupts memory
JDK-8228796 sun/management/jmxremote/bootstrap/JMXInterfaceBindingTest.java fails due to java.rmi.server.ExportException: Port already in use
JDK-8228320 sun/net/www/protocol/file/DirPermissionDenied.java failed on Windows 2016 because DirPermissionDenied directory has no read permission
JDK-8228309 sun/security/tools/keytool/DefaultSignatureAlgorithm.java timed out
JDK-8228298 Test failures on IBM platforms (power and s/390) after JDK-8223837
JDK-8228265 Test java/util/Locale/LocaleProvidersRun.java should enable assertions
JDK-8232059 Test java/util/zip/FlaterTest.java fails with -Xcheck:jni
JDK-8228250 The copyright footer should be enclosed in
JDK-8228797 tools/sjavac/IdleShutdown.java fails with AssertionError: Error too big on windows
JDK-8228311 tzdata2018i integration causes test failures on jdk-13
JDK-8228798 unicode.md and icu.md text should be pre-formatted
JDK-8228805 unproblem list applications/ctw/modules/* tests on windows
JDK-8228809 Update copyright year to 2019 for several java properties file
JDK-8228316 Update double-conversion to version 3.1.5
JDK-8228801 Update nroff version of man pages
JDK-8228326 Update NUM_CDS_REGIONS and CURRENT_CDS_ARCHIVE_VERSION in cds.h
JDK-8228787 Updates to Stateless Resumption
JDK-8233505 Upgrading Joni License version to 2.1.16
JDK-8228306 vmTestbase/jit/FloatingPoint/gen_math/Loops04/Loops04.java hits assert(((!attributes->uses_vl()) || (attributes->get_vector_len() == AVX_512bit) || (!_legacy_mode_vl) || (attributes->is_legacy_mode()))) failed: XMM register should be 0-15
JDK-8228245 vmTestbase/nsk/jvmti/scenarios/contention/TC02/tc02t001/TestDescription.java failed
JDK-8228321 Wrong JRE targets in Images.gmk after JDK-8219971
JDK-8228811 ZGC: C2 loads and load barriers can get separated by safepoints
JDK-8228291 ZGC: C2: Generates on_weak barrier for WeakCompareAndSwap
JDK-8228290 ZGC: C2: Generates on_weak instead of on_strong barriers
JDK-8228276 ZGC: Crash due to bad oops being spilled to stack in load barriers
JDK-8228292 ZGC: ZHeapIterator visits potentially dead objects

Dmitry Markov, Oracle

Bug Summary
JDK-8230300 ctrl-F1 does not show the tooltip of a menu item (JMenuItems)
JDK-8231876 Robot.createScreenCapture() fails if “awt.robot.gtk” is set to false

Ivan Gerasimov, Google

Bug Summary
JDK-8231091 JDB hangs when running monitor command
JDK-8227245 Reduce GC pressure during message digest calculations in password-based encryption
JDK-8234007 TEST_BUG jdk/java/net/CookieHandler/B6791927.java hit hardcoded expiration date

Laurent Bourgès, Independent

Bug Summary
JDK-8230399 Path rendered incorrectly when it goes outside the clipping region
JDK-8231771 Thin stroked shapes are not rendered if affine transform has flip bit

Per Liden, Oracle

Bug Summary
JDK-8232269 ZGC: Redesign C2 load barrier to expand on the MachNode level

Philip Race, Oracle

Bug Summary
JDK-8230358 WindowsServerCore 1809 does not provide d2d1.dll library required by awt.dll

Robert Mckenna, Oracle

Bug Summary
JDK-8231204 (fs) FileStore::isReadOnly is always true on macOS Catalina
JDK-8229102 8213232 causes crashes on solaris sparc64
JDK-8229504 [TESTBUG] jdk.jfr.e.g.c.TestGCHeapConfigurationEventWith32BitOops.java does not expect MinHeapSize to be aligned to HeapAlignment
JDK-8229198 [TESTBUG] Make docker tests podman compatible
JDK-8229107 [Yaru] GTK L&F: There is no difference between menu selected and de-selected
JDK-8229098 AArch64: Fix interpreter code at JVMCI deoptimization entry
JDK-8229503 C2 compilation fails with assert: Bad graph detected in build_loop_late
JDK-8233611 Fontmetrics for large Fonts has zero width
JDK-8227662 freetype seeks to index at the end of the font data
JDK-8230955 HOST locale provider holds wrong era name for GregorianCalendar in US locale
JDK-8229987 java.lang.UnsatisfiedLinkError: net.dll: Can't find dependent libraries
JDK-8229505 JDK 13 L10n resource files update - msg drop 20
JDK-8229242 JDK 13.0.1 L10n resource files update msg drop 10
JDK-8229106 jdk/internal/platform/cgroup/TestCgroupMetrics.java - NumberFormatException because of large long values (memory limit_in_bytes)
JDK-8229199 jdk/net/Sockets/Test.java fails after JDK-8227642
JDK-8229099 Kitchensink fails "assert((((klass)->trace_id() & (JfrTraceIdEpoch::leakp_in_use_this_epoch_bit())) != 0)) failed: invariant"
JDK-8229502 Locale API doc has redundant hyphens for some parameters
JDK-8229101 New library dependencies due to JDK-8222720
JDK-8229103 Regression caused by JDK-8214542 not installing complete checkpoint data to candidates
JDK-8230049 Resolve permissions for code source URLs lazily
JDK-8229105 runtime/SharedArchiveFile/CheckDefaultArchiveFile.java test fails on AIX
JDK-8230276 setRequestProperty(key, null) results in HTTP header without colon in request
JDK-8229197 Switching to an infinite socket timeout on Windows leads to high CPU load
JDK-8229104 test GetTotalSafepointTime.java fails on fast Linux machines with Total safepoint time 0 ms
JDK-8229100 Upgrade libpng to 1.6.37

Ramanand Patil, IBM

Bug Summary
JDK-8229323 (tz) Upgrade time-zone data to tzdata2019b
JDK-8231838 (tz) Upgrade time-zone data to tzdata2019c
JDK-8231833 TZ database in "vanguard" format support

Sergey Bylokhov, Amazon

Bug Summary
JDK-8232750 [macos 10.15] The String "X Y Z" was not set to application's icon in the taskbar
JDK-8233060 [macos] java/awt/GraphicsDevice/CheckDisplayModes.java fails

Aleksey Shipilev, Red Hat

Bug Summary
JDK-8231761 [Shenandoah] guarantee(d != NULL) failed: Null dominator info
JDK-8230745 Epsilon does not extend TLABs to max size
JDK-8232971 Epsilon should warn about Xms/Xmx/AlwaysPreTouch configuration
JDK-8228714 JVM crashes when bootstrap method for condy triggers loading of class whose static initializer throws exception
JDK-8230488 Shenandoah forces +UseNUMAInterleaving even after explicitly disabled
JDK-8231763 Shenandoah: Fix register clash in SBSA::resolve_forwarding_pointer() borrowing
JDK-8231762 Shenandoah: JVMTI heap walking cleanup crashes with NULL forwardee
JDK-8231760 Shenandoah: Missing node types in ShenandoahLoadReferenceBarrier::needs_barrier_impl()

Vladimir Kempik, Azul

Bug Summary
JDK-8231944 (fs) Increase buffer size used with getmntent
JDK-8234164 Proxied HttpsURLConnection doesn't send BODY when retrying POST request

Yasumasa Suenaga, NTT DATA

Bug Summary
JDK-8230375 sadebugd/DebugdConnectTest.java fails due to "java.rmi.NotBoundException: SARemoteDebugger"