PUSHES REPORT: 13.0.4

This report shows who pushed the backports to the given release. This usually shows who did the backporting, testing, and review work.

Report generated: Wed Sep 01 04:00:24 CEST 2021

Distribution by priority

Count Priority
30 P2
162 P3
191 P4
6 P5

Distribution by components

Count Component
389 Total
164 (42.2%) hotspot
81 (20.8%) hotspot/compiler
40 (10.3%) hotspot/runtime
16 (4.1%) hotspot/gc
11 (2.8%) hotspot/jfr
8 (2.1%) hotspot/svc-agent
3 (0.8%) hotspot/svc
2 (0.5%) hotspot/jvmti
2 (0.5%) hotspot
1 (0.3%) hotspot/test
84 (21.6%) client-libs
38 (9.8%) client-libs/java.awt
22 (5.7%) client-libs/2d
16 (4.1%) client-libs/javax.swing
4 (1.0%) client-libs
2 (0.5%) client-libs/javax.accessibility
1 (0.3%) client-libs/javax.sound
1 (0.3%) client-libs/javax.imageio
51 (13.1%) core-libs
11 (2.8%) core-libs/java.nio
10 (2.6%) core-libs/java.net
5 (1.3%) core-libs/java.lang
4 (1.0%) core-libs/java.nio.charsets
4 (1.0%) core-libs/java.util.jar
3 (0.8%) core-libs
3 (0.8%) core-libs/javax.naming
2 (0.5%) core-libs/java.util
2 (0.5%) core-libs/java.lang.invoke
2 (0.5%) core-libs/java.io
2 (0.5%) core-libs/java.util:i18n
1 (0.3%) core-libs/java.util:collections
1 (0.3%) core-libs/java.time
1 (0.3%) core-libs/java.text
37 (9.5%) security-libs
18 (4.6%) security-libs/javax.net.ssl
12 (3.1%) security-libs/java.security
3 (0.8%) security-libs/javax.crypto:pkcs11
1 (0.3%) security-libs/javax.smartcardio
1 (0.3%) security-libs/jdk.security
1 (0.3%) security-libs/javax.xml.crypto
1 (0.3%) security-libs/javax.crypto
25 (6.4%) infrastructure
22 (5.7%) infrastructure/build
3 (0.8%) infrastructure
13 (3.3%) tools
5 (1.3%) tools/launcher
4 (1.0%) tools/jlink
1 (0.3%) tools/jconsole
1 (0.3%) tools/javac
1 (0.3%) tools/javadoc(tool)
1 (0.3%) tools
10 (2.6%) core-svc
5 (1.3%) core-svc/debugger
2 (0.5%) core-svc/javax.management
1 (0.3%) core-svc/tools
1 (0.3%) core-svc
1 (0.3%) core-svc/java.lang.instrument
5 (1.3%) xml
4 (1.0%) xml/jaxp
1 (0.3%) xml/javax.xml.parsers

Distribution by affiliation

Count Committer
389 Total
387 (99.5%) Azul
142 (36.5%) Andrew Brygin
121 (31.1%) Dmitry Cherepanov
69 (17.7%) Yuri Nesterenko
55 (14.1%) Vladimir Kempik
2 (0.5%) Red Hat
2 (0.5%) Andrew Hughes

Chronological push log:

Days Ago Committer Affiliation Bug Summary
413 Andrew Brygin Azul JDK-8249353 Unexpected NoSuchAlgorithmException when using secure random impl from BCFIPS provider
431 Andrew Brygin Azul JDK-8248406 Some zipfs tests fail with AccessControlException
432 Andrew Brygin Azul JDK-8247998 New System Properties to configure the TLS signature schemes
435 Andrew Brygin Azul JDK-8247991 (zipfs) Updating an existing zip file does not preserve original permissions
438 Andrew Brygin Azul JDK-8247919 [ntintel] asserts about copying unaligned array element
439 Andrew Brygin Azul JDK-8247865 SSLSocket.getSession() doesn't close connection for timeout/ interrupts
439 Andrew Brygin Azul JDK-8247864 Choose the default SecureRandom algo based on registration ordering
442 Andrew Brygin Azul JDK-8247603 Generate stripped/public pdbs on Windows for jdk images
442 Andrew Brygin Azul JDK-8247602 [TESTBUG] appcds/CommandLineFlagComboNegative.java does not handle archive mapping failure
442 Dmitry Cherepanov Azul JDK-8247596 AudioSystem.getMixerInfo() takes about 30 sec to report a gone audio device
442 Dmitry Cherepanov Azul JDK-8247595 Copyright info (Year) should be updated for fix of 8241638
442 Dmitry Cherepanov Azul JDK-8247594 launcher time metrics always report 1 on Linux when _JAVA_LAUNCHER_DEBUG set
442 Andrew Brygin Azul JDK-8247588 x86_32 build failures after JDK-8226721 (Missing intrinsics for Math.ceil, floor, rint)
442 Andrew Brygin Azul JDK-8247587 Missing intrinsics for Math.ceil, floor, rint
442 Andrew Brygin Azul JDK-8247565 JVM crashes after transformation in C2 IdealLoopTree::split_fall_in
446 Yuri Nesterenko Azul JDK-8247406 JVM uses excessive memory with -XX:+EnableJVMCI -XX:JVMCICounterSize=2147483648
446 Dmitry Cherepanov Azul JDK-8247395 Remove Comodo root certificate that is expiring in May 2020
446 Dmitry Cherepanov Azul JDK-8247394 Remove DocuSign root certificate that is expiring in May 2020
446 Andrew Brygin Azul JDK-8247386 Default SSLEngine should create in server role
446 Andrew Brygin Azul JDK-8247385 ProcessHandle.Info command with non-English shows question marks
446 Andrew Brygin Azul JDK-8247384 freetype path does not disable TrueType hinting with AA+FM hints
446 Andrew Brygin Azul JDK-8247383 enhance posix print_rlimit_info
447 Andrew Brygin Azul JDK-8247356 Missing entitlements for hardened runtime
447 Andrew Brygin Azul JDK-8247355 macOS codesign fail on macOS 10.13.5 or older
447 Andrew Brygin Azul JDK-8247349 Deep sign macOS bundles before bundle archive is being created
447 Andrew Brygin Azul JDK-8247348 Enable macOS codesigning for all libraries and executables
447 Dmitry Cherepanov Azul JDK-8247344 Test SetBoundsPaintTest.html failed on Windows when desktop is scaled
447 Dmitry Cherepanov Azul JDK-8247343 [TESTBUG] The test java/awt/Window/GetScreenLocation/GetScreenLocationTest.java fails on HiDPI screen
447 Dmitry Cherepanov Azul JDK-8247342 DragSourceEvent.getLocation() returns wrong value on HiDPI screens (Windows)
447 Dmitry Cherepanov Azul JDK-8247341 Popup menus and tooltips flicker with previous popup contents when first shown
447 Dmitry Cherepanov Azul JDK-8247340 Problem List ICMColorDataTest.java
447 Dmitry Cherepanov Azul JDK-8247339 sun/java2d/GdiRendering/InsetClipping.java fails
447 Yuri Nesterenko Azul JDK-8247337 Wrong implementation of VMState.hasListener
447 Dmitry Cherepanov Azul JDK-8247323 [TESTBUG] exclude Container tests from hotspot_misc group
447 Yuri Nesterenko Azul JDK-8247322 Zero VM crashes when handling dynamic constant
447 Andrew Brygin Azul JDK-8247303 compiler/cpuflags/TestAESIntrinsicsOnUnsupportedConfig.java fails on aarch64
447 Andrew Brygin Azul JDK-8247302 make 4.3 breaks build
447 Andrew Brygin Azul JDK-8247301 Fix undefined behavior in Canonicalizer::do_ShiftOp
448 Andrew Brygin Azul JDK-8247257 Incorrect method tag offset for big endian platform
448 Yuri Nesterenko Azul JDK-8247233 [TESTBUG] compiler/loopopts/TestLoopUnswitchingLostCastDependency.java fails with release VMs
448 Yuri Nesterenko Azul JDK-8247232 Loop unswitching may cause dependence on null check to be lost
448 Yuri Nesterenko Azul JDK-8247231 TESTBUG: jdk regression test javax/management/loading/MletParserLocaleTest.java reduce default timeout
448 Yuri Nesterenko Azul JDK-8247230 [TESTBUG] Test command error in hotspot/jtreg/compiler/loopopts/superword/SumRedAbsNeg_Float.java
448 Dmitry Cherepanov Azul JDK-8247228 XToolkit: Misread of screen information memory
448 Dmitry Cherepanov Azul JDK-8247227 Invalid "sun.awt.TimedWindowEvent" object leads to JVM crash
448 Dmitry Cherepanov Azul JDK-8247226 [macos] The NestedModelessDialogTest test make the macOS unstable
448 Dmitry Cherepanov Azul JDK-8247225 [macOS 10.14] Methods of Java Robot should be called from appropriate thread
448 Dmitry Cherepanov Azul JDK-8247224 java/awt/Window/Grab/GrabTest.java fails on Windows
448 Dmitry Cherepanov Azul JDK-8247223 Incorrect JNU_ReleaseStringPlatformChars in Windows Print
448 Dmitry Cherepanov Azul JDK-8247222 Toolkit.getScreenInsets(GraphicsConfiguration) may throw ClassCastException
448 Yuri Nesterenko Azul JDK-8247217 java/util/concurrent tests fail with -XX:+VerifyGraphEdges: assert(!VerifyGraphEdges) failed: verification should have failed
448 Dmitry Cherepanov Azul JDK-8247211 [TESTBUG] The JDK-8039467 bug appeared on macOS
448 Dmitry Cherepanov Azul JDK-8247210 [TESTBUG] [macos 10.15] java/awt/Graphics/DrawImageBG/SystemBgColorTest.java fails
448 Dmitry Cherepanov Azul JDK-8247209 setMaximizedBounds is broken with large display scale and multiple monitors
448 Dmitry Cherepanov Azul JDK-8247208 Frame#setMaximizedbounds not working properly in multi screen environments
448 Dmitry Cherepanov Azul JDK-8247207 Replace ID2D1Factory::GetDesktopDpi with GetDeviceCaps
448 Dmitry Cherepanov Azul JDK-8247206 systemScale.cpp could not compile with VS2019
448 Dmitry Cherepanov Azul JDK-8247205 NamingManager should cache InitialContextFactory
448 Yuri Nesterenko Azul JDK-8247199 Update Xerces to Version 2.12.1
448 Andrew Brygin Azul JDK-8247198 set relro in linker flags when building with gcc
448 Andrew Brygin Azul JDK-8247197 Performance regression after fix for JDK-8229496
448 Andrew Brygin Azul JDK-8247196 [REDO] JDK-8204128 NMT might report incorrect numbers for Compiler area
448 Yuri Nesterenko Azul JDK-8246865 Use consistent predicate order in and with PhaseIdealLoop::find_predicate
448 Yuri Nesterenko Azul JDK-8246864 IdealLoopTree::dump_head predicate printing is broken
448 Yuri Nesterenko Azul JDK-8246863 SuperWord::co_locate_pack picks memory state of first instead of last load
448 Dmitry Cherepanov Azul JDK-8246841 Small charset issues (ISO8859-16, x-eucJP-Open, x-IBM834 and x-IBM949C)
448 Dmitry Cherepanov Azul JDK-8246840 XMLEncoder/Test4625418.java fails due to "Error: Cp943 - can't read properly"
448 Dmitry Cherepanov Azul JDK-8246839 Put JDK-8239965 on the ProblemList.txt
448 Dmitry Cherepanov Azul JDK-8246838 IBM-943 charset encoder needs updating
448 Andrew Brygin Azul JDK-8246831 remove HaltNode code after uncommon trap calls
448 Andrew Brygin Azul JDK-8246830 Some perf regressions after 8225653
448 Andrew Brygin Azul JDK-8246829 Provide more information when hitting SIGILL from HaltNode
448 Andrew Brygin Azul JDK-8246828 Resource allocated BitMaps are often cleared unnecessarily
448 Andrew Brygin Azul JDK-8246827 Incorrect PrintCompilation message: made not compilable on levels 0 1 2 3 4
448 Andrew Brygin Azul JDK-8246826 Memory leak in Type::hashcons
448 Andrew Brygin Azul JDK-8246825 Incorrect use of binary operators on booleans in type.cpp
448 Andrew Brygin Azul JDK-8246824 ClassCastException when calling FlightRecorderMXBean#getRecordings()
448 Andrew Brygin Azul JDK-8246823 Invert JvmtiExport::post_vm_initialized() and Jfr:on_vm_start() start-up order for correct option parsing
448 Andrew Brygin Azul JDK-8246822 java.lang.Class.isPrimitive() (C1) returns wrong result if Klass* is aligned to 32bit
449 Dmitry Cherepanov Azul JDK-8246768 java/nio/channels/SocketChannel/AdaptSocket.java fails on Windows 10
449 Dmitry Cherepanov Azul JDK-8246767 java/nio/channels/Selector/SelectWithConsumer.java failed at testTwoChannels()
449 Dmitry Cherepanov Azul JDK-8246766 [ntintel] asserts about copying unaligned array
449 Dmitry Cherepanov Azul JDK-8246765 (fs) UserPrincipalLookupService.lookupXXX failure with IOE "Operation not permitted"
449 Dmitry Cherepanov Azul JDK-8246764 Modifying ArrayList.subList().subList() resets modCount of subList
449 Dmitry Cherepanov Azul JDK-8246763 (zipfs) Potential memory leak with zip provider
449 Dmitry Cherepanov Azul JDK-8246762 Windows handle Leak when starting processes using ProcessBuilder
449 Yuri Nesterenko Azul JDK-8246760 Update test documentation with additional settings for client UI tooltip tests
449 Yuri Nesterenko Azul JDK-8246759 Add notes for PKCS11 tests in the test doc
449 Yuri Nesterenko Azul JDK-8246758 Update test document by changing "TIMEOUT" to "TIMEOUT_FACTOR"
449 Yuri Nesterenko Azul JDK-8246757 Add JDK-8010500 to compiler/loopopts/superword/TestFuzzPreLoop.java bug list
452 Andrew Brygin Azul JDK-8246701 enhance print_full_memory_info on Linux by THP related information
452 Andrew Brygin Azul JDK-8246700 CodeHeap::blob_count() overestimates the number of blobs
452 Andrew Brygin Azul JDK-8246699 Use WeakReference for lastFontStrike for created Fonts
452 Yuri Nesterenko Azul JDK-8246698 Further cleanup to test serviceability/sa/ClhsdbCDSCore.java
452 Yuri Nesterenko Azul JDK-8246695 build broken when configured with --with-zlib=bundled on gcc 7.3
452 Yuri Nesterenko Azul JDK-8246692 Various minor fixes
452 Andrew Brygin Azul JDK-8246688 CheckUnhandledOops breaks NULL check in Modules::define_module
452 Andrew Brygin Azul JDK-8246687 JVM crashes after transformation in C2 IdealLoopTree::merge_many_backedges
452 Andrew Brygin Azul JDK-8246686 Memory leak if -XX:CompileCommand is set
452 Andrew Brygin Azul JDK-8246685 assert(mem == (Node*)1 || mem == mem2) failed: multiple Memories being matched at once?
452 Andrew Brygin Azul JDK-8246684 Segfault in JNIHandleBlock::oops_do()
452 Andrew Brygin Azul JDK-8246683 crash HeapWord*ParallelScavengeHeap::failed_mem_allocate
452 Andrew Brygin Azul JDK-8246682 build failure on Linux after 8235243
452 Andrew Brygin Azul JDK-8246681 handle VS2017 15.9 and VS2019 in abstract_vm_version
452 Yuri Nesterenko Azul JDK-8246675 GetOwnedMonitorInfoWithEATest.java fails with ZGC: Heap too small
452 Andrew Brygin Azul JDK-8246674 PhaseCFG::schedule_pinned_nodes cannot handle precedence edges from unmatched CFG nodes correctly
452 Andrew Brygin Azul JDK-8246673 [TESTBUG] test/hotspot/jtreg/runtime/StackGuardPages/TestStackGuardPages.java: exeinvoke.c: must initialize static state before calling do_overflow()
452 Andrew Brygin Azul JDK-8246672 ShouldNotReachHere in PhaseIdealLoop::verify_strip_mined_scheduling
452 Andrew Brygin Azul JDK-8246671 C2: assert(i >= req() || i == 0 || is_Region() || is_Phi()) with -XX:+VerifyGraphEdges
452 Andrew Brygin Azul JDK-8246670 C2: assert(((n) == __null || !VerifyIterativeGVN || !((n)->is_dead()))) failed: can not use dead node
452 Andrew Brygin Azul JDK-8246669 CTW: C2 compilation fails with assert(just_allocated_object(alloc_ctl) == ptr) failed: most recent allo
452 Andrew Brygin Azul JDK-8246668 CTW: Split applications/ctw/modules/jdk_localedata.java
452 Andrew Brygin Azul JDK-8246667 CTW runner should sweep nmethods more aggressively
452 Andrew Brygin Azul JDK-8246666 CTW runner closes standard output on exit
452 Andrew Brygin Azul JDK-8246665 assert(is_MachReturn()) running CTW with fix for JDK-8231291
452 Andrew Brygin Azul JDK-8246664 CTW: C2 compilation fails with "malformed control flow"
452 Yuri Nesterenko Azul JDK-8246647 RFC unconformity of HttpURLConnection with proxy
452 Yuri Nesterenko Azul JDK-8246646 Replace wildcard address with loopback or local host in tests - part 20
453 Dmitry Cherepanov Azul JDK-8246621 Add failing client jtreg tests to the Problem List
453 Dmitry Cherepanov Azul JDK-8246620 [macos] PIT: java/awt/Choice/ChoiceKeyEventReaction/ChoiceKeyEventReaction.java fails
453 Dmitry Cherepanov Azul JDK-8246619 Regression automated test 'open/test/jdk/javax/swing/JInternalFrame/8145896/TestJInternalFrameMaximize.java' fails
453 Dmitry Cherepanov Azul JDK-8246618 javax/swing/JInternalFrame/Test6325652.java fails
453 Dmitry Cherepanov Azul JDK-8246617 Update ProblemList.txt to exclude failing headful tests on macos
453 Dmitry Cherepanov Azul JDK-8246616 [macos 10.15] Windows in fullscreen tests jumps around the screen
453 Dmitry Cherepanov Azul JDK-8246615 [TESTBUG] The arrow image is blue instead of green
453 Dmitry Cherepanov Azul JDK-8246614 JTextPane does not show images in HTML rendering
453 Vladimir Kempik Azul JDK-8246608 Use -lobjc instead of -fobjc-link-runtime in libosxsecurity
453 Vladimir Kempik Azul JDK-8246607 JvmtiTagMap::weak_oops_do() should not trigger barriers
453 Vladimir Kempik Azul JDK-8246606 check calloc rv in libinstrument InvocationAdapter
453 Vladimir Kempik Azul JDK-8246605 TestInstanceCloneAsLoadsStores.java fails with -XX:+StressGCM
453 Vladimir Kempik Azul JDK-8246604 [JVMCI] Fix single implementor speculation for diamond shapes.
453 Yuri Nesterenko Azul JDK-8246601 Algorithmic Italic font leans opposite angle in Printing
453 Vladimir Kempik Azul JDK-8246599 hs test serviceability/sa/ClhsdbCDSCore.java fails on macOS 10.15
453 Vladimir Kempik Azul JDK-8246598 Add more custom hooks in Bundles.gmk
453 Vladimir Kempik Azul JDK-8246597 Add virtualization information output to hs_err file on macOS
453 Vladimir Kempik Azul JDK-8246596 libproc_impl.c previous_thr may be used uninitialized warning
453 Vladimir Kempik Azul JDK-8246595 C2's UseUniqueSubclasses optimization is broken for array accesses
453 Yuri Nesterenko Azul JDK-8246589 Problemlist additional compiler/rtm tests
453 Dmitry Cherepanov Azul JDK-8246584 NULL-check return value of SurfaceData_InitOps on macosx
453 Dmitry Cherepanov Azul JDK-8246583 Broken merge between JDK-8006406 and JDK-8003559
453 Dmitry Cherepanov Azul JDK-8246582 Access Bridge lacks html tags parsing
453 Dmitry Cherepanov Azul JDK-8246581 [macosx] Two apostrophes are entered instead of one with "U.S. International - PC" layout
453 Dmitry Cherepanov Azul JDK-8246580 A few client tests leave mouse buttons pressed
453 Dmitry Cherepanov Azul JDK-8246579 JAWS reports wrong number of radio buttons when buttons are hidden
453 Dmitry Cherepanov Azul JDK-8246578 [TESTBUG]Some jtreg tests fail when CAPS_LOCK is ON
453 Dmitry Cherepanov Azul JDK-8246577 [TESTBUG] java/awt/Focus/DisposedWindow/DisposeDialogNotActivateOwnerTest/DisposeDialogNotActivateOwnerTest.java fails on linux-x64 nightly
453 Dmitry Cherepanov Azul JDK-8246576 [TESTBUG] java/awt/Mouse/EnterExitEvents/ModalDialogEnterExitEventsTest.java fails in Windows
453 Dmitry Cherepanov Azul JDK-8246575 Fix for JDK-8214578 breaks OS X 10.12 compatibility
453 Dmitry Cherepanov Azul JDK-8246574 [macos] Problem with backslashes on macOS/JIS keyboard: Java ignores system settings
453 Dmitry Cherepanov Azul JDK-8246573 [TEST_BUG] Test javax/swing/plaf/basic/BasicMenuUI/4983388/bug4983388.java fails with shortcuts on menus do not work
453 Yuri Nesterenko Azul JDK-8246571 Turkey Time Zone returns incorrect time zone name
453 Andrew Brygin Azul JDK-8246568 libsspi_bridge does not build on Windows 32bit
453 Andrew Brygin Azul JDK-8246567 [win][x86] vtable stub generation: assert failure (code size estimate)
453 Andrew Brygin Azul JDK-8246566 [win][x86] vtable stub generation: assert failure (code size estimate) follow-up
453 Andrew Brygin Azul JDK-8246565 Reversed arguments in call to strstr in freetype "debug" code.
453 Andrew Brygin Azul JDK-8246564 ClassCastException can happen when fontconfig.properties is used
453 Andrew Brygin Azul JDK-8246563 Infinite loop when rendering huge lines
453 Andrew Brygin Azul JDK-8246562 Support for configure option --with-native-debug-symbols=internal is impossible on Windows
453 Andrew Brygin Azul JDK-8246561 Make Visual Studio compiler check less strict
453 Andrew Brygin Azul JDK-8246560 [macos] JavaFX SwingNode is not rendered on macOS
453 Andrew Brygin Azul JDK-8246559 (se) Stack overflow during selection operation leads to crash (win)
453 Yuri Nesterenko Azul JDK-8246548 Give more meaningful InternalError messages in Deflater.c
453 Yuri Nesterenko Azul JDK-8246547 Simplify JarFile.isInitializing
454 Yuri Nesterenko Azul JDK-8246479 Class loading deadlock involving X509Factory#commitEvent()
454 Dmitry Cherepanov Azul JDK-8246475 The ordering of Cipher Suites is not maintained provided through “jdk.tls.client.cipherSuites” and “jdk.tls.server.cipherSuites” system property.
454 Dmitry Cherepanov Azul JDK-8246474 Some security tests should support TLSv1.3
454 Dmitry Cherepanov Azul JDK-8246473 Compare version info of Santuario to legal notice
454 Dmitry Cherepanov Azul JDK-8246472 Missing hash characters for header on license file
454 Dmitry Cherepanov Azul JDK-8246471 Mismatch in jsse.enableMFLNExtension property name
454 Vladimir Kempik Azul JDK-8246464 remove obsolete NET_ReadV
454 Vladimir Kempik Azul JDK-8246463 [TESTBUG] compiler/aot/fingerprint/SelfChangedCDS.java fails when cds is disabled
454 Vladimir Kempik Azul JDK-8246462 Crash in AdapterHandlerLibrary::get_adapter with CDS due to code cache exhaustion
454 Vladimir Kempik Azul JDK-8246461 Test crashed with assert(phi->operand_count() != 1 || phi->subst() != phi) failed: missed trivial simplification
454 Vladimir Kempik Azul JDK-8246460 Test8004741.java failed due to "Too few ThreadDeath hits; expected at least 6 but saw only 5"
454 Vladimir Kempik Azul JDK-8246459 MethodHandles::tryFinally generates illegal bytecode for long/double return types
454 Andrew Brygin Azul JDK-8246457 RunTest sometimes fails to produce valid exitcode.txt
454 Andrew Brygin Azul JDK-8246456 Refactor some com.sun.jdi tests to enable IDE integration
454 Vladimir Kempik Azul JDK-8246450 Minimal build broken after JDK-8233494
454 Yuri Nesterenko Azul JDK-8246449 Fix copyrights after JDK-8240629 change
454 Yuri Nesterenko Azul JDK-8246448 argfiles parsing broken for argfiles with comment cross 4096 bytes chunk
454 Yuri Nesterenko Azul JDK-8246447 Upgrading JSZip from v3.1.5 to v3.2.2
454 Yuri Nesterenko Azul JDK-8246446 Javac treats Manifest Class-Path entries as Paths instead of URLs
454 Yuri Nesterenko Azul JDK-8246445 FSInfo#getJarClassPath throws an exception not declared in its throws clause
454 Yuri Nesterenko Azul JDK-8246444 Crash if classpath is read from @argument file and the main gets option argument
454 Andrew Brygin Azul JDK-8246439 aarch64: remove unnecessary load of mdo when profiling return and parameters type
454 Andrew Brygin Azul JDK-8246438 aarch64: missing memory barrier in NewObjectArrayStub and NewTypeArrayStub
454 Andrew Brygin Azul JDK-8246437 aarch64: C2 OSR compilation fails with "shouldn't process one node several times" in final graph reshaping
454 Andrew Brygin Azul JDK-8246428 [TESTBUG] compiler/c2/TestJumpTable.java fails with release VMs
454 Andrew Brygin Azul JDK-8246427 Incorrect G1StringDedupEntry type used in StringDedupTable destructor
454 Andrew Brygin Azul JDK-8246426 C2 fails with assert(false) failed: bad AD file
454 Andrew Brygin Azul JDK-8246425 struct SwitchRange in HS violates C++ One Definition Rule
454 Andrew Brygin Azul JDK-8246424 assert(!VerifyHashTableKeys || _hash_lock == 0) failed: remove node from hash table before modifying it
454 Andrew Brygin Azul JDK-8246423 C2: assert(out->in(PhiNode::Region) == head || out->in(PhiNode::Region) == slow_head) failed: phi must be either part of the slow or the fast loop
454 Andrew Brygin Azul JDK-8246422 [C2] Memory leaks during tracing after "8224193: stringStream should not use Resource Area".
454 Andrew Brygin Azul JDK-8246421 C1 register allocation failure with T_ADDRESS
454 Andrew Brygin Azul JDK-8246420 enhance print_rlimit_info in os_posix
454 Andrew Brygin Azul JDK-8246419 handle return values of sscanf calls in hotspot
454 Andrew Brygin Azul JDK-8246418 C2 produces wrong result while unswitching a loop due to lost control dependencies
454 Andrew Brygin Azul JDK-8246417 Strip mined loop verification fails with assert(is_OuterStripMinedLoop()) failed: invalid node class
454 Andrew Brygin Azul JDK-8246416 C1 compilation fails with -XX:+PrintIRDuringConstruction -XX:+Verbose
454 Andrew Brygin Azul JDK-8246415 java.util.zip.CRC32 performance drop after 8200067
454 Andrew Brygin Azul JDK-8246414 assert(false) failed: Bad graph detected in get_early_ctrl_for_expensive
454 Andrew Brygin Azul JDK-8246413 AVX 512 instructions inadvertently used on Xeon for small vector width operations
454 Andrew Brygin Azul JDK-8246412 add OS uptime information to os::print_os_info output
454 Andrew Brygin Azul JDK-8246411 C2: Memory stomp in max_array_length() for T_ILLEGAL type
454 Andrew Brygin Azul JDK-8246410 enhance os::get_core_path on macOS
454 Andrew Brygin Azul JDK-8246409 C1: Incorrect result of field load due to missing narrowing conversion
454 Andrew Brygin Azul JDK-8246408 infinite loop in LogOutputList::wait_until_no_readers()
455 Dmitry Cherepanov Azul JDK-8246367 Deal with ECDSA using ecdsa-with-SHA2 plus hash algorithm as AlgorithmId
455 Dmitry Cherepanov Azul JDK-8246366 Add exception for expiring Comodo roots to VerifyCACerts test
455 Dmitry Cherepanov Azul JDK-8246365 Add exception for expiring DocuSign root to VerifyCACerts test
455 Dmitry Cherepanov Azul JDK-8246364 Missing key_share extension for (EC)DHE key exchange should alert missing_extension
455 Dmitry Cherepanov Azul JDK-8246363 Keytool generates wrong expiration date if validity is set to 2050/01/01
455 Dmitry Cherepanov Azul JDK-8246362 give better error output for invalid OCSP response intervals in CertPathValidator checks
455 Dmitry Cherepanov Azul JDK-8246361 Hard coded loop limit prevents reading of smart card data greater than 8k
455 Dmitry Cherepanov Azul JDK-8246360 JSSE Client does not throw SSLException when an alert occurs during handshaking
455 Andrew Brygin Azul JDK-8246329 Missing constant pool entry for a method in stacktrace
455 Yuri Nesterenko Azul JDK-8246328 ActionListeners on JRadioButtons don't get notified when selection is changed with arrow keys
455 Yuri Nesterenko Azul JDK-8246327 ICC_Profile has un-needed, not-empty finalize method
455 Yuri Nesterenko Azul JDK-8246324 Java does not render Myanmar script correctly
455 Yuri Nesterenko Azul JDK-8246322 Object monitor deadlock with no threads holding the monitor (using jemalloc 5.1)
455 Dmitry Cherepanov Azul JDK-8246321 exclude jtreg test security/infra/java/security/cert/CertPathValidator/certification/LuxTrustCA.java because of instabilities
455 Dmitry Cherepanov Azul JDK-8246320 sun/security/ssl/X509TrustManagerImpl tests support TLSv1.3
455 Dmitry Cherepanov Azul JDK-8246319 Revert TLS 1.3 change that wrapped IOExceptions
455 Dmitry Cherepanov Azul JDK-8246317 javax/net/ssl/TLS tests support TLSv1.3
455 Dmitry Cherepanov Azul JDK-8246316 javax/net/ssl/templates/SSLSocketSSLEngineTemplate.java fails intermittently with "java.lang.Exception: Unexpected EOF"
455 Dmitry Cherepanov Azul JDK-8246315 ProblemList javax/net/ssl/templates/SSLSocketSSLEngineTemplate.java
455 Dmitry Cherepanov Azul JDK-8246314 javax/net/ssl/templates/SSLSocketSSLEngineTemplate.java supports TLSv1.3
455 Dmitry Cherepanov Azul JDK-8246313 SSLSocket closes socket both socket endpoints on a SocketTimeoutException
455 Dmitry Cherepanov Azul JDK-8246312 sunmscapi.dll causing EXCEPTION_ACCESS_VIOLATION
459 Andrew Brygin Azul JDK-8246160 TestMetadataRetention fails due to missing symbol id
459 Vladimir Kempik Azul JDK-8246149 [TESTBUG] Problemlist JFR compiler/TestCodeSweeper.java
459 Vladimir Kempik Azul JDK-8246148 Add another regression test for JDK-8134739
459 Vladimir Kempik Azul JDK-8246147 Problemlist SA tests with AOT
459 Vladimir Kempik Azul JDK-8246146 [TESTBUG] Test JFR API from Java agent
459 Yuri Nesterenko Azul JDK-8246144 Deadlock with ClassLoader.findLibrary and System.loadLibrary call
459 Andrew Brygin Azul JDK-8246142 Remove NULL checks before FREE_C_HEAP_ARRAY
459 Andrew Brygin Azul JDK-8243616 OldObjectSample event creates unexpected amount of checkpoint data
459 Vladimir Kempik Azul JDK-8246140 Call cache flush after generating trampoline.
459 Vladimir Kempik Azul JDK-8246139 C1: PatchingStub for field access copies too much
459 Vladimir Kempik Azul JDK-8246138 Avoid calling MallocTracker::record_malloc and record_free when NMT is off
459 Vladimir Kempik Azul JDK-8246137 JFR - nmetods - misspelled in several places
459 Vladimir Kempik Azul JDK-8246136 Improve the code coverage for ThreadLocal
459 Yuri Nesterenko Azul JDK-8246131 Update CUP to v0.11b
459 Yuri Nesterenko Azul JDK-8246124 [TESTBUG] VeryEarlyAssertTest.java validating "END." marker at lastline is not always true
459 Yuri Nesterenko Azul JDK-8246123 tools/jlink/plugins/VendorInfoPluginsTest.java times out
459 Yuri Nesterenko Azul JDK-8246122 [TESTBUG] tools/jlink/plugins/VendorInfoPluginsTest.java fails with debug or non-server VMs
459 Yuri Nesterenko Azul JDK-8246121 runtime/ErrorHandling/VeryEarlyAssertTest.java fails after 8232080
459 Yuri Nesterenko Azul JDK-8246120 jlink plugins for vendor information and command-line options
460 Andrew Brygin Azul JDK-8246079 AArch64: fix warnings and errors with Clang and GCC 8.3
460 Andrew Brygin Azul JDK-8246072 new sun.misc.Signal("INFO") throws IllegalArgumentException since JDK11
460 Andrew Brygin Azul JDK-8246071 is shown in jstack mixed mode
460 Andrew Brygin Azul JDK-8246070 Visual Studio install found through --with-tools-dir value is discarded
460 Andrew Brygin Azul JDK-8246069 jfr tool can't format duration values greater than 1 minute
460 Andrew Brygin Azul JDK-8246068 Linux os::available_memory re-reads cgroup configuration on every invocation
460 Andrew Brygin Azul JDK-8246067 Syntax error in toolchain_windows.m4
460 Andrew Brygin Azul JDK-8246066 Should disable Escape Analysis if JVMTI capability can_get_owned_monitor_info was taken
460 Andrew Brygin Azul JDK-8246065 use string literal for format string when handling PauseAtStartupFile
460 Andrew Brygin Azul JDK-8246064 Destination option missing in FlightRecorderMXBeanImpl
460 Dmitry Cherepanov Azul JDK-8246063 Rendering artifacts with LCD text and fractional metrics
460 Dmitry Cherepanov Azul JDK-8246062 Text spaced incorrectly by drawString under rotation with fractional metrics
460 Dmitry Cherepanov Azul JDK-8246061 [macos 10.15] test/jdk/java/awt/color/EqualityTest/EqualityTest.java may fail
460 Dmitry Cherepanov Azul JDK-8246060 JSpinner and changing value by mouse
460 Dmitry Cherepanov Azul JDK-8246059 The "AutoTestOnTop.java" test may run external applications
460 Dmitry Cherepanov Azul JDK-8246058 Duplicate attribution in freetype.md
460 Dmitry Cherepanov Azul JDK-8246057 Upgrade to freetype 2.10.1
460 Dmitry Cherepanov Azul JDK-8246056 [TESTBUG] CustomFont.java cannot find font file
460 Yuri Nesterenko Azul JDK-8246055 Build static versions of certain JDK libraries
460 Yuri Nesterenko Azul JDK-8246054 Add hooks for custom output dir in Bundles.gmk
461 Dmitry Cherepanov Azul JDK-8245980 PIT: test/jdk/javax/swing/text/html/TestJLabelWithHTMLText.java times out in linux-x64
461 Dmitry Cherepanov Azul JDK-8245979 PIT: java/awt/font/WindowsIndicFonts.java fails on windows10
461 Dmitry Cherepanov Azul JDK-8245978 Rare NPE at WComponentPeer.getGraphics()
461 Dmitry Cherepanov Azul JDK-8245977 NPE in LWWindowPeer.getOnscreenGraphics()
461 Dmitry Cherepanov Azul JDK-8245976 [macOS] Dark mode for the desktop is not supported
461 Dmitry Cherepanov Azul JDK-8245975 [macos] NPE was thrown at expanding Choice from maximized frame
461 Dmitry Cherepanov Azul JDK-8245974 [macos 10.15] java/awt/Window/LocationAtScreenCorner/LocationAtScreenCorner.java may fail
461 Dmitry Cherepanov Azul JDK-8245973 Intermittent NPE in Component.validate()
461 Dmitry Cherepanov Azul JDK-8245972 Test java/awt/EventQueue/NonComponentSourcePost.java is unstable
461 Dmitry Cherepanov Azul JDK-8245971 [macosx] Java2D Queue Flusher crash on OSX after switching between user accounts
461 Vladimir Kempik Azul JDK-8245966 Fix copyright headers in hotspot (missing comma after year)
461 Vladimir Kempik Azul JDK-8245965 [TESTBUG] compiler/{jvmci,aot} tests should not run with GCs that do not support JVMCI/AOT
461 Vladimir Kempik Azul JDK-8245964 ZGC: vmTestbase/nsk/jvmti/Allocate/alloc001/ fails
461 Vladimir Kempik Azul JDK-8245963 CoreDocumentImpl.setXmlVersion NPE
461 Vladimir Kempik Azul JDK-8245962 ZGC: vmTestbase/nsk/jvmti/ResourceExhausted/resexhausted002 fails
461 Yuri Nesterenko Azul JDK-8245960 Docked MacBook cannot start any Java Swing applications
461 Vladimir Kempik Azul JDK-8245949 Sinking load out of loop may trigger: assert(found_sfpt) failed: no node in loop that's not input to safepoint
461 Vladimir Kempik Azul JDK-8245948 hs_err should print coalesced safepoint operations in Events section
461 Vladimir Kempik Azul JDK-8245947 serviceability/sa/TestJmapCore tests fail with java.lang.RuntimeException: Could not find dump file
461 Vladimir Kempik Azul JDK-8245946 ConnectionGraph::unique_java_object(Node* N) return NULL if n is not in the CG
461 Vladimir Kempik Azul JDK-8245945 C2: Let ConnectionGraph::not_global_escape(Node* n) return false if n is not in the CG
461 Dmitry Cherepanov Azul JDK-8245936 sun/net/ftp/FtpURLConnectionLeak.java fails intermittently with NPE
461 Dmitry Cherepanov Azul JDK-8245935 Migrate SimpleDateFormatConstTest to JDK Repo
461 Dmitry Cherepanov Azul JDK-8245934 java/net/DatagramPacket/ReuseBuf.java failed due to timeout
461 Dmitry Cherepanov Azul JDK-8245933 Add a new test to verify that DatagramSocket is not interruptible
461 Dmitry Cherepanov Azul JDK-8245932 Worker has a deadlock bug
461 Dmitry Cherepanov Azul JDK-8245931 Tag mismatch may alert bad_record_mac
461 Dmitry Cherepanov Azul JDK-8245930 replace JLI_StrTok in java_md_solinux.c
462 Andrew Hughes Red Hat JDK-8245857 x86_32 build failure after JDK-8227269
462 Andrew Hughes Red Hat JDK-8245856 Slow class loading when running with JDWP
462 Andrew Brygin Azul JDK-8245819 AArch64: Purge method call format support
462 Andrew Brygin Azul JDK-8245818 Use of an uninitialized register in 32-bit ARM template interpreter
462 Andrew Brygin Azul JDK-8245817 Garbage collectors should register JFR types themselves to avoid build errors.
462 Andrew Brygin Azul JDK-8245816 Move G1 trace code from gcTrace* to G1 directory
462 Andrew Brygin Azul JDK-8245815 TestTimeMultiple.java failed "assert(!lease()) failed: invariant"
462 Dmitry Cherepanov Azul JDK-8245808 Fail fast if the handshake type is unknown
462 Dmitry Cherepanov Azul JDK-8245807 The logic of java/net/ipv6tests/TcpTest.java is flawed
462 Dmitry Cherepanov Azul JDK-8245806 java/net/Authenticator/B4769350.java failed intermittently
462 Dmitry Cherepanov Azul JDK-8245805 jdk/internal/jimage/JImageOpenTest.java runs no test
462 Dmitry Cherepanov Azul JDK-8245804 java.security.Provider.getService returns random result due to race condition with mutating methods in the same class
462 Dmitry Cherepanov Azul JDK-8245803 SunPKCS11 provider needs to check more details on PKCS11 Mechanism
462 Dmitry Cherepanov Azul JDK-8245802 LdapContext#reconnect always opens a new connection
462 Vladimir Kempik Azul JDK-8245794 [TESTBUG] runtime/StackTrace/HiddenFrameTest.java fails with release VM
462 Vladimir Kempik Azul JDK-8245793 ShowHiddenFrames use in java_lang_StackTraceElement::fill_in appears broken
462 Vladimir Kempik Azul JDK-8245792 Replace wildcard address with loopback or local host in tests - part 14
462 Vladimir Kempik Azul JDK-8245791 C2 compilation fails with assert "m has strange control"
462 Vladimir Kempik Azul JDK-8245790 StackFrameInfo::getByteCodeIndex returns wrong value if bci > 32767
462 Vladimir Kempik Azul JDK-8245789 java.security.Provider#getServices order is no longer deterministic
462 Andrew Brygin Azul JDK-8245784 Missing -Xcheck:jni checking for DeleteWeakGlobalRef
462 Andrew Brygin Azul JDK-8245783 Use AS_NO_KEEPALIVE loads in HeapDumper
462 Andrew Brygin Azul JDK-8245782 make UseSwitchProfiling non-experimental or false by-default
462 Andrew Brygin Azul JDK-8245781 [Redo] jstat reports incorrect values for OU for CMS GC
462 Andrew Brygin Azul JDK-8245780 Memory leak due to vtable stubs not being shared on SPARC
462 Andrew Brygin Azul JDK-8245779 C2 compilation fails due to unschedulable graph if DominatorSearchLimit is reached
462 Andrew Brygin Azul JDK-8245778 False failure of GenericTaskQueue::pop_local on architectures with weak memory model
462 Andrew Brygin Azul JDK-8245777 Failure on CPUs allowing loads reordering: assert(_tasks[t] == 1) failed: What else?
462 Yuri Nesterenko Azul JDK-8245776 check ZALLOC return values in awt coding
462 Yuri Nesterenko Azul JDK-8245775 Crash at sun.awt.X11.XlibWrapper.XkbGetUpdatedMap when change keybord map
462 Yuri Nesterenko Azul JDK-8245774 check malloc/calloc results in java.desktop
462 Yuri Nesterenko Azul JDK-8245771 Introduce a system property to disable eager lambda initialization
462 Yuri Nesterenko Azul JDK-8245769 Upgrade IANA Language Subtag Registry to the latest for JDK14
466 Andrew Brygin Azul JDK-8245647 BufferedReader performance can be improved by using StringBuilder
466 Yuri Nesterenko Azul JDK-8245639 java.io.File.isInvalid() is racy
466 Yuri Nesterenko Azul JDK-8245638 Missing closedir call with JDK-8223490
466 Yuri Nesterenko Azul JDK-8245637 Optimize search algorithm for determining default time zone
466 Yuri Nesterenko Azul JDK-8245636 (fs) Files.write can leak file descriptor in the exception case
466 Yuri Nesterenko Azul JDK-8245613 CriticalJNINatives: dll handling should be done in native thread state
467 Andrew Brygin Azul JDK-8245549 Assert triggers with -XX:+StressReflectiveCode
467 Andrew Brygin Azul JDK-8245548 Add --with-extra-asflags configure option
467 Andrew Brygin Azul JDK-8245547 Class redefinition fails when condy instructions are removed
467 Dmitry Cherepanov Azul JDK-8245542 Update BCEL version to 6.3.1 in license file
467 Dmitry Cherepanov Azul JDK-8245541 BCEL: update to version 6.3.1
467 Andrew Brygin Azul JDK-8245534 Remove built-in AArch64 simulator
467 Yuri Nesterenko Azul JDK-8245531 call ReleaseStringUTFChars before early returns in Java_sun_security_pkcs11_wrapper_PKCS11_connect
467 Yuri Nesterenko Azul JDK-8245530 missing ReleaseStringUTFChars in java.desktop native code
467 Yuri Nesterenko Azul JDK-8245529 missing ReleaseStringUTFChars in serviceability native code
468 Dmitry Cherepanov Azul JDK-8245454 Compilation error in mach5 java/awt/FileDialog/MacOSGoToFolderCrash.java
468 Dmitry Cherepanov Azul JDK-8245453 [macos] Crash with use of native file dialog
468 Yuri Nesterenko Azul JDK-8245442 BufImg_SetupICM add ReleasePrimitiveArrayCritical call in early return
468 Yuri Nesterenko Azul JDK-8245441 [TEST_BUG] Some tests should check isDisplayChangeSupported
468 Yuri Nesterenko Azul JDK-8245440 avoid incompatible pointer to integer conversion initializing gint in gtk2_interface
469 Vladimir Kempik Azul JDK-8245301 Some tests in serviceability/sa run with fixed -Xmx values and risk running out of memory
469 Vladimir Kempik Azul JDK-8245300 ProblemList gc/stress/gclocker/TestExcessGCLockerCollections.java
469 Vladimir Kempik Azul JDK-8245299 NativeLookup::lookup_critical_entry() should only load shared library once
469 Vladimir Kempik Azul JDK-8245298 Unnecessary GCLocker-initiated young GCs
469 Vladimir Kempik Azul JDK-8245297 Problemlist compiler/rtm tests
469 Dmitry Cherepanov Azul JDK-8245279 [macos] NullPointerException getting bounds of GraphicsConfiguration
469 Dmitry Cherepanov Azul JDK-8245278 [macos] access to window property of NSView on wrong thread
469 Andrew Brygin Azul JDK-8245277 Build fails when --with-vendor-name contains a comma
470 Vladimir Kempik Azul JDK-8245213 MacVolumesTest failed after upgrade to MacOS Catalina
470 Vladimir Kempik Azul JDK-8245212 C2's conditional move optimization fails with assert(bol->Opcode() == Op_Bool) failed
470 Vladimir Kempik Azul JDK-8245211 C2: ShouldNotReachHere() in verify_strip_mined_scheduling
470 Vladimir Kempik Azul JDK-8245209 (fs) Add test for macOS Catalina changes to protect system software
470 Vladimir Kempik Azul JDK-8245207 ZGC: Fix incorrect statistics
470 Vladimir Kempik Azul JDK-8245189 [TESTBUG] sun/tools/jhsdb/JShellHeapDumpTest.java fails with RuntimeException 'JShellToolProvider' missing from stdout/stderr
470 Vladimir Kempik Azul JDK-8245188 build.log output from failing commands : include the hs_error file path in case of crashes in build
470 Vladimir Kempik Azul JDK-8245187 jhsdb jmap fails to write binary heap dump of a jshell process
470 Yuri Nesterenko Azul JDK-8245180 check malloc/calloc results in jdk.hotspot.agent
470 Dmitry Cherepanov Azul JDK-8245176 add os::dll_load to the unified logging os category
470 Dmitry Cherepanov Azul JDK-8245175 java_props_macosx.c - provide missing CFRelease for CFLocaleCopyCurrent
470 Andrew Brygin Azul JDK-8245173 AIOOBE in GIFImageReader.initializeStringTable
473 Dmitry Cherepanov Azul JDK-8245110 (tz) Upgrade time-zone data to tzdata2020a
473 Andrew Brygin Azul JDK-8245109 test/jdk/sanity/client/SwingSet/src/ColorChooserDemoTest.java failed
473 Andrew Brygin Azul JDK-8245108 Correct the format of ColorChooserDemoTest
473 Andrew Brygin Azul JDK-8245105 Enable argument profiling for sun.misc.Unsafe.put*/get*
473 Andrew Brygin Azul JDK-8245104 JVM crash in klassItable::initialize_itable_for_interface(int, InstanceKlass*, bool, Thread*)
473 Andrew Brygin Azul JDK-8245103 Print NMT statistics on fatal errors
473 Andrew Brygin Azul JDK-8245102 templateInterpreter.cpp: copy_table() needs to be safer
473 Andrew Brygin Azul JDK-8245101 MetaspaceUtils::print_report crashes when called before initialization
473 Andrew Brygin Azul JDK-8245100 JVM::printFlags fails in native OOM situations
473 Andrew Brygin Azul JDK-8245099 C1 dumps incorrect class name in ClassCastException message
473 Yuri Nesterenko Azul JDK-8245080 Java_java_net_NetworkInterface_getByName0 on unix misses ReleaseStringUTFChars in early return
474 Dmitry Cherepanov Azul JDK-8245014 ChaCha20-Poly1305 TLS cipher suite decryption throws ShortBufferException
474 Andrew Brygin Azul JDK-8245010 com/sun/jndi/ldap/privconn/RunTest.java failed due to hang in LdapRequest.getReplyBer
474 Andrew Brygin Azul JDK-8245009 ZipFile/MultiThreadedReadTest.java timed out in tier1
474 Yuri Nesterenko Azul JDK-8245008 (ch) AsynchronousFileChannel hangs with internal error when reading locked file
490 Andrew Brygin Azul JDK-8243980 jhsdb jmap from OpenJDK 11.0.5 doesn't work if prelink is enabled
490 Andrew Brygin Azul JDK-8243979 SA can't handle prelinked libraries
503 Yuri Nesterenko Azul JDK-8242843 Incorrect Roboto font rendering on Windows with subpixel antialiasing
517 Yuri Nesterenko Azul JDK-8241913 Bump update version for OpenJDK: jdk-13.0.4

No changesets log

Committer push log

Andrew Hughes, Red Hat

Bug Summary
JDK-8245856 Slow class loading when running with JDWP
JDK-8245857 x86_32 build failure after JDK-8227269

Andrew Brygin, Azul

Bug Summary
JDK-8246559 (se) Stack overflow during selection operation leads to crash (win)
JDK-8247991 (zipfs) Updating an existing zip file does not preserve original permissions
JDK-8246071 is shown in jstack mixed mode
JDK-8246422 [C2] Memory leaks during tracing after "8224193: stringStream should not use Resource Area".
JDK-8246560 [macos] JavaFX SwingNode is not rendered on macOS
JDK-8247919 [ntintel] asserts about copying unaligned array element
JDK-8247196 [REDO] JDK-8204128 NMT might report incorrect numbers for Compiler area
JDK-8245781 [Redo] jstat reports incorrect values for OU for CMS GC
JDK-8247602 [TESTBUG] appcds/CommandLineFlagComboNegative.java does not handle archive mapping failure
JDK-8246428 [TESTBUG] compiler/c2/TestJumpTable.java fails with release VMs
JDK-8246673 [TESTBUG] test/hotspot/jtreg/runtime/StackGuardPages/TestStackGuardPages.java: exeinvoke.c: must initialize static state before calling do_overflow()
JDK-8246567 [win][x86] vtable stub generation: assert failure (code size estimate)
JDK-8246566 [win][x86] vtable stub generation: assert failure (code size estimate) follow-up
JDK-8246437 aarch64: C2 OSR compilation fails with "shouldn't process one node several times" in final graph reshaping
JDK-8246079 AArch64: fix warnings and errors with Clang and GCC 8.3
JDK-8246438 aarch64: missing memory barrier in NewObjectArrayStub and NewTypeArrayStub
JDK-8245819 AArch64: Purge method call format support
JDK-8246439 aarch64: remove unnecessary load of mdo when profiling return and parameters type
JDK-8245548 Add --with-extra-asflags configure option
JDK-8246412 add OS uptime information to os::print_os_info output
JDK-8245173 AIOOBE in GIFImageReader.initializeStringTable
JDK-8245549 Assert triggers with -XX:+StressReflectiveCode
JDK-8246424 assert(!VerifyHashTableKeys || _hash_lock == 0) failed: remove node from hash table before modifying it
JDK-8246414 assert(false) failed: Bad graph detected in get_early_ctrl_for_expensive
JDK-8246665 assert(is_MachReturn()) running CTW with fix for JDK-8231291
JDK-8246685 assert(mem == (Node*)1 || mem == mem2) failed: multiple Memories being matched at once?
JDK-8246413 AVX 512 instructions inadvertently used on Xeon for small vector width operations
JDK-8245647 BufferedReader performance can be improved by using StringBuilder
JDK-8245277 Build fails when --with-vendor-name contains a comma
JDK-8246682 build failure on Linux after 8235243
JDK-8246416 C1 compilation fails with -XX:+PrintIRDuringConstruction -XX:+Verbose
JDK-8245099 C1 dumps incorrect class name in ClassCastException message
JDK-8246421 C1 register allocation failure with T_ADDRESS
JDK-8246409 C1: Incorrect result of field load due to missing narrowing conversion
JDK-8245779 C2 compilation fails due to unschedulable graph if DominatorSearchLimit is reached
JDK-8246426 C2 fails with assert(false) failed: bad AD file
JDK-8246418 C2 produces wrong result while unswitching a loop due to lost control dependencies
JDK-8246670 C2: assert(((n) == __null || !VerifyIterativeGVN || !((n)->is_dead()))) failed: can not use dead node
JDK-8246671 C2: assert(i >= req() || i == 0 || is_Region() || is_Phi()) with -XX:+VerifyGraphEdges
JDK-8246423 C2: assert(out->in(PhiNode::Region) == head || out->in(PhiNode::Region) == slow_head) failed: phi must be either part of the slow or the fast loop
JDK-8246411 C2: Memory stomp in max_array_length() for T_ILLEGAL type
JDK-8246688 CheckUnhandledOops breaks NULL check in Modules::define_module
JDK-8247864 Choose the default SecureRandom algo based on registration ordering
JDK-8245547 Class redefinition fails when condy instructions are removed
JDK-8246564 ClassCastException can happen when fontconfig.properties is used
JDK-8246824 ClassCastException when calling FlightRecorderMXBean#getRecordings()
JDK-8246700 CodeHeap::blob_count() overestimates the number of blobs
JDK-8245010 com/sun/jndi/ldap/privconn/RunTest.java failed due to hang in LdapRequest.getReplyBer
JDK-8247303 compiler/cpuflags/TestAESIntrinsicsOnUnsupportedConfig.java fails on aarch64
JDK-8245108 Correct the format of ColorChooserDemoTest
JDK-8246683 crash HeapWord*ParallelScavengeHeap::failed_mem_allocate
JDK-8246666 CTW runner closes standard output on exit
JDK-8246667 CTW runner should sweep nmethods more aggressively
JDK-8246664 CTW: C2 compilation fails with "malformed control flow"
JDK-8246669 CTW: C2 compilation fails with assert(just_allocated_object(alloc_ctl) == ptr) failed: most recent allo
JDK-8246668 CTW: Split applications/ctw/modules/jdk_localedata.java
JDK-8247349 Deep sign macOS bundles before bundle archive is being created
JDK-8247386 Default SSLEngine should create in server role
JDK-8246064 Destination option missing in FlightRecorderMXBeanImpl
JDK-8245105 Enable argument profiling for sun.misc.Unsafe.put*/get*
JDK-8247348 Enable macOS codesigning for all libraries and executables
JDK-8246410 enhance os::get_core_path on macOS
JDK-8247383 enhance posix print_rlimit_info
JDK-8246701 enhance print_full_memory_info on Linux by THP related information
JDK-8246420 enhance print_rlimit_info in os_posix
JDK-8245777 Failure on CPUs allowing loads reordering: assert(_tasks[t] == 1) failed: What else?
JDK-8245778 False failure of GenericTaskQueue::pop_local on architectures with weak memory model
JDK-8247301 Fix undefined behavior in Canonicalizer::do_ShiftOp
JDK-8247384 freetype path does not disable TrueType hinting with AA+FM hints
JDK-8245817 Garbage collectors should register JFR types themselves to avoid build errors.
JDK-8247603 Generate stripped/public pdbs on Windows for jdk images
JDK-8246419 handle return values of sscanf calls in hotspot
JDK-8246681 handle VS2017 15.9 and VS2019 in abstract_vm_version
JDK-8246427 Incorrect G1StringDedupEntry type used in StringDedupTable destructor
JDK-8247257 Incorrect method tag offset for big endian platform
JDK-8246827 Incorrect PrintCompilation message: made not compilable on levels 0 1 2 3 4
JDK-8246825 Incorrect use of binary operators on booleans in type.cpp
JDK-8246408 infinite loop in LogOutputList::wait_until_no_readers()
JDK-8246563 Infinite loop when rendering huge lines
JDK-8246823 Invert JvmtiExport::post_vm_initialized() and Jfr:on_vm_start() start-up order for correct option parsing
JDK-8246822 java.lang.Class.isPrimitive() (C1) returns wrong result if Klass* is aligned to 32bit
JDK-8246415 java.util.zip.CRC32 performance drop after 8200067
JDK-8246069 jfr tool can't format duration values greater than 1 minute
JDK-8243980 jhsdb jmap from OpenJDK 11.0.5 doesn't work if prelink is enabled
JDK-8245104 JVM crash in klassItable::initialize_itable_for_interface(int, InstanceKlass*, bool, Thread*)
JDK-8246687 JVM crashes after transformation in C2 IdealLoopTree::merge_many_backedges
JDK-8247565 JVM crashes after transformation in C2 IdealLoopTree::split_fall_in
JDK-8245100 JVM::printFlags fails in native OOM situations
JDK-8246568 libsspi_bridge does not build on Windows 32bit
JDK-8246068 Linux os::available_memory re-reads cgroup configuration on every invocation
JDK-8247355 macOS codesign fail on macOS 10.13.5 or older
JDK-8247302 make 4.3 breaks build
JDK-8245782 make UseSwitchProfiling non-experimental or false by-default
JDK-8246561 Make Visual Studio compiler check less strict
JDK-8245780 Memory leak due to vtable stubs not being shared on SPARC
JDK-8246686 Memory leak if -XX:CompileCommand is set
JDK-8246826 Memory leak in Type::hashcons
JDK-8245101 MetaspaceUtils::print_report crashes when called before initialization
JDK-8245784 Missing -Xcheck:jni checking for DeleteWeakGlobalRef
JDK-8246329 Missing constant pool entry for a method in stacktrace
JDK-8247356 Missing entitlements for hardened runtime
JDK-8247587 Missing intrinsics for Math.ceil, floor, rint
JDK-8245816 Move G1 trace code from gcTrace* to G1 directory
JDK-8246072 new sun.misc.Signal("INFO") throws IllegalArgumentException since JDK11
JDK-8247998 New System Properties to configure the TLS signature schemes
JDK-8243616 OldObjectSample event creates unexpected amount of checkpoint data
JDK-8247197 Performance regression after fix for JDK-8229496
JDK-8246674 PhaseCFG::schedule_pinned_nodes cannot handle precedence edges from unmatched CFG nodes correctly
JDK-8245103 Print NMT statistics on fatal errors
JDK-8247385 ProcessHandle.Info command with non-English shows question marks
JDK-8246829 Provide more information when hitting SIGILL from HaltNode
JDK-8246456 Refactor some com.sun.jdi tests to enable IDE integration
JDK-8245534 Remove built-in AArch64 simulator
JDK-8246831 remove HaltNode code after uncommon trap calls
JDK-8246142 Remove NULL checks before FREE_C_HEAP_ARRAY
JDK-8246828 Resource allocated BitMaps are often cleared unnecessarily
JDK-8246565 Reversed arguments in call to strstr in freetype "debug" code.
JDK-8246457 RunTest sometimes fails to produce valid exitcode.txt
JDK-8243979 SA can't handle prelinked libraries
JDK-8246684 Segfault in JNIHandleBlock::oops_do()
JDK-8247198 set relro in linker flags when building with gcc
JDK-8246066 Should disable Escape Analysis if JVMTI capability can_get_owned_monitor_info was taken
JDK-8246672 ShouldNotReachHere in PhaseIdealLoop::verify_strip_mined_scheduling
JDK-8246830 Some perf regressions after 8225653
JDK-8248406 Some zipfs tests fail with AccessControlException
JDK-8247865 SSLSocket.getSession() doesn't close connection for timeout/ interrupts
JDK-8246417 Strip mined loop verification fails with assert(is_OuterStripMinedLoop()) failed: invalid node class
JDK-8246425 struct SwitchRange in HS violates C++ One Definition Rule
JDK-8246562 Support for configure option --with-native-debug-symbols=internal is impossible on Windows
JDK-8246067 Syntax error in toolchain_windows.m4
JDK-8245102 templateInterpreter.cpp: copy_table() needs to be safer
JDK-8245109 test/jdk/sanity/client/SwingSet/src/ColorChooserDemoTest.java failed
JDK-8246160 TestMetadataRetention fails due to missing symbol id
JDK-8245815 TestTimeMultiple.java failed "assert(!lease()) failed: invariant"
JDK-8249353 Unexpected NoSuchAlgorithmException when using secure random impl from BCFIPS provider
JDK-8245783 Use AS_NO_KEEPALIVE loads in HeapDumper
JDK-8245818 Use of an uninitialized register in 32-bit ARM template interpreter
JDK-8246065 use string literal for format string when handling PauseAtStartupFile
JDK-8246699 Use WeakReference for lastFontStrike for created Fonts
JDK-8246070 Visual Studio install found through --with-tools-dir value is discarded
JDK-8247588 x86_32 build failures after JDK-8226721 (Missing intrinsics for Math.ceil, floor, rint)
JDK-8245009 ZipFile/MultiThreadedReadTest.java timed out in tier1

Dmitry Cherepanov, Azul

Bug Summary
JDK-8246765 (fs) UserPrincipalLookupService.lookupXXX failure with IOE "Operation not permitted"
JDK-8245110 (tz) Upgrade time-zone data to tzdata2020a
JDK-8246763 (zipfs) Potential memory leak with zip provider
JDK-8247225 [macOS 10.14] Methods of Java Robot should be called from appropriate thread
JDK-8245974 [macos 10.15] java/awt/Window/LocationAtScreenCorner/LocationAtScreenCorner.java may fail
JDK-8246061 [macos 10.15] test/jdk/java/awt/color/EqualityTest/EqualityTest.java may fail
JDK-8246616 [macos 10.15] Windows in fullscreen tests jumps around the screen
JDK-8245976 [macOS] Dark mode for the desktop is not supported
JDK-8245278 [macos] access to window property of NSView on wrong thread
JDK-8245453 [macos] Crash with use of native file dialog
JDK-8245975 [macos] NPE was thrown at expanding Choice from maximized frame
JDK-8245279 [macos] NullPointerException getting bounds of GraphicsConfiguration
JDK-8246620 [macos] PIT: java/awt/Choice/ChoiceKeyEventReaction/ChoiceKeyEventReaction.java fails
JDK-8246574 [macos] Problem with backslashes on macOS/JIS keyboard: Java ignores system settings
JDK-8247226 [macos] The NestedModelessDialogTest test make the macOS unstable
JDK-8245971 [macosx] Java2D Queue Flusher crash on OSX after switching between user accounts
JDK-8246581 [macosx] Two apostrophes are entered instead of one with "U.S. International - PC" layout
JDK-8246766 [ntintel] asserts about copying unaligned array
JDK-8246573 [TEST_BUG] Test javax/swing/plaf/basic/BasicMenuUI/4983388/bug4983388.java fails with shortcuts on menus do not work
JDK-8247210 [TESTBUG] [macos 10.15] java/awt/Graphics/DrawImageBG/SystemBgColorTest.java fails
JDK-8246056 [TESTBUG] CustomFont.java cannot find font file
JDK-8247323 [TESTBUG] exclude Container tests from hotspot_misc group
JDK-8246577 [TESTBUG] java/awt/Focus/DisposedWindow/DisposeDialogNotActivateOwnerTest/DisposeDialogNotActivateOwnerTest.java fails on linux-x64 nightly
JDK-8246576 [TESTBUG] java/awt/Mouse/EnterExitEvents/ModalDialogEnterExitEventsTest.java fails in Windows
JDK-8246615 [TESTBUG] The arrow image is blue instead of green
JDK-8247211 [TESTBUG] The JDK-8039467 bug appeared on macOS
JDK-8247343 [TESTBUG] The test java/awt/Window/GetScreenLocation/GetScreenLocationTest.java fails on HiDPI screen
JDK-8246578 [TESTBUG]Some jtreg tests fail when CAPS_LOCK is ON
JDK-8246580 A few client tests leave mouse buttons pressed
JDK-8246582 Access Bridge lacks html tags parsing
JDK-8245933 Add a new test to verify that DatagramSocket is not interruptible
JDK-8246366 Add exception for expiring Comodo roots to VerifyCACerts test
JDK-8246365 Add exception for expiring DocuSign root to VerifyCACerts test
JDK-8246621 Add failing client jtreg tests to the Problem List
JDK-8245176 add os::dll_load to the unified logging os category
JDK-8247596 AudioSystem.getMixerInfo() takes about 30 sec to report a gone audio device
JDK-8245541 BCEL: update to version 6.3.1
JDK-8246583 Broken merge between JDK-8006406 and JDK-8003559
JDK-8245014 ChaCha20-Poly1305 TLS cipher suite decryption throws ShortBufferException
JDK-8246473 Compare version info of Santuario to legal notice
JDK-8245454 Compilation error in mach5 java/awt/FileDialog/MacOSGoToFolderCrash.java
JDK-8247595 Copyright info (Year) should be updated for fix of 8241638
JDK-8246367 Deal with ECDSA using ecdsa-with-SHA2 plus hash algorithm as AlgorithmId
JDK-8247342 DragSourceEvent.getLocation() returns wrong value on HiDPI screens (Windows)
JDK-8246058 Duplicate attribution in freetype.md
JDK-8246321 exclude jtreg test security/infra/java/security/cert/CertPathValidator/certification/LuxTrustCA.java because of instabilities
JDK-8245808 Fail fast if the handshake type is unknown
JDK-8246575 Fix for JDK-8214578 breaks OS X 10.12 compatibility
JDK-8247208 Frame#setMaximizedbounds not working properly in multi screen environments
JDK-8246362 give better error output for invalid OCSP response intervals in CertPathValidator checks
JDK-8246361 Hard coded loop limit prevents reading of smart card data greater than 8k
JDK-8246838 IBM-943 charset encoder needs updating
JDK-8247223 Incorrect JNU_ReleaseStringPlatformChars in Windows Print
JDK-8245973 Intermittent NPE in Component.validate()
JDK-8247227 Invalid "sun.awt.TimedWindowEvent" object leads to JVM crash
JDK-8245804 java.security.Provider.getService returns random result due to race condition with mutating methods in the same class
JDK-8247224 java/awt/Window/Grab/GrabTest.java fails on Windows
JDK-8245806 java/net/Authenticator/B4769350.java failed intermittently
JDK-8245934 java/net/DatagramPacket/ReuseBuf.java failed due to timeout
JDK-8246767 java/nio/channels/Selector/SelectWithConsumer.java failed at testTwoChannels()
JDK-8246768 java/nio/channels/SocketChannel/AdaptSocket.java fails on Windows 10
JDK-8245175 java_props_macosx.c - provide missing CFRelease for CFLocaleCopyCurrent
JDK-8246316 javax/net/ssl/templates/SSLSocketSSLEngineTemplate.java fails intermittently with "java.lang.Exception: Unexpected EOF"
JDK-8246314 javax/net/ssl/templates/SSLSocketSSLEngineTemplate.java supports TLSv1.3
JDK-8246317 javax/net/ssl/TLS tests support TLSv1.3
JDK-8246618 javax/swing/JInternalFrame/Test6325652.java fails
JDK-8246579 JAWS reports wrong number of radio buttons when buttons are hidden
JDK-8245805 jdk/internal/jimage/JImageOpenTest.java runs no test
JDK-8246060 JSpinner and changing value by mouse
JDK-8246360 JSSE Client does not throw SSLException when an alert occurs during handshaking
JDK-8246614 JTextPane does not show images in HTML rendering
JDK-8246363 Keytool generates wrong expiration date if validity is set to 2050/01/01
JDK-8247594 launcher time metrics always report 1 on Linux when _JAVA_LAUNCHER_DEBUG set
JDK-8245802 LdapContext#reconnect always opens a new connection
JDK-8245935 Migrate SimpleDateFormatConstTest to JDK Repo
JDK-8246471 Mismatch in jsse.enableMFLNExtension property name
JDK-8246472 Missing hash characters for header on license file
JDK-8246364 Missing key_share extension for (EC)DHE key exchange should alert missing_extension
JDK-8246764 Modifying ArrayList.subList().subList() resets modCount of subList
JDK-8247205 NamingManager should cache InitialContextFactory
JDK-8245977 NPE in LWWindowPeer.getOnscreenGraphics()
JDK-8246584 NULL-check return value of SurfaceData_InitOps on macosx
JDK-8245979 PIT: java/awt/font/WindowsIndicFonts.java fails on windows10
JDK-8245980 PIT: test/jdk/javax/swing/text/html/TestJLabelWithHTMLText.java times out in linux-x64
JDK-8247341 Popup menus and tooltips flicker with previous popup contents when first shown
JDK-8247340 Problem List ICMColorDataTest.java
JDK-8246315 ProblemList javax/net/ssl/templates/SSLSocketSSLEngineTemplate.java
JDK-8246839 Put JDK-8239965 on the ProblemList.txt
JDK-8245978 Rare NPE at WComponentPeer.getGraphics()
JDK-8246619 Regression automated test 'open/test/jdk/javax/swing/JInternalFrame/8145896/TestJInternalFrameMaximize.java' fails
JDK-8247395 Remove Comodo root certificate that is expiring in May 2020
JDK-8247394 Remove DocuSign root certificate that is expiring in May 2020
JDK-8246063 Rendering artifacts with LCD text and fractional metrics
JDK-8247207 Replace ID2D1Factory::GetDesktopDpi with GetDeviceCaps
JDK-8245930 replace JLI_StrTok in java_md_solinux.c
JDK-8246319 Revert TLS 1.3 change that wrapped IOExceptions
JDK-8247209 setMaximizedBounds is broken with large display scale and multiple monitors
JDK-8246841 Small charset issues (ISO8859-16, x-eucJP-Open, x-IBM834 and x-IBM949C)
JDK-8246474 Some security tests should support TLSv1.3
JDK-8246313 SSLSocket closes socket both socket endpoints on a SocketTimeoutException
JDK-8247339 sun/java2d/GdiRendering/InsetClipping.java fails
JDK-8245936 sun/net/ftp/FtpURLConnectionLeak.java fails intermittently with NPE
JDK-8246320 sun/security/ssl/X509TrustManagerImpl tests support TLSv1.3
JDK-8246312 sunmscapi.dll causing EXCEPTION_ACCESS_VIOLATION
JDK-8245803 SunPKCS11 provider needs to check more details on PKCS11 Mechanism
JDK-8247206 systemScale.cpp could not compile with VS2019
JDK-8245931 Tag mismatch may alert bad_record_mac
JDK-8245972 Test java/awt/EventQueue/NonComponentSourcePost.java is unstable
JDK-8247344 Test SetBoundsPaintTest.html failed on Windows when desktop is scaled
JDK-8246062 Text spaced incorrectly by drawString under rotation with fractional metrics
JDK-8246059 The "AutoTestOnTop.java" test may run external applications
JDK-8245807 The logic of java/net/ipv6tests/TcpTest.java is flawed
JDK-8246475 The ordering of Cipher Suites is not maintained provided through “jdk.tls.client.cipherSuites” and “jdk.tls.server.cipherSuites” system property.
JDK-8247222 Toolkit.getScreenInsets(GraphicsConfiguration) may throw ClassCastException
JDK-8245542 Update BCEL version to 6.3.1 in license file
JDK-8246617 Update ProblemList.txt to exclude failing headful tests on macos
JDK-8246057 Upgrade to freetype 2.10.1
JDK-8246762 Windows handle Leak when starting processes using ProcessBuilder
JDK-8245932 Worker has a deadlock bug
JDK-8246840 XMLEncoder/Test4625418.java fails due to "Error: Cp943 - can't read properly"
JDK-8247228 XToolkit: Misread of screen information memory

Vladimir Kempik, Azul

Bug Summary
JDK-8245209 (fs) Add test for macOS Catalina changes to protect system software
JDK-8246604 [JVMCI] Fix single implementor speculation for diamond shapes.
JDK-8246463 [TESTBUG] compiler/aot/fingerprint/SelfChangedCDS.java fails when cds is disabled
JDK-8245965 [TESTBUG] compiler/{jvmci,aot} tests should not run with GCs that do not support JVMCI/AOT
JDK-8246149 [TESTBUG] Problemlist JFR compiler/TestCodeSweeper.java
JDK-8245794 [TESTBUG] runtime/StackTrace/HiddenFrameTest.java fails with release VM
JDK-8245189 [TESTBUG] sun/tools/jhsdb/JShellHeapDumpTest.java fails with RuntimeException 'JShellToolProvider' missing from stdout/stderr
JDK-8246146 [TESTBUG] Test JFR API from Java agent
JDK-8246148 Add another regression test for JDK-8134739
JDK-8246598 Add more custom hooks in Bundles.gmk
JDK-8246597 Add virtualization information output to hs_err file on macOS
JDK-8246138 Avoid calling MallocTracker::record_malloc and record_free when NMT is off
JDK-8245188 build.log output from failing commands : include the hs_error file path in case of crashes in build
JDK-8246139 C1: PatchingStub for field access copies too much
JDK-8245791 C2 compilation fails with assert "m has strange control"
JDK-8245212 C2's conditional move optimization fails with assert(bol->Opcode() == Op_Bool) failed
JDK-8246595 C2's UseUniqueSubclasses optimization is broken for array accesses
JDK-8245945 C2: Let ConnectionGraph::not_global_escape(Node* n) return false if n is not in the CG
JDK-8245211 C2: ShouldNotReachHere() in verify_strip_mined_scheduling
JDK-8246140 Call cache flush after generating trampoline.
JDK-8246606 check calloc rv in libinstrument InvocationAdapter
JDK-8245946 ConnectionGraph::unique_java_object(Node* N) return NULL if n is not in the CG
JDK-8245963 CoreDocumentImpl.setXmlVersion NPE
JDK-8246462 Crash in AdapterHandlerLibrary::get_adapter with CDS due to code cache exhaustion
JDK-8245966 Fix copyright headers in hotspot (missing comma after year)
JDK-8246599 hs test serviceability/sa/ClhsdbCDSCore.java fails on macOS 10.15
JDK-8245948 hs_err should print coalesced safepoint operations in Events section
JDK-8246136 Improve the code coverage for ThreadLocal
JDK-8245789 java.security.Provider#getServices order is no longer deterministic
JDK-8246137 JFR - nmetods - misspelled in several places
JDK-8245187 jhsdb jmap fails to write binary heap dump of a jshell process
JDK-8246607 JvmtiTagMap::weak_oops_do() should not trigger barriers
JDK-8246596 libproc_impl.c previous_thr may be used uninitialized warning
JDK-8245213 MacVolumesTest failed after upgrade to MacOS Catalina
JDK-8246459 MethodHandles::tryFinally generates illegal bytecode for long/double return types
JDK-8246450 Minimal build broken after JDK-8233494
JDK-8245299 NativeLookup::lookup_critical_entry() should only load shared library once
JDK-8245297 Problemlist compiler/rtm tests
JDK-8245300 ProblemList gc/stress/gclocker/TestExcessGCLockerCollections.java
JDK-8246147 Problemlist SA tests with AOT
JDK-8246464 remove obsolete NET_ReadV
JDK-8245792 Replace wildcard address with loopback or local host in tests - part 14
JDK-8245947 serviceability/sa/TestJmapCore tests fail with java.lang.RuntimeException: Could not find dump file
JDK-8245793 ShowHiddenFrames use in java_lang_StackTraceElement::fill_in appears broken
JDK-8245949 Sinking load out of loop may trigger: assert(found_sfpt) failed: no node in loop that's not input to safepoint
JDK-8245301 Some tests in serviceability/sa run with fixed -Xmx values and risk running out of memory
JDK-8245790 StackFrameInfo::getByteCodeIndex returns wrong value if bci > 32767
JDK-8246461 Test crashed with assert(phi->operand_count() != 1 || phi->subst() != phi) failed: missed trivial simplification
JDK-8246460 Test8004741.java failed due to "Too few ThreadDeath hits; expected at least 6 but saw only 5"
JDK-8246605 TestInstanceCloneAsLoadsStores.java fails with -XX:+StressGCM
JDK-8245298 Unnecessary GCLocker-initiated young GCs
JDK-8246608 Use -lobjc instead of -fobjc-link-runtime in libosxsecurity
JDK-8245207 ZGC: Fix incorrect statistics
JDK-8245964 ZGC: vmTestbase/nsk/jvmti/Allocate/alloc001/ fails
JDK-8245962 ZGC: vmTestbase/nsk/jvmti/ResourceExhausted/resexhausted002 fails

Yuri Nesterenko, Azul

Bug Summary
JDK-8245008 (ch) AsynchronousFileChannel hangs with internal error when reading locked file
JDK-8245636 (fs) Files.write can leak file descriptor in the exception case
JDK-8245441 [TEST_BUG] Some tests should check isDisplayChangeSupported
JDK-8247233 [TESTBUG] compiler/loopopts/TestLoopUnswitchingLostCastDependency.java fails with release VMs
JDK-8247230 [TESTBUG] Test command error in hotspot/jtreg/compiler/loopopts/superword/SumRedAbsNeg_Float.java
JDK-8246122 [TESTBUG] tools/jlink/plugins/VendorInfoPluginsTest.java fails with debug or non-server VMs
JDK-8246124 [TESTBUG] VeryEarlyAssertTest.java validating "END." marker at lastline is not always true
JDK-8246328 ActionListeners on JRadioButtons don't get notified when selection is changed with arrow keys
JDK-8246054 Add hooks for custom output dir in Bundles.gmk
JDK-8246757 Add JDK-8010500 to compiler/loopopts/superword/TestFuzzPreLoop.java bug list
JDK-8246759 Add notes for PKCS11 tests in the test doc
JDK-8246601 Algorithmic Italic font leans opposite angle in Printing
JDK-8246448 argfiles parsing broken for argfiles with comment cross 4096 bytes chunk
JDK-8245440 avoid incompatible pointer to integer conversion initializing gint in gtk2_interface
JDK-8245442 BufImg_SetupICM add ReleasePrimitiveArrayCritical call in early return
JDK-8246695 build broken when configured with --with-zlib=bundled on gcc 7.3
JDK-8246055 Build static versions of certain JDK libraries
JDK-8241913 Bump update version for OpenJDK: jdk-13.0.4
JDK-8245531 call ReleaseStringUTFChars before early returns in Java_sun_security_pkcs11_wrapper_PKCS11_connect
JDK-8245774 check malloc/calloc results in java.desktop
JDK-8245180 check malloc/calloc results in jdk.hotspot.agent
JDK-8245776 check ZALLOC return values in awt coding
JDK-8246479 Class loading deadlock involving X509Factory#commitEvent()
JDK-8245775 Crash at sun.awt.X11.XlibWrapper.XkbGetUpdatedMap when change keybord map
JDK-8246444 Crash if classpath is read from @argument file and the main gets option argument
JDK-8245613 CriticalJNINatives: dll handling should be done in native thread state
JDK-8246144 Deadlock with ClassLoader.findLibrary and System.loadLibrary call
JDK-8245960 Docked MacBook cannot start any Java Swing applications
JDK-8246449 Fix copyrights after JDK-8240629 change
JDK-8246445 FSInfo#getJarClassPath throws an exception not declared in its throws clause
JDK-8246698 Further cleanup to test serviceability/sa/ClhsdbCDSCore.java
JDK-8246675 GetOwnedMonitorInfoWithEATest.java fails with ZGC: Heap too small
JDK-8246548 Give more meaningful InternalError messages in Deflater.c
JDK-8246327 ICC_Profile has un-needed, not-empty finalize method
JDK-8246864 IdealLoopTree::dump_head predicate printing is broken
JDK-8242843 Incorrect Roboto font rendering on Windows with subpixel antialiasing
JDK-8245771 Introduce a system property to disable eager lambda initialization
JDK-8246324 Java does not render Myanmar script correctly
JDK-8245639 java.io.File.isInvalid() is racy
JDK-8247217 java/util/concurrent tests fail with -XX:+VerifyGraphEdges: assert(!VerifyGraphEdges) failed: verification should have failed
JDK-8245080 Java_java_net_NetworkInterface_getByName0 on unix misses ReleaseStringUTFChars in early return
JDK-8246446 Javac treats Manifest Class-Path entries as Paths instead of URLs
JDK-8246120 jlink plugins for vendor information and command-line options
JDK-8247406 JVM uses excessive memory with -XX:+EnableJVMCI -XX:JVMCICounterSize=2147483648
JDK-8247232 Loop unswitching may cause dependence on null check to be lost
JDK-8245638 Missing closedir call with JDK-8223490
JDK-8245530 missing ReleaseStringUTFChars in java.desktop native code
JDK-8245529 missing ReleaseStringUTFChars in serviceability native code
JDK-8246322 Object monitor deadlock with no threads holding the monitor (using jemalloc 5.1)
JDK-8245637 Optimize search algorithm for determining default time zone
JDK-8246589 Problemlist additional compiler/rtm tests
JDK-8246646 Replace wildcard address with loopback or local host in tests - part 20
JDK-8246647 RFC unconformity of HttpURLConnection with proxy
JDK-8246121 runtime/ErrorHandling/VeryEarlyAssertTest.java fails after 8232080
JDK-8246547 Simplify JarFile.isInitializing
JDK-8246863 SuperWord::co_locate_pack picks memory state of first instead of last load
JDK-8247231 TESTBUG: jdk regression test javax/management/loading/MletParserLocaleTest.java reduce default timeout
JDK-8246123 tools/jlink/plugins/VendorInfoPluginsTest.java times out
JDK-8246571 Turkey Time Zone returns incorrect time zone name
JDK-8246131 Update CUP to v0.11b
JDK-8246758 Update test document by changing "TIMEOUT" to "TIMEOUT_FACTOR"
JDK-8246760 Update test documentation with additional settings for client UI tooltip tests
JDK-8247199 Update Xerces to Version 2.12.1
JDK-8245769 Upgrade IANA Language Subtag Registry to the latest for JDK14
JDK-8246447 Upgrading JSZip from v3.1.5 to v3.2.2
JDK-8246865 Use consistent predicate order in and with PhaseIdealLoop::find_predicate
JDK-8246692 Various minor fixes
JDK-8247337 Wrong implementation of VMState.hasListener
JDK-8247322 Zero VM crashes when handling dynamic constant