PUSHES REPORT: 15.0.2

This report shows who pushed the backports to the given release. This usually shows who did the backporting, testing, and review work.

Report generated: Wed Sep 01 04:26:08 CEST 2021

Distribution by priority

Count Priority
5 P1
53 P2
121 P3
93 P4
1 P5

Distribution by components

Count Component
273 Total
156 (57.1%) hotspot
55 (20.1%) hotspot/compiler
51 (18.7%) hotspot/gc
26 (9.5%) hotspot/runtime
11 (4.0%) hotspot/jfr
6 (2.2%) hotspot/svc
4 (1.5%) hotspot/test
2 (0.7%) hotspot/svc-agent
1 (0.4%) hotspot/jvmti
38 (13.9%) tools
13 (4.8%) tools/javadoc(tool)
10 (3.7%) tools/jpackage
10 (3.7%) tools/javac
4 (1.5%) tools/jshell
1 (0.4%) tools
33 (12.1%) core-libs
7 (2.6%) core-libs/java.lang
5 (1.8%) core-libs/java.nio
3 (1.1%) core-libs/java.net
3 (1.1%) core-libs/java.io:serialization
3 (1.1%) core-libs
3 (1.1%) core-libs/java.time
2 (0.7%) core-libs/java.util
2 (0.7%) core-libs/java.io
2 (0.7%) core-libs/java.util.jar
1 (0.4%) core-libs/jdk.nashorn
1 (0.4%) core-libs/java.lang:class_loading
1 (0.4%) core-libs/java.lang.invoke
18 (6.6%) security-libs
11 (4.0%) security-libs/java.security
2 (0.7%) security-libs/javax.xml.crypto
2 (0.7%) security-libs/javax.net.ssl
1 (0.4%) security-libs/jdk.security
1 (0.4%) security-libs/javax.crypto
1 (0.4%) security-libs/org.ietf.jgss:krb5
9 (3.3%) infrastructure
8 (2.9%) infrastructure/build
1 (0.4%) infrastructure
7 (2.6%) client-libs
4 (1.5%) client-libs/java.awt
1 (0.4%) client-libs/2d
1 (0.4%) client-libs/javax.swing
1 (0.4%) client-libs/javax.accessibility
7 (2.6%) core-svc
3 (1.1%) core-svc/debugger
2 (0.7%) core-svc/java.lang.management
1 (0.4%) core-svc/tools
1 (0.4%) core-svc/javax.management
2 (0.7%) globalization
1 (0.4%) globalization/translation
1 (0.4%) globalization/locale-data
2 (0.7%) xml
1 (0.4%) xml/jaxp
1 (0.4%) xml
1 (0.4%) other-libs
1 (0.4%) other-libs/other

Distribution by affiliation

Count Committer
273 Total
204 (74.7%) Oracle
185 (67.8%) Robert Mckenna
6 (2.2%) Vladimir Kozlov
5 (1.8%) Sean Coffey
3 (1.1%) Tobias Hartmann
2 (0.7%) Rajan Halade
2 (0.7%) Stefan Karlsson
1 (0.4%) Harold Seigel
58 (21.2%) Red Hat
49 (17.9%) Aleksey Shipilev
4 (1.5%) Severin Gehwolf
3 (1.1%) Alex Kasko
1 (0.4%) Zhengyu Gu
1 (0.4%) Roland Westrelin
6 (2.2%) SAP
6 (2.2%) Christoph Langer
3 (1.1%) Azul
3 (1.1%) Vladimir Kempik
2 (0.7%) DataDog
2 (0.7%) Jaroslav Bachorík

Chronological push log:

Days Ago Committer Affiliation Bug Summary
223 Robert Mckenna Oracle JDK-8253598 Unexpected StackOverflowError in "process reaper" thread still happens
223 Robert Mckenna Oracle JDK-8253158 jdk jtreg test security/infra/java/security/cert/CertPathValidator/certification/GlobalSignR6CA.java fails
223 Robert Mckenna Oracle JDK-8250666 Need support for building native libraries located in the test/lib directory
223 Robert Mckenna Oracle JDK-8250227 Test test/hotspot/jtreg/runtime/7162488/TestUnrecognizedVmOption.java fails when -XX:+IgnoreUnrecognizedVMOptions is set
223 Robert Mckenna Oracle JDK-8250225 [TESTBUG] compiler/loopopts/PartialPeelingUnswitch.java times out with Graal enabled
264 Christoph Langer SAP JDK-8254278 java/security/cert/PolicyNode/GetPolicyQualifiers.java fails due to an expired certificate
264 Christoph Langer SAP JDK-8254277 Add exception for expiring Digicert root certificates to VerifyCACerts test
267 Aleksey Shipilev Red Hat JDK-8257842 Shenandoah: objArrayKlass metadata is not marked with chunked arrays
267 Aleksey Shipilev Red Hat JDK-8257841 Shenandoah: Query is_at_shenandoah_safepoint() from control thread should return false
272 Harold Seigel Oracle JDK-8251485 MonitorInfo stores raw oops across safepoints
272 Aleksey Shipilev Red Hat JDK-8257590 Memory leak in Java_java_lang_ClassLoader_defineClass0()
274 Aleksey Shipilev Red Hat JDK-8257428 s390x builds are very noisy with gc-sections messages
274 Aleksey Shipilev Red Hat JDK-8257427 Zero: Linux x86_32 build still fails
279 Christoph Langer SAP JDK-8257055 Test com/sun/jndi/dns/ConfigTests/PortUnreachable.java does not work on AIX
279 Aleksey Shipilev Red Hat JDK-8257053 nmethod_entry_barrier stub miscalculates xmm spill size on x86_32
281 Tobias Hartmann Oracle JDK-8256846 AArch64: Insufficient error handling when CodeBuffer is exhausted
281 Tobias Hartmann Oracle JDK-8256845 AArch64: AOT compiled code crashes if C2 allocates r27
287 Tobias Hartmann Oracle JDK-8256472 C2 CompilerThread0 crash in Node::add_req(Node*)
288 Christoph Langer SAP JDK-8256404 Issue with useAppleColor check in CSystemColors.m
288 Christoph Langer SAP JDK-8256403 OSX build fails with Xcode 12.0 (12A7209)
293 Aleksey Shipilev Red Hat JDK-8256185 NPE on ClassValue.ClassValueMap.cacheArray
298 Christoph Langer SAP JDK-8255986 Memory/Performance regression after JDK-8210985
298 Sean Coffey Oracle JDK-8255942 (tz) Upgrade time-zone data to tzdata2020d
307 Severin Gehwolf Red Hat JDK-8255545 [cgroups v1] Metric limits not properly detected on some join controller combinations
307 Aleksey Shipilev Red Hat JDK-8255540 Shenandoah: Interpreter native-LRB needs to activate during HAS_FORWARDED
307 Aleksey Shipilev Red Hat JDK-8255539 Shenandoah: C2 native LRB should activate for non-cset objects
307 Aleksey Shipilev Red Hat JDK-8255538 Missing return statement in __sync_val_compare_and_swap_8
307 Aleksey Shipilev Red Hat JDK-8255537 Zero: accessor_entry misses the IRIW case
309 Aleksey Shipilev Red Hat JDK-8255392 Restore Copyright line in file modified by 8253191
309 Aleksey Shipilev Red Hat JDK-8255391 C2: Masked byte comparisons with large masks produce wrong result on x86
309 Aleksey Shipilev Red Hat JDK-8255390 clazz.isAssignableFrom will return false for interface implementors
312 Vladimir Kozlov Oracle JDK-8255354 SIGSEGV in string_indexof_char and stringL_indexof_char intrinsics
312 Sean Coffey Oracle JDK-8255333 (tz) Upgrade time-zone data to tzdata2020c
313 Aleksey Shipilev Red Hat JDK-8255228 Zero: return-type warning in zeroInterpreter_zero.cpp
314 Robert Mckenna Oracle JDK-8250861 Crash in MinINode::Ideal(PhaseGVN*, bool)
315 Vladimir Kozlov Oracle JDK-8255071 Assert '(_pcs_length == 0 || last_pc()->pc_offset() < pc_offset) failed: must specify a new, larger pc offset' failure
320 Sean Coffey Oracle JDK-8254687 (tz) Upgrade time-zone data to tzdata2020b
321 Aleksey Shipilev Red Hat JDK-8254752 Shenandoah: Concurrent Strong Roots logging is incorrect
321 Aleksey Shipilev Red Hat JDK-8254751 Shenandoah: remove unimplemented ShenandoahStrDedupQueue::verify
321 Aleksey Shipilev Red Hat JDK-8254750 Shenandoah: ShenandoahStrDedupQueue destructor calls virtual num_queues()
321 Aleksey Shipilev Red Hat JDK-8254749 Shenandoah: unused AlwaysTrueClosure after JDK-8246591
321 Aleksey Shipilev Red Hat JDK-8254746 Non-x86 Zero builds fail with return-type warning in os_linux_zero.cpp
321 Aleksey Shipilev Red Hat JDK-8254745 ShenandoahSafepoint::is_at_shenandoah_safepoint should not access VMThread state from other threads
323 Stefan Karlsson Oracle JDK-8252737 Undo JDK-8245002: Windows GDI functions don't support NUMA interleaving
323 Stefan Karlsson Oracle JDK-8252736 Undo JDK-8245000: Windows GDI functions don't support large pages
326 Vladimir Kozlov Oracle JDK-8254347 Remove unneeded nops introduced by 8234160 changes
326 Aleksey Shipilev Red Hat JDK-8254281 Zero OrderAccess barrier mappings are incorrect
328 Severin Gehwolf Red Hat JDK-8254150 [cgroups v2] Memory and swap limits reported incorrectly
328 Severin Gehwolf Red Hat JDK-8254149 [cgroups v2] Soft memory limit incorrectly using memory.high
336 Alex Kasko Red Hat JDK-8253790 JVM crash in "AwtFrame::WmSize" method
337 Alex Kasko Red Hat JDK-8253738 java/awt/dnd/DisposeFrameOnDragCrash/DisposeFrameOnDragTest.java fails on Windows
337 Alex Kasko Red Hat JDK-8253737 JVM crashed at imjpapi.dll in native code
337 Severin Gehwolf Red Hat JDK-8253723 HotSpot Not Identifying it is Running in a Container
347 Jaroslav Bachorík DataDog JDK-8253347 Hash code calculation of JfrStackTrace is inconsistent
347 Jaroslav Bachorík DataDog JDK-8253346 JFR: Improve hash algorithm for stack traces
351 Aleksey Shipilev Red Hat JDK-8253088 Parse::do_lookupswitch fails with "assert(_cnt >= 0) failed"
351 Aleksey Shipilev Red Hat JDK-8253087 compiler/oracle/TestCompileCommand.java misspells "occured"
354 Roland Westrelin Red Hat JDK-8253045 8240795 may cause anti-dependence to be missed
357 Aleksey Shipilev Red Hat JDK-8252891 Shenandoah: support manageable SoftMaxHeapSize option
363 Robert Mckenna Oracle JDK-8252699 Add jarsigner and keytool tests for restricted algorithms
363 Robert Mckenna Oracle JDK-8252698 sun/security/validator/PKIXValAndRevCheckTests.java fails with "RuntimeException: Received unexpected exception"
370 Sean Coffey Oracle JDK-8252370 Wrong translation for the month of May in ar_JO, ar_LB and ar_SY
370 Aleksey Shipilev Red Hat JDK-8252363 jvmciCompilerToVM.cpp declares jio_printf with "void" return type, should be "int"
370 Vladimir Kempik Azul JDK-8252357 Fix issues with cross-compile on macos
370 Vladimir Kempik Azul JDK-8252356 [macos] zerovm is broken due to libffi headers location
370 Vladimir Kempik Azul JDK-8252355 [macos] bring back O2 opt level for unsafe.cpp
375 Aleksey Shipilev Red Hat JDK-8252135 Shenandoah: Handshake threads between weak-roots and reset phases
375 Aleksey Shipilev Red Hat JDK-8252134 Shenandoah: filter null oops before calling enqueue/SATB barrier
378 Robert Mckenna Oracle JDK-8251955 SSLSocket.getSession() doesn't close connection for timeout/ interrupts
379 Aleksey Shipilev Red Hat JDK-8251902 C2: compiler/intrinsics/object/TestClone fails with -XX:+VerifyGraphEdges
379 Aleksey Shipilev Red Hat JDK-8251901 Make sure {type,obj}ArrayOopDesc accessors check the bounds
379 Aleksey Shipilev Red Hat JDK-8251900 Shenandoah: Remark ObjectSynchronizer roots with I-U
379 Aleksey Shipilev Red Hat JDK-8251899 Shenandoah: remove leftover code after JDK-8231086
383 Aleksey Shipilev Red Hat JDK-8251519 Shenandoah: remove ShenandoahAssertToSpaceClosure
383 Aleksey Shipilev Red Hat JDK-8251518 Shenandoah: remove ShenandoahCriticalControlThreadPriority support
385 Robert Mckenna Oracle JDK-8251417 JDK-8248299 breaks JDK 15 validate-headers build
385 Robert Mckenna Oracle JDK-8251416 two jdeps files miss copyright header
385 Sean Coffey Oracle JDK-8251391 Revert Principal Name type to NT-UNKNOWN when requesting TGS Kerberos tickets
386 Aleksey Shipilev Red Hat JDK-8251335 Shenandoah: assert(_nm->is_alive()) failed: only alive nmethods here
386 Aleksey Shipilev Red Hat JDK-8251334 Shenandoah: Clear soft-refs on requested GC cycle
391 Rajan Halade Oracle JDK-8251137 Add SSL root certificates to Oracle Root CA program
392 Vladimir Kozlov Oracle JDK-8251106 libgraal can deadlock in -Xcomp mode
392 Zhengyu Gu Red Hat JDK-8251095 Shenandoah: need to reset/finish dead counters for StringTable/ResolvedMethodTable during STW root processing
392 Robert Mckenna Oracle JDK-8251066 C2 crash in IfNode::fold_compares
392 Robert Mckenna Oracle JDK-8251065 [Graal] api/java_security/SignatureSpi/DelegationTests.html fails with Method "javasoft.sqe.tests.api.java.security.SignatureSpi.JCKSignatureSpi.clear" doesn't exist.
392 Robert Mckenna Oracle JDK-8251064 Net.java translateToSocketException does not handle IOException
392 Robert Mckenna Oracle JDK-8251063 missed open parenthesis for GTEST_FRAMEWORK_SRC var in Main.gmk
392 Robert Mckenna Oracle JDK-8251062 Shenandoah: LRB needs to save/restore fp registers for runtime call
392 Robert Mckenna Oracle JDK-8251061 [macos] Sound Recording and playback is not working
392 Robert Mckenna Oracle JDK-8251060 Update all nroff manpages for JDK 15 release
392 Robert Mckenna Oracle JDK-8251059 The README need not mention retrieving source code
393 Rajan Halade Oracle JDK-8250971 Add Entrust root CA - G4 to Oracle Root CA program
393 Aleksey Shipilev Red Hat JDK-8250949 Shenandoah: assertion failure with -XX:-ResizeTLAB
393 Aleksey Shipilev Red Hat JDK-8250948 Shenandoah: refactor TLAB/GCLAB retirement code
393 Aleksey Shipilev Red Hat JDK-8250947 Shenandoah: provide per-cycle pacing stats
393 Aleksey Shipilev Red Hat JDK-8250946 Shenandoah: gc/shenandoah/mxbeans tests should account for corner cases
393 Aleksey Shipilev Red Hat JDK-8250945 Shenandoah: build fails without both JVMTI and JFR
393 Aleksey Shipilev Red Hat JDK-8250944 Shenandoah: incorrect include in shenandoahInitLogger.cpp
393 Aleksey Shipilev Red Hat JDK-8250943 Shenandoah: SATB buffer handling may assume no forwarded objects
393 Aleksey Shipilev Red Hat JDK-8250942 Shenandoah: add update watermark line in rich assert failure message
393 Aleksey Shipilev Red Hat JDK-8250941 Shenandoah: split heavy tests by heuristics to improve parallelism
393 Aleksey Shipilev Red Hat JDK-8250940 Shenandoah: mxbeans tests can be shorter
393 Aleksey Shipilev Red Hat JDK-8250939 Shenandoah: options tests should run with smaller heaps
393 Aleksey Shipilev Red Hat JDK-8250938 Shenandoah: should not block pacing reporters
393 Aleksey Shipilev Red Hat JDK-8250937 Shenandoah: pre-Full GC root updates may miss some roots
403 Vladimir Kozlov Oracle JDK-8250566 Include microcode revision in features_string on x86
403 Vladimir Kozlov Oracle JDK-8250561 AOT's Linker.java seems to eagerly fail-fast on Windows.
404 Robert Mckenna Oracle JDK-8250211 Make TestGCLocker more resilient with concurrent GCs
404 Robert Mckenna Oracle JDK-8250210 JVMCI calling register_nmethod without CodeCache lock
404 Robert Mckenna Oracle JDK-8250209 failed: sanity at src/hotspot/share/opto/escape.cpp:2361
404 Robert Mckenna Oracle JDK-8250208 JFR: java.base events have incomplete stacktraces
404 Robert Mckenna Oracle JDK-8250207 java/io/File/GetXSpace.java should be added to exclude list, and not @ignore-d
404 Robert Mckenna Oracle JDK-8250206 java/lang/invoke/LFCaching/LFGarbageCollectedTest.java should be ProblemList-ed and not @ignored
404 Robert Mckenna Oracle JDK-8250205 gc/stress/TestJNIBlockFullGC/TestJNIBlockFullGC.java fails w/ UnsatisfiedLinkError
404 Robert Mckenna Oracle JDK-8250204 @ignore should be used instead of ProblemList for 8158860, 8163894, 8193479, 8194310
404 Robert Mckenna Oracle JDK-8250203 cleanup graal problem lists
404 Robert Mckenna Oracle JDK-8250202 use 8249621 to ignore 8 jvmci tests
404 Robert Mckenna Oracle JDK-8250201 VM crashes with "Current BasicObjectLock* below than low_mark"
404 Robert Mckenna Oracle JDK-8250200 test/jdk/java/util/ServiceLoader/ReloadTest.java uses nashorn script engine
404 Robert Mckenna Oracle JDK-8250199 (bf) Force DirectBufferAllocTest to run with -ExplicitGCInvokesConcurrent
404 Robert Mckenna Oracle JDK-8250198 Shenandoah: Fix racy GC request handling
404 Robert Mckenna Oracle JDK-8250197 JShell uses 100% of one core all the time
404 Robert Mckenna Oracle JDK-8250196 Incorrect copyright header in TestInvalidTieredStopAtLevel.java
404 Robert Mckenna Oracle JDK-8250195 Revert JDK-8226253 which breaks the spec of AccessibleState.SHOWING for JList
404 Robert Mckenna Oracle JDK-8250194 Remove unnecessary trademark symbols
404 Robert Mckenna Oracle JDK-8250193 monitor list lock operations need more fencing
404 Robert Mckenna Oracle JDK-8250192 more fencing needed in async deflation for non-TSO machines
404 Robert Mckenna Oracle JDK-8250190 clean up FileInstaller $test.src $cwd in vmTestbase_nsk_jdb tests
404 Robert Mckenna Oracle JDK-8250189 clean up FileInstaller $test.src $cwd in vmTestbase_nsk_jvmti tests
404 Robert Mckenna Oracle JDK-8250188 clean up FileInstaller $test.src $cwd in vmTestbase_nsk_aod tests
404 Robert Mckenna Oracle JDK-8250187 [dark_mode ubuntu 20.04] The selected menu is not highlighted in GTKLookAndFeel
404 Robert Mckenna Oracle JDK-8250186 compiler/graalunit/CoreTest.java timed out
404 Robert Mckenna Oracle JDK-8250185 No helpful NullPointerException message after calling fillInStackTrace.
404 Robert Mckenna Oracle JDK-8250184 java/util/StringJoiner/StringJoinerTest.java failed due to OOM
404 Robert Mckenna Oracle JDK-8250183 SIGILL in C2 generated OSR compilation
404 Robert Mckenna Oracle JDK-8250177 clean up FileInstaller $test.src $cwd in vmTestbase_nsk_stress tests
404 Robert Mckenna Oracle JDK-8250176 clean up FileInstaller $test.src $cwd in vmTestbase_nsk_sysdict tests
404 Robert Mckenna Oracle JDK-8250175 clean up FileInstaller $test.src $cwd in vmTestbase_nsk_jdwp tests
404 Robert Mckenna Oracle JDK-8250174 clean up FileInstaller $test.src $cwd in vmTestbase_nsk_monitoring tests
404 Robert Mckenna Oracle JDK-8250173 clean up FileInstaller $test.src $cwd in vmTestbase_vm_metaspace tests
404 Robert Mckenna Oracle JDK-8250172 clean up FileInstaller $test.src $cwd in vmTestbase_vm_defmeth tests
404 Robert Mckenna Oracle JDK-8250171 [Graal] java/lang/Class/getDeclaredField/FieldSetAccessibleTest.java timeouts
404 Robert Mckenna Oracle JDK-8250170 Build fails if source code in cygwin home dir
404 Robert Mckenna Oracle JDK-8250169 PhaseStringOpts crashes while optimising effectively dead code
404 Robert Mckenna Oracle JDK-8250168 [macos] Add EmptyFolderPackageTest test to problem list
404 Robert Mckenna Oracle JDK-8250167 Improve UX of the search control
404 Robert Mckenna Oracle JDK-8250166 Shenandoah: deadlock during class unloading OOME
404 Robert Mckenna Oracle JDK-8250165 vm.gc.X should take selected JIT into account
404 Robert Mckenna Oracle JDK-8250164 clean up FileInstaller $test.src $cwd in vmTestbase_vm_compiler tests
404 Robert Mckenna Oracle JDK-8250163 clean up FileInstaller $test.src $cwd in vmTestbase_vm_gc tests
404 Robert Mckenna Oracle JDK-8250162 Unexpected StackOverflowError in "process reaper" thread
404 Robert Mckenna Oracle JDK-8250161 [Graal] Several testcases from applications/jcstress/acqrel.java fails with forbidden state
404 Robert Mckenna Oracle JDK-8250160 ZGC: AArch64: SIGILL in load barrier register spilling
404 Robert Mckenna Oracle JDK-8250159 jpackage tests failed due to "semop(1): encountered an error: Invalid argument"
404 Robert Mckenna Oracle JDK-8250158 javac defines type annotations incorrectly for record members (constructor and property accessor)
404 Robert Mckenna Oracle JDK-8250157 clean up FileInstaller $test.src $cwd in vmTestbase_vm_g1classunloading tests
404 Robert Mckenna Oracle JDK-8250156 test/lib/jdk/test/lib/util/JarBuilder.java has a bad copyright
404 Robert Mckenna Oracle JDK-8250155 move test/jdk/lib/testlibrary/java/util/jar/*.java to top-level library or a local library
404 Robert Mckenna Oracle JDK-8250154 clean up FileInstaller $test.src $cwd in vmTestbase_vm_mlvm tests
404 Robert Mckenna Oracle JDK-8250153 Incorrect copyright header in KeyAgreementTest.java, GroupName.java
404 Robert Mckenna Oracle JDK-8250152 AArch64: stack corruption after spilling vector register
404 Robert Mckenna Oracle JDK-8250151 array index out of bound in FileMapInfo::check_paths
404 Robert Mckenna Oracle JDK-8250150 vmTestbase/gc/lock/jni/jnilock002/TestDescription.java fails in jdk/hs nightly
404 Robert Mckenna Oracle JDK-8250149 Unexpected NoSuchAlgorithmException when using secure random impl from BCFIPS provider
404 Robert Mckenna Oracle JDK-8250148 Transition JFR Periodic Task Thread to "_thread_in_native" before invoking performance counters
404 Robert Mckenna Oracle JDK-8250147 aarch64: missing memory barrier in fast_storefield and fast_accessfield
404 Robert Mckenna Oracle JDK-8250146 JFR TestThreadStartEndEvents.java failed due to "RuntimeException: Wrong thread id"
404 Robert Mckenna Oracle JDK-8250145 Regression caused by the update to BCEL 6.0
404 Robert Mckenna Oracle JDK-8250144 [macos] App created with jpackage on Mac fails with error -10810
404 Robert Mckenna Oracle JDK-8250143 java/security/SecureRandom/ThreadSafe.java failed on windows
404 Robert Mckenna Oracle JDK-8250142 serviceability/dcmd/gc/HeapDumpCompressedTest.java fails with Graal + ZGC
404 Robert Mckenna Oracle JDK-8250141 Unexpected test result caused by C2 MergeMemNode::Ideal
404 Robert Mckenna Oracle JDK-8250140 Undo jhsdb related exclusiveAccess.dirs changes that were done for JDK-8220295
404 Robert Mckenna Oracle JDK-8250139 Clarify the behavior of java.net.NetworkInterface::equals
404 Robert Mckenna Oracle JDK-8250138 Shenandoah: Claim threads token in constructor of ShenandoahRootVerifier
404 Robert Mckenna Oracle JDK-8250137 gc/stress/gclocker/TestExcessGCLockerCollections.java does not compile
404 Robert Mckenna Oracle JDK-8250136 Shenandoah: Claim verifier thread roots for parallel processing
404 Robert Mckenna Oracle JDK-8250135 ZGC: Load barrier incorrectly elided in jdk/java/text/Format/DateFormat/SDFTCKZoneNamesTest.java
404 Robert Mckenna Oracle JDK-8250134 jdk/jfr/event/compiler/TestCompilerCompile.java failed due to "RuntimeException: No thread in event"
404 Robert Mckenna Oracle JDK-8250133 small HTML issues in java.xml package-info.java files
404 Robert Mckenna Oracle JDK-8250132 Test nsk/stress/jni/gclocker/gcl001 fails after co-location
404 Robert Mckenna Oracle JDK-8250131 Update --release 8 symbol information after JSR 337 MR3
404 Robert Mckenna Oracle JDK-8250130 [macos] EmptyFolderPackageTest.java failed "hdiutil: create failed - No child processes"
404 Robert Mckenna Oracle JDK-8250129 CTW: C2 compilation fails with "Live Node limit exceeded limit"
404 Robert Mckenna Oracle JDK-8250128 some jdk/javadoc/doclet tests fail (JDK 15)
404 Robert Mckenna Oracle JDK-8250127 java/net/MulticastSocket/Promiscuous.java fails after 8241072 (multi-homed systems)
404 Robert Mckenna Oracle JDK-8250126 Poor scalability in JfrCheckpointManager when using many threads after JDK-8242008
404 Robert Mckenna Oracle JDK-8250125 Suppress unconditional warning "JFR will be disabled during CDS dumping"
404 Robert Mckenna Oracle JDK-8250124 CTW: C2 (Shenandoah) compilation fails with SEGV in SBC2Support::pin_and_expand
404 Robert Mckenna Oracle JDK-8250123 compiler/ciReplay tests fail with AOT compiled java.base
404 Robert Mckenna Oracle JDK-8250122 [aarch64] SIGBUS by unaligned Unsafe compare_and_swap
404 Robert Mckenna Oracle JDK-8250121 sun.jvm.hostspot.code.CompressedReadStream readDouble() conversion to long mishandled
404 Robert Mckenna Oracle JDK-8250120 C2 failed "assert(C->live_nodes() - live_at_begin <= 2 * _nodes_required) failed: Bad node estimate: actual = 208 >> request = 101"
404 Robert Mckenna Oracle JDK-8250119 WinUpgradeUUIDTest application is missing in downgrade scenario
404 Robert Mckenna Oracle JDK-8250118 jpackage fails if app module is in external runtime
404 Robert Mckenna Oracle JDK-8250117 jpackage jtreg BasicTest.testTemp() test fails on Windows
404 Robert Mckenna Oracle JDK-8250116 [Graal] Many Javafuzzer tests failures with Graal, due to unexpected results, after last update JDK-8243380
404 Robert Mckenna Oracle JDK-8250115 JShell tests: jdk/jshell/FailOverDirectExecutionControlTest.java failed with java.lang.UnsupportedOperationException
404 Robert Mckenna Oracle JDK-8250114 test/langtools/jdk/jshell/FailOverExecutionControlTest.java fails No ExecutionControlProvider with name 'nonExistent' and parameter keys: []
404 Robert Mckenna Oracle JDK-8250113 JShell: When FailOverExecutionControlProvider fails the proximal cause is not shown
404 Robert Mckenna Oracle JDK-8250111 ProblemList sun/nio/ch/TestMaxCachedBufferSize.java on macOSX
404 Robert Mckenna Oracle JDK-8250110 ProblemList serviceability/jvmti/ModuleAwareAgents/ThreadStart/MAAThreadStart.java on Windows
404 Robert Mckenna Oracle JDK-8250109 ProblemList vmTestbase/nsk/jdi/stress/serial/mixed002/TestDescription.java
404 Robert Mckenna Oracle JDK-8250108 permits clause of sealed interfaces should not allow parameterized types
404 Robert Mckenna Oracle JDK-8250107 ProblemList java/lang/management/ThreadMXBean/ThreadMXBeanStateTest.java
404 Robert Mckenna Oracle JDK-8250106 ProblemList jdk/jfr/event/os/TestThreadContextSwitches.java
404 Robert Mckenna Oracle JDK-8250105 ProblemList compiler/ciReplay/TestServerVM.java and TestVMNoCompLevel.java with AOT
404 Robert Mckenna Oracle JDK-8250103 Kitchensink fails with: assert(destination == (address)-1 || destination == entry) failed: b) MT-unsafe modification of inline cache
404 Robert Mckenna Oracle JDK-8250102 --release => "unknown enum constant PreviewFeature$Feature.TEXT_BLOCKS"
404 Robert Mckenna Oracle JDK-8250101 Avoid superfluous Class::isRecord invocations during deserialization
404 Robert Mckenna Oracle JDK-8250100 [macos] Add failing DMG tests to problem list
404 Robert Mckenna Oracle JDK-8250099 Small clarification of the javadoc about builtin class loaders
404 Robert Mckenna Oracle JDK-8250098 JPKG001-012: application icon is missing in Control Panel Add/Remove
404 Robert Mckenna Oracle JDK-8250097 [JVMCI] `ResolvedJavaType.getDeclaredMethod()` can throw NoClassDefFoundError.
404 Robert Mckenna Oracle JDK-8250096 assert ((klass)->trace_id()) & ((JfrTraceIdEpoch::method_and_class_in_use_this_epoch_bits()))) != 0 in ObjectSampleCheckpoint::add_to_leakp_set
404 Robert Mckenna Oracle JDK-8250095 Build microbenchmarks with --enable-preview
404 Robert Mckenna Oracle JDK-8250094 Records deserialization is slow
404 Robert Mckenna Oracle JDK-8250093 SparkExamples24H.java SIGSEGV in various places
404 Robert Mckenna Oracle JDK-8250092 doclint: don't complain about summary/caption when role=presentation
404 Robert Mckenna Oracle JDK-8250091 remove scripts under bin/nashorn and doc/nashorn/source
404 Robert Mckenna Oracle JDK-8250090 Improve javadoc of Foreign Memory Access API
404 Robert Mckenna Oracle JDK-8250089 Incorrect tail computation for large segments in AbstractMemorySegmentImpl::mismatch
404 Robert Mckenna Oracle JDK-8250088 [JVMCI] HotSpotNmethod.executeVarargs can try execute a zombie nmethod
404 Robert Mckenna Oracle JDK-8250087 bad reference in @throws in HotSpotDiagnosticMXBean
404 Robert Mckenna Oracle JDK-8250086 [macos] Java2D Queue Flusher crash while moving application window to external monitor
404 Robert Mckenna Oracle JDK-8250085 minor HTML errors in com.sun.jdi
404 Robert Mckenna Oracle JDK-8250084 doclint errors in NIO code
404 Robert Mckenna Oracle JDK-8250083 JShell crashes when typing text block
404 Robert Mckenna Oracle JDK-8250082 assert(outer->outcnt() == 2) failed: 'only phis' failure in LoopNode::verify_strip_mined()
404 Robert Mckenna Oracle JDK-8250081 All log0() in com/sun/org/slf4j/internal/Logger.java should be private
404 Robert Mckenna Oracle JDK-8250080 XMLDsig logging does not work
404 Robert Mckenna Oracle JDK-8250079 Bad link causes invalid documentation
404 Robert Mckenna Oracle JDK-8250078 doclint: recategorize "no description for ..." as MISSING, not SYNTAX
404 Robert Mckenna Oracle JDK-8250077 Only one of several deprecated overloaded methods listed in the Deprecated list
404 Robert Mckenna Oracle JDK-8250076 Refine the Help page for API Documentation
404 Robert Mckenna Oracle JDK-8250075 Trust final fields in records
404 Robert Mckenna Oracle JDK-8250074 Type annotation is not shown for wildcard type in Javadoc
404 Robert Mckenna Oracle JDK-8250073 Javadoc search needs a fix to handle duplicate package names in different modules
404 Robert Mckenna Oracle JDK-8250072 NullPointerException in JDK 14 javac compiling a method reference
404 Robert Mckenna Oracle JDK-8250071 Javadoc Search specification link from Javadoc Help page points to JDK 13 spec
404 Robert Mckenna Oracle JDK-8250070 C2 compilation fails with "Live Node limit exceeded limit" during ConvI2L::Ideal optimization
404 Robert Mckenna Oracle JDK-8250069 Enable ShowCodeDetailsInExceptionMessages by default
404 Robert Mckenna Oracle JDK-8250068 HTML errors and warnings in threadPrimitiveDeprecation.html
404 Robert Mckenna Oracle JDK-8250067 Invalid (@throw) tags in 2 java.io classes
404 Robert Mckenna Oracle JDK-8250066 Invalid @see in java.management
404 Robert Mckenna Oracle JDK-8250065 bad HTML(href==...) in table
404 Robert Mckenna Oracle JDK-8250064 DocCommentParser should not reject standalone '>'
404 Robert Mckenna Oracle JDK-8250063 Shenandoah: reconsider free budget slice for marking
404 Robert Mckenna Oracle JDK-8250062 Remove use of reflection from test/jdk/java/io/Serializable/records/StreamRefTest.java
404 Robert Mckenna Oracle JDK-8250061 BasicShortcutHintTest shortcut can not be found
404 Robert Mckenna Oracle JDK-8250060 ZGC: More parallel gc/z/TestUncommit.java test configuration
404 Robert Mckenna Oracle JDK-8250059 [Graal] compiler/loopopts/TestLogSum.java timed out
404 Robert Mckenna Oracle JDK-8250058 provide tests for binary compatibility assertions for sealed classes
404 Robert Mckenna Oracle JDK-8250057 Annotated record's vararg type component started to be uncompilable with JDK15b24
404 Robert Mckenna Oracle JDK-8250056 javadoc crashes when a doc-files directory contains a '#' file
404 Robert Mckenna Oracle JDK-8250055 NPE compiling lambda expression within conditional expression
404 Robert Mckenna Oracle JDK-8250054 move two tests for whitebox from test/hotspot/jtreg/sanity to test/lib-test
404 Robert Mckenna Oracle JDK-8250053 JVM_RegisterWhiteBoxMethods checks wrong classloader
404 Robert Mckenna Oracle JDK-8250052 AArch64: assert((unsigned)fpargs < 32)
404 Robert Mckenna Oracle JDK-8250051 [TESTBUG] runtime/cds/appcds/dynamicArchive tests failing with Graal
404 Robert Mckenna Oracle JDK-8250050 Relative link tags in record javadoc don't resolve
404 Robert Mckenna Oracle JDK-8250049 API for Class::permittedSubclasses should clarify if returned elements are ordered or not
404 Robert Mckenna Oracle JDK-8250048 runtime/cds/appcds/jigsaw/modulepath/OptimizeModuleHandlingTest.java failing with Graal
404 Robert Mckenna Oracle JDK-8250046 [TESTBUG] ReturnBlobToWrongHeapTest.java failed allocating blob
404 Robert Mckenna Oracle JDK-8250045 java/lang/invoke/CallSiteTest.java failed with InvocationTargetException in Graal mode
404 Robert Mckenna Oracle JDK-8250044 Cloneable test in HmacCore seems questionable
404 Robert Mckenna Oracle JDK-8250043 doclint errors (missing comments) in jdk.compiler and jdk.javadoc
404 Robert Mckenna Oracle JDK-8250006 JDK 15 L10n resource file update - msg drop 10
404 Robert Mckenna Oracle JDK-8250004 8 vm/classfmt/atr_ann/atr_rtm_annot007/atr_rtm_annot00709 tests fail w/ AOT
404 Robert Mckenna Oracle JDK-8250002 Incorrect copyright header in TestUnsafeUnalignedSwap.java
404 Robert Mckenna Oracle JDK-8249992 Backout ProblemList-ed tests introduced by JDK-8247876
404 Robert Mckenna Oracle JDK-8249980 ProblemList various crypto tests on aarch64
404 Robert Mckenna Oracle JDK-8249975 move testlibrary tests into one place

No changesets log

JDK-8260182 Release Note: JDK Time-Zone Data Upgraded to tzdata2020d
JDK-8260162 Release Note: JDK Time-Zone Data Upgraded to tzdata2020c
JDK-8255420 Release Note: US/Pacific-New Zone Name Removed as Part of tzdata2020b
JDK-8250009 Error when cross compiling with JDK 13, release flag and JFR package
JDK-8249999 Stamp the Javadoc Search Specification with the JDK version
JDK-8249988 Update man pages for inline flags
JDK-8249984 Javadoc doc-comment-spec contains unintentional HTML char reference
JDK-8249983 Fix typos in man pages
JDK-8249974 Records: Specify permitted accessibility of canonical constructor of a private record class

Committer push log

Alex Kasko, Red Hat

Bug Summary
JDK-8253738 java/awt/dnd/DisposeFrameOnDragCrash/DisposeFrameOnDragTest.java fails on Windows
JDK-8253790 JVM crash in "AwtFrame::WmSize" method
JDK-8253737 JVM crashed at imjpapi.dll in native code

Christoph Langer, SAP

Bug Summary
JDK-8254277 Add exception for expiring Digicert root certificates to VerifyCACerts test
JDK-8256404 Issue with useAppleColor check in CSystemColors.m
JDK-8254278 java/security/cert/PolicyNode/GetPolicyQualifiers.java fails due to an expired certificate
JDK-8255986 Memory/Performance regression after JDK-8210985
JDK-8256403 OSX build fails with Xcode 12.0 (12A7209)
JDK-8257055 Test com/sun/jndi/dns/ConfigTests/PortUnreachable.java does not work on AIX

Sean Coffey, Oracle

Bug Summary
JDK-8254687 (tz) Upgrade time-zone data to tzdata2020b
JDK-8255333 (tz) Upgrade time-zone data to tzdata2020c
JDK-8255942 (tz) Upgrade time-zone data to tzdata2020d
JDK-8251391 Revert Principal Name type to NT-UNKNOWN when requesting TGS Kerberos tickets
JDK-8252370 Wrong translation for the month of May in ar_JO, ar_LB and ar_SY

Harold Seigel, Oracle

Bug Summary
JDK-8251485 MonitorInfo stores raw oops across safepoints

Jaroslav Bachorík, DataDog

Bug Summary
JDK-8253347 Hash code calculation of JfrStackTrace is inconsistent
JDK-8253346 JFR: Improve hash algorithm for stack traces

Vladimir Kozlov, Oracle

Bug Summary
JDK-8250561 AOT's Linker.java seems to eagerly fail-fast on Windows.
JDK-8255071 Assert '(_pcs_length == 0 || last_pc()->pc_offset() < pc_offset) failed: must specify a new, larger pc offset' failure
JDK-8250566 Include microcode revision in features_string on x86
JDK-8251106 libgraal can deadlock in -Xcomp mode
JDK-8254347 Remove unneeded nops introduced by 8234160 changes
JDK-8255354 SIGSEGV in string_indexof_char and stringL_indexof_char intrinsics

Rajan Halade, Oracle

Bug Summary
JDK-8250971 Add Entrust root CA - G4 to Oracle Root CA program
JDK-8251137 Add SSL root certificates to Oracle Root CA program

Robert Mckenna, Oracle

Bug Summary
JDK-8250199 (bf) Force DirectBufferAllocTest to run with -ExplicitGCInvokesConcurrent
JDK-8250102 --release => "unknown enum constant PreviewFeature$Feature.TEXT_BLOCKS"
JDK-8250004 8 vm/classfmt/atr_ann/atr_rtm_annot007/atr_rtm_annot00709 tests fail w/ AOT
JDK-8250204 @ignore should be used instead of ProblemList for 8158860, 8163894, 8193479, 8194310
JDK-8250122 [aarch64] SIGBUS by unaligned Unsafe compare_and_swap
JDK-8250187 [dark_mode ubuntu 20.04] The selected menu is not highlighted in GTKLookAndFeel
JDK-8251065 [Graal] api/java_security/SignatureSpi/DelegationTests.html fails with Method "javasoft.sqe.tests.api.java.security.SignatureSpi.JCKSignatureSpi.clear" doesn't exist.
JDK-8250059 [Graal] compiler/loopopts/TestLogSum.java timed out
JDK-8250171 [Graal] java/lang/Class/getDeclaredField/FieldSetAccessibleTest.java timeouts
JDK-8250116 [Graal] Many Javafuzzer tests failures with Graal, due to unexpected results, after last update JDK-8243380
JDK-8250161 [Graal] Several testcases from applications/jcstress/acqrel.java fails with forbidden state
JDK-8250097 [JVMCI] `ResolvedJavaType.getDeclaredMethod()` can throw NoClassDefFoundError.
JDK-8250088 [JVMCI] HotSpotNmethod.executeVarargs can try execute a zombie nmethod
JDK-8250168 [macos] Add EmptyFolderPackageTest test to problem list
JDK-8250100 [macos] Add failing DMG tests to problem list
JDK-8250144 [macos] App created with jpackage on Mac fails with error -10810
JDK-8250130 [macos] EmptyFolderPackageTest.java failed "hdiutil: create failed - No child processes"
JDK-8250086 [macos] Java2D Queue Flusher crash while moving application window to external monitor
JDK-8251061 [macos] Sound Recording and playback is not working
JDK-8250225 [TESTBUG] compiler/loopopts/PartialPeelingUnswitch.java times out with Graal enabled
JDK-8250046 [TESTBUG] ReturnBlobToWrongHeapTest.java failed allocating blob
JDK-8250051 [TESTBUG] runtime/cds/appcds/dynamicArchive tests failing with Graal
JDK-8250052 AArch64: assert((unsigned)fpargs < 32)
JDK-8250147 aarch64: missing memory barrier in fast_storefield and fast_accessfield
JDK-8250152 AArch64: stack corruption after spilling vector register
JDK-8252699 Add jarsigner and keytool tests for restricted algorithms
JDK-8250081 All log0() in com/sun/org/slf4j/internal/Logger.java should be private
JDK-8250057 Annotated record's vararg type component started to be uncompilable with JDK15b24
JDK-8250049 API for Class::permittedSubclasses should clarify if returned elements are ordered or not
JDK-8250151 array index out of bound in FileMapInfo::check_paths
JDK-8250096 assert ((klass)->trace_id()) & ((JfrTraceIdEpoch::method_and_class_in_use_this_epoch_bits()))) != 0 in ObjectSampleCheckpoint::add_to_leakp_set
JDK-8250082 assert(outer->outcnt() == 2) failed: 'only phis' failure in LoopNode::verify_strip_mined()
JDK-8250101 Avoid superfluous Class::isRecord invocations during deserialization
JDK-8249992 Backout ProblemList-ed tests introduced by JDK-8247876
JDK-8250065 bad HTML(href==...) in table
JDK-8250079 Bad link causes invalid documentation
JDK-8250087 bad reference in @throws in HotSpotDiagnosticMXBean
JDK-8250061 BasicShortcutHintTest shortcut can not be found
JDK-8250170 Build fails if source code in cygwin home dir
JDK-8250095 Build microbenchmarks with --enable-preview
JDK-8250070 C2 compilation fails with "Live Node limit exceeded limit" during ConvI2L::Ideal optimization
JDK-8251066 C2 crash in IfNode::fold_compares
JDK-8250120 C2 failed "assert(C->live_nodes() - live_at_begin <= 2 * _nodes_required) failed: Bad node estimate: actual = 208 >> request = 101"
JDK-8250139 Clarify the behavior of java.net.NetworkInterface::equals
JDK-8250188 clean up FileInstaller $test.src $cwd in vmTestbase_nsk_aod tests
JDK-8250190 clean up FileInstaller $test.src $cwd in vmTestbase_nsk_jdb tests
JDK-8250175 clean up FileInstaller $test.src $cwd in vmTestbase_nsk_jdwp tests
JDK-8250189 clean up FileInstaller $test.src $cwd in vmTestbase_nsk_jvmti tests
JDK-8250174 clean up FileInstaller $test.src $cwd in vmTestbase_nsk_monitoring tests
JDK-8250177 clean up FileInstaller $test.src $cwd in vmTestbase_nsk_stress tests
JDK-8250176 clean up FileInstaller $test.src $cwd in vmTestbase_nsk_sysdict tests
JDK-8250164 clean up FileInstaller $test.src $cwd in vmTestbase_vm_compiler tests
JDK-8250172 clean up FileInstaller $test.src $cwd in vmTestbase_vm_defmeth tests
JDK-8250157 clean up FileInstaller $test.src $cwd in vmTestbase_vm_g1classunloading tests
JDK-8250163 clean up FileInstaller $test.src $cwd in vmTestbase_vm_gc tests
JDK-8250173 clean up FileInstaller $test.src $cwd in vmTestbase_vm_metaspace tests
JDK-8250154 clean up FileInstaller $test.src $cwd in vmTestbase_vm_mlvm tests
JDK-8250203 cleanup graal problem lists
JDK-8250044 Cloneable test in HmacCore seems questionable
JDK-8250123 compiler/ciReplay tests fail with AOT compiled java.base
JDK-8250186 compiler/graalunit/CoreTest.java timed out
JDK-8250861 Crash in MinINode::Ideal(PhaseGVN*, bool)
JDK-8250124 CTW: C2 (Shenandoah) compilation fails with SEGV in SBC2Support::pin_and_expand
JDK-8250129 CTW: C2 compilation fails with "Live Node limit exceeded limit"
JDK-8250064 DocCommentParser should not reject standalone '>'
JDK-8250043 doclint errors (missing comments) in jdk.compiler and jdk.javadoc
JDK-8250084 doclint errors in NIO code
JDK-8250092 doclint: don't complain about summary/caption when role=presentation
JDK-8250078 doclint: recategorize "no description for ..." as MISSING, not SYNTAX
JDK-8250069 Enable ShowCodeDetailsInExceptionMessages by default
JDK-8250209 failed: sanity at src/hotspot/share/opto/escape.cpp:2361
JDK-8250137 gc/stress/gclocker/TestExcessGCLockerCollections.java does not compile
JDK-8250205 gc/stress/TestJNIBlockFullGC/TestJNIBlockFullGC.java fails w/ UnsatisfiedLinkError
JDK-8250068 HTML errors and warnings in threadPrimitiveDeprecation.html
JDK-8250090 Improve javadoc of Foreign Memory Access API
JDK-8250167 Improve UX of the search control
JDK-8250153 Incorrect copyright header in KeyAgreementTest.java, GroupName.java
JDK-8250196 Incorrect copyright header in TestInvalidTieredStopAtLevel.java
JDK-8250002 Incorrect copyright header in TestUnsafeUnalignedSwap.java
JDK-8250089 Incorrect tail computation for large segments in AbstractMemorySegmentImpl::mismatch
JDK-8250067 Invalid (@throw) tags in 2 java.io classes
JDK-8250066 Invalid @see in java.management
JDK-8250207 java/io/File/GetXSpace.java should be added to exclude list, and not @ignore-d
JDK-8250045 java/lang/invoke/CallSiteTest.java failed with InvocationTargetException in Graal mode
JDK-8250206 java/lang/invoke/LFCaching/LFGarbageCollectedTest.java should be ProblemList-ed and not @ignored
JDK-8250127 java/net/MulticastSocket/Promiscuous.java fails after 8241072 (multi-homed systems)
JDK-8250143 java/security/SecureRandom/ThreadSafe.java failed on windows
JDK-8250184 java/util/StringJoiner/StringJoinerTest.java failed due to OOM
JDK-8250158 javac defines type annotations incorrectly for record members (constructor and property accessor)
JDK-8250056 javadoc crashes when a doc-files directory contains a '#' file
JDK-8250073 Javadoc search needs a fix to handle duplicate package names in different modules
JDK-8250071 Javadoc Search specification link from Javadoc Help page points to JDK 13 spec
JDK-8250006 JDK 15 L10n resource file update - msg drop 10
JDK-8253158 jdk jtreg test security/infra/java/security/cert/CertPathValidator/certification/GlobalSignR6CA.java fails
JDK-8251417 JDK-8248299 breaks JDK 15 validate-headers build
JDK-8250134 jdk/jfr/event/compiler/TestCompilerCompile.java failed due to "RuntimeException: No thread in event"
JDK-8250146 JFR TestThreadStartEndEvents.java failed due to "RuntimeException: Wrong thread id"
JDK-8250208 JFR: java.base events have incomplete stacktraces
JDK-8250118 jpackage fails if app module is in external runtime
JDK-8250117 jpackage jtreg BasicTest.testTemp() test fails on Windows
JDK-8250159 jpackage tests failed due to "semop(1): encountered an error: Invalid argument"
JDK-8250098 JPKG001-012: application icon is missing in Control Panel Add/Remove
JDK-8250083 JShell crashes when typing text block
JDK-8250115 JShell tests: jdk/jshell/FailOverDirectExecutionControlTest.java failed with java.lang.UnsupportedOperationException
JDK-8250197 JShell uses 100% of one core all the time
JDK-8250113 JShell: When FailOverExecutionControlProvider fails the proximal cause is not shown
JDK-8250053 JVM_RegisterWhiteBoxMethods checks wrong classloader
JDK-8250210 JVMCI calling register_nmethod without CodeCache lock
JDK-8250103 Kitchensink fails with: assert(destination == (address)-1 || destination == entry) failed: b) MT-unsafe modification of inline cache
JDK-8250211 Make TestGCLocker more resilient with concurrent GCs
JDK-8250085 minor HTML errors in com.sun.jdi
JDK-8251063 missed open parenthesis for GTEST_FRAMEWORK_SRC var in Main.gmk
JDK-8250193 monitor list lock operations need more fencing
JDK-8250192 more fencing needed in async deflation for non-TSO machines
JDK-8250155 move test/jdk/lib/testlibrary/java/util/jar/*.java to top-level library or a local library
JDK-8249975 move testlibrary tests into one place
JDK-8250054 move two tests for whitebox from test/hotspot/jtreg/sanity to test/lib-test
JDK-8250666 Need support for building native libraries located in the test/lib directory
JDK-8251064 Net.java translateToSocketException does not handle IOException
JDK-8250185 No helpful NullPointerException message after calling fillInStackTrace.
JDK-8250055 NPE compiling lambda expression within conditional expression
JDK-8250072 NullPointerException in JDK 14 javac compiling a method reference
JDK-8250077 Only one of several deprecated overloaded methods listed in the Deprecated list
JDK-8250108 permits clause of sealed interfaces should not allow parameterized types
JDK-8250169 PhaseStringOpts crashes while optimising effectively dead code
JDK-8250126 Poor scalability in JfrCheckpointManager when using many threads after JDK-8242008
JDK-8250105 ProblemList compiler/ciReplay/TestServerVM.java and TestVMNoCompLevel.java with AOT
JDK-8250107 ProblemList java/lang/management/ThreadMXBean/ThreadMXBeanStateTest.java
JDK-8250106 ProblemList jdk/jfr/event/os/TestThreadContextSwitches.java
JDK-8250110 ProblemList serviceability/jvmti/ModuleAwareAgents/ThreadStart/MAAThreadStart.java on Windows
JDK-8250111 ProblemList sun/nio/ch/TestMaxCachedBufferSize.java on macOSX
JDK-8249980 ProblemList various crypto tests on aarch64
JDK-8250109 ProblemList vmTestbase/nsk/jdi/stress/serial/mixed002/TestDescription.java
JDK-8250058 provide tests for binary compatibility assertions for sealed classes
JDK-8250094 Records deserialization is slow
JDK-8250076 Refine the Help page for API Documentation
JDK-8250145 Regression caused by the update to BCEL 6.0
JDK-8250050 Relative link tags in record javadoc don't resolve
JDK-8250091 remove scripts under bin/nashorn and doc/nashorn/source
JDK-8250194 Remove unnecessary trademark symbols
JDK-8250062 Remove use of reflection from test/jdk/java/io/Serializable/records/StreamRefTest.java
JDK-8250195 Revert JDK-8226253 which breaks the spec of AccessibleState.SHOWING for JList
JDK-8250048 runtime/cds/appcds/jigsaw/modulepath/OptimizeModuleHandlingTest.java failing with Graal
JDK-8250142 serviceability/dcmd/gc/HeapDumpCompressedTest.java fails with Graal + ZGC
JDK-8250138 Shenandoah: Claim threads token in constructor of ShenandoahRootVerifier
JDK-8250136 Shenandoah: Claim verifier thread roots for parallel processing
JDK-8250166 Shenandoah: deadlock during class unloading OOME
JDK-8250198 Shenandoah: Fix racy GC request handling
JDK-8251062 Shenandoah: LRB needs to save/restore fp registers for runtime call
JDK-8250063 Shenandoah: reconsider free budget slice for marking
JDK-8250183 SIGILL in C2 generated OSR compilation
JDK-8250099 Small clarification of the javadoc about builtin class loaders
JDK-8250133 small HTML issues in java.xml package-info.java files
JDK-8250128 some jdk/javadoc/doclet tests fail (JDK 15)
JDK-8250093 SparkExamples24H.java SIGSEGV in various places
JDK-8251955 SSLSocket.getSession() doesn't close connection for timeout/ interrupts
JDK-8250121 sun.jvm.hostspot.code.CompressedReadStream readDouble() conversion to long mishandled
JDK-8252698 sun/security/validator/PKIXValAndRevCheckTests.java fails with "RuntimeException: Received unexpected exception"
JDK-8250125 Suppress unconditional warning "JFR will be disabled during CDS dumping"
JDK-8250227 Test test/hotspot/jtreg/runtime/7162488/TestUnrecognizedVmOption.java fails when -XX:+IgnoreUnrecognizedVMOptions is set
JDK-8250132 Test nsk/stress/jni/gclocker/gcl001 fails after co-location
JDK-8250200 test/jdk/java/util/ServiceLoader/ReloadTest.java uses nashorn script engine
JDK-8250114 test/langtools/jdk/jshell/FailOverExecutionControlTest.java fails No ExecutionControlProvider with name 'nonExistent' and parameter keys: []
JDK-8250156 test/lib/jdk/test/lib/util/JarBuilder.java has a bad copyright
JDK-8251059 The README need not mention retrieving source code
JDK-8250148 Transition JFR Periodic Task Thread to "_thread_in_native" before invoking performance counters
JDK-8250075 Trust final fields in records
JDK-8251416 two jdeps files miss copyright header
JDK-8250074 Type annotation is not shown for wildcard type in Javadoc
JDK-8250140 Undo jhsdb related exclusiveAccess.dirs changes that were done for JDK-8220295
JDK-8250149 Unexpected NoSuchAlgorithmException when using secure random impl from BCFIPS provider
JDK-8250162 Unexpected StackOverflowError in "process reaper" thread
JDK-8253598 Unexpected StackOverflowError in "process reaper" thread still happens
JDK-8250141 Unexpected test result caused by C2 MergeMemNode::Ideal
JDK-8250131 Update --release 8 symbol information after JSR 337 MR3
JDK-8251060 Update all nroff manpages for JDK 15 release
JDK-8250202 use 8249621 to ignore 8 jvmci tests
JDK-8250201 VM crashes with "Current BasicObjectLock* below than low_mark"
JDK-8250165 vm.gc.X should take selected JIT into account
JDK-8250150 vmTestbase/gc/lock/jni/jnilock002/TestDescription.java fails in jdk/hs nightly
JDK-8250119 WinUpgradeUUIDTest application is missing in downgrade scenario
JDK-8250080 XMLDsig logging does not work
JDK-8250160 ZGC: AArch64: SIGILL in load barrier register spilling
JDK-8250135 ZGC: Load barrier incorrectly elided in jdk/java/text/Format/DateFormat/SDFTCKZoneNamesTest.java
JDK-8250060 ZGC: More parallel gc/z/TestUncommit.java test configuration

Roland Westrelin, Red Hat

Bug Summary
JDK-8253045 8240795 may cause anti-dependence to be missed

Severin Gehwolf, Red Hat

Bug Summary
JDK-8255545 [cgroups v1] Metric limits not properly detected on some join controller combinations
JDK-8254150 [cgroups v2] Memory and swap limits reported incorrectly
JDK-8254149 [cgroups v2] Soft memory limit incorrectly using memory.high
JDK-8253723 HotSpot Not Identifying it is Running in a Container

Aleksey Shipilev, Red Hat

Bug Summary
JDK-8251902 C2: compiler/intrinsics/object/TestClone fails with -XX:+VerifyGraphEdges
JDK-8255391 C2: Masked byte comparisons with large masks produce wrong result on x86
JDK-8255390 clazz.isAssignableFrom will return false for interface implementors
JDK-8253087 compiler/oracle/TestCompileCommand.java misspells "occured"
JDK-8252363 jvmciCompilerToVM.cpp declares jio_printf with "void" return type, should be "int"
JDK-8251901 Make sure {type,obj}ArrayOopDesc accessors check the bounds
JDK-8257590 Memory leak in Java_java_lang_ClassLoader_defineClass0()
JDK-8255538 Missing return statement in __sync_val_compare_and_swap_8
JDK-8257053 nmethod_entry_barrier stub miscalculates xmm spill size on x86_32
JDK-8254746 Non-x86 Zero builds fail with return-type warning in os_linux_zero.cpp
JDK-8256185 NPE on ClassValue.ClassValueMap.cacheArray
JDK-8253088 Parse::do_lookupswitch fails with "assert(_cnt >= 0) failed"
JDK-8255392 Restore Copyright line in file modified by 8253191
JDK-8257428 s390x builds are very noisy with gc-sections messages
JDK-8250942 Shenandoah: add update watermark line in rich assert failure message
JDK-8251335 Shenandoah: assert(_nm->is_alive()) failed: only alive nmethods here
JDK-8250949 Shenandoah: assertion failure with -XX:-ResizeTLAB
JDK-8250945 Shenandoah: build fails without both JVMTI and JFR
JDK-8255539 Shenandoah: C2 native LRB should activate for non-cset objects
JDK-8251334 Shenandoah: Clear soft-refs on requested GC cycle
JDK-8254752 Shenandoah: Concurrent Strong Roots logging is incorrect
JDK-8252134 Shenandoah: filter null oops before calling enqueue/SATB barrier
JDK-8250946 Shenandoah: gc/shenandoah/mxbeans tests should account for corner cases
JDK-8252135 Shenandoah: Handshake threads between weak-roots and reset phases
JDK-8250944 Shenandoah: incorrect include in shenandoahInitLogger.cpp
JDK-8255540 Shenandoah: Interpreter native-LRB needs to activate during HAS_FORWARDED
JDK-8250940 Shenandoah: mxbeans tests can be shorter
JDK-8257842 Shenandoah: objArrayKlass metadata is not marked with chunked arrays
JDK-8250939 Shenandoah: options tests should run with smaller heaps
JDK-8250937 Shenandoah: pre-Full GC root updates may miss some roots
JDK-8250947 Shenandoah: provide per-cycle pacing stats
JDK-8257841 Shenandoah: Query is_at_shenandoah_safepoint() from control thread should return false
JDK-8250948 Shenandoah: refactor TLAB/GCLAB retirement code
JDK-8251900 Shenandoah: Remark ObjectSynchronizer roots with I-U
JDK-8251899 Shenandoah: remove leftover code after JDK-8231086
JDK-8251519 Shenandoah: remove ShenandoahAssertToSpaceClosure
JDK-8251518 Shenandoah: remove ShenandoahCriticalControlThreadPriority support
JDK-8254751 Shenandoah: remove unimplemented ShenandoahStrDedupQueue::verify
JDK-8250943 Shenandoah: SATB buffer handling may assume no forwarded objects
JDK-8254750 Shenandoah: ShenandoahStrDedupQueue destructor calls virtual num_queues()
JDK-8250938 Shenandoah: should not block pacing reporters
JDK-8250941 Shenandoah: split heavy tests by heuristics to improve parallelism
JDK-8252891 Shenandoah: support manageable SoftMaxHeapSize option
JDK-8254749 Shenandoah: unused AlwaysTrueClosure after JDK-8246591
JDK-8254745 ShenandoahSafepoint::is_at_shenandoah_safepoint should not access VMThread state from other threads
JDK-8254281 Zero OrderAccess barrier mappings are incorrect
JDK-8255537 Zero: accessor_entry misses the IRIW case
JDK-8257427 Zero: Linux x86_32 build still fails
JDK-8255228 Zero: return-type warning in zeroInterpreter_zero.cpp

Stefan Karlsson, Oracle

Bug Summary
JDK-8252736 Undo JDK-8245000: Windows GDI functions don't support large pages
JDK-8252737 Undo JDK-8245002: Windows GDI functions don't support NUMA interleaving

Tobias Hartmann, Oracle

Bug Summary
JDK-8256845 AArch64: AOT compiled code crashes if C2 allocates r27
JDK-8256846 AArch64: Insufficient error handling when CodeBuffer is exhausted
JDK-8256472 C2 CompilerThread0 crash in Node::add_req(Node*)

Vladimir Kempik, Azul

Bug Summary
JDK-8252355 [macos] bring back O2 opt level for unsafe.cpp
JDK-8252356 [macos] zerovm is broken due to libffi headers location
JDK-8252357 Fix issues with cross-compile on macos

Zhengyu Gu, Red Hat

Bug Summary
JDK-8251095 Shenandoah: need to reset/finish dead counters for StringTable/ResolvedMethodTable during STW root processing