PUSHES REPORT: 16.0.1

This report shows who pushed the backports to the given release. This usually shows who did the backporting, testing, and review work.

Report generated: Wed Sep 01 04:38:59 CEST 2021

Distribution by priority

Count Priority
2 P1
46 P2
70 P3
48 P4
2 P5

Distribution by components

Count Component
168 Total
90 (53.6%) hotspot
43 (25.6%) hotspot/compiler
20 (11.9%) hotspot/gc
19 (11.3%) hotspot/runtime
6 (3.6%) hotspot/jfr
1 (0.6%) hotspot/svc-agent
1 (0.6%) hotspot/svc
30 (17.9%) core-libs
7 (4.2%) core-libs
7 (4.2%) core-libs/java.lang
3 (1.8%) core-libs/java.nio
2 (1.2%) core-libs/jdk.nashorn
2 (1.2%) core-libs/java.net
2 (1.2%) core-libs/java.time
1 (0.6%) core-libs/java.rmi
1 (0.6%) core-libs/java.util.concurrent
1 (0.6%) core-libs/java.util.stream
1 (0.6%) core-libs/java.util.logging
1 (0.6%) core-libs/java.lang:reflect
1 (0.6%) core-libs/java.util:i18n
1 (0.6%) core-libs/java.util.jar
18 (10.7%) tools
12 (7.1%) tools/javac
5 (3.0%) tools/javadoc(tool)
1 (0.6%) tools/jpackage
10 (6.0%) client-libs
4 (2.4%) client-libs/2d
3 (1.8%) client-libs/java.awt
3 (1.8%) client-libs/javax.swing
9 (5.4%) infrastructure
7 (4.2%) infrastructure/build
1 (0.6%) infrastructure/release_eng
1 (0.6%) infrastructure
6 (3.6%) security-libs
3 (1.8%) security-libs/java.security
2 (1.2%) security-libs/javax.net.ssl
1 (0.6%) security-libs/org.ietf.jgss:krb5
2 (1.2%) core-svc
1 (0.6%) core-svc/tools
1 (0.6%) core-svc/debugger
2 (1.2%) xml
2 (1.2%) xml/jaxp
1 (0.6%) globalization
1 (0.6%) globalization/translation

Distribution by affiliation

Count Committer
168 Total
109 (64.9%) Oracle
11 (6.5%) Tobias Hartmann
9 (5.4%) Harold Seigel
9 (5.4%) Jonathan Gibbons
8 (4.8%) Daniel Daugherty
5 (3.0%) Vicente Arturo Romero Zaldivar
5 (3.0%) Maurizio Cimadamore
4 (2.4%) Erik Gahlin
4 (2.4%) Rajan Halade
4 (2.4%) Kiran Sidhartha Ravikumar
4 (2.4%) Vladimir Ivanov
3 (1.8%) Kim Barrett
3 (1.8%) Evan Whelan
3 (1.8%) Erik Joelsson
2 (1.2%) Calvin Cheung
2 (1.2%) Michael McMahon
2 (1.2%) Roberto Castaneda Lozano
2 (1.2%) Prasanta Sadhukhan
2 (1.2%) Igor Ignatyev
2 (1.2%) Thejasvi Voniadka
2 (1.2%) Christian Hagedorn
2 (1.2%) Philip Race
1 (0.6%) Markus Grönlund
1 (0.6%) Stuart Marks
1 (0.6%) Nils Eliasson
1 (0.6%) Magnus Ihse Bursie
1 (0.6%) Hannes Wallnoefer
1 (0.6%) Jan Lahoda
1 (0.6%) Pankaj Bansal
1 (0.6%) Sean Coffey
1 (0.6%) Per Liden
1 (0.6%) Claes Redestad
1 (0.6%) Dmitry Markov
1 (0.6%) Vladimir Kozlov
1 (0.6%) Naoto Sato
1 (0.6%) Robert Mckenna
1 (0.6%) Leo Jiang
1 (0.6%) Joe Darcy
1 (0.6%) Erik Österlund
1 (0.6%) Jesper Wilhelmsson
1 (0.6%) Brent Christian
1 (0.6%) Thomas Schatzl
1 (0.6%) Alexander Zuev
30 (17.9%) Red Hat
25 (14.9%) Aleksey Shipilev
3 (1.8%) Roland Westrelin
1 (0.6%) Andrew Hughes
1 (0.6%) Roman Kennke
6 (3.6%) SAP
5 (3.0%) Christoph Langer
1 (0.6%) Martin Doerr
5 (3.0%) Independent
2 (1.2%) Attila Szegedi
1 (0.6%) Chris Hegarty
1 (0.6%) Guoxiong Li
1 (0.6%) Rafael Winterhalter
4 (2.4%) Tencent
3 (1.8%) Jie Fu
1 (0.6%) Wang Chao
3 (1.8%) ARM
2 (1.2%) Xiaohong Gong
1 (0.6%) Ningsheng Jian
2 (1.2%) @126.com
2 (1.2%) Wang Huang
2 (1.2%) Microdoc
2 (1.2%) Christoph Göttschkes
1 (0.6%) Amazon
1 (0.6%) Sergey Bylokhov
1 (0.6%) Ampere
1 (0.6%) Patrick Zhang
1 (0.6%) DataDog
1 (0.6%) Jaroslav Bachorík
1 (0.6%) Google
1 (0.6%) Martin Buchholz
1 (0.6%) Huawei
1 (0.6%) Dong Bo
1 (0.6%) Intel
1 (0.6%) Sandhya Viswanathan
1 (0.6%) Unknown
1 (0.6%) ysuenaga

Chronological push log:

Days Ago Committer Affiliation Bug Summary
176 Harold Seigel Oracle JDK-8263197 try catch Method failing to work when dividing an integer by 0
180 Andrew Hughes Red Hat JDK-8263047 x86 32-bit build fails when -fcf-protection is passed in the compiler flags
180 Attila Szegedi Independent JDK-8263009 jdk/dynalink/TypeConverterFactoryMemoryLeakTest.java failed with "AssertionError: Should have GCd a method handle by now"
180 Christoph Göttschkes Microdoc JDK-8263007 Multiple GC test are missing memory requirements
181 Aleksey Shipilev Red Hat JDK-8262986 Shenandoah: re-organize saving/restoring machine state in assembler code
181 Aleksey Shipilev Red Hat JDK-8262966 GitHub actions should use MSVC 14.28
181 Aleksey Shipilev Red Hat JDK-8262965 jpackage tests fail when Desktop is not supported
181 Aleksey Shipilev Red Hat JDK-8262964 Epsilon: clean up unused includes
181 Aleksey Shipilev Red Hat JDK-8262963 UseCompressedClassPointers depends on UseCompressedOops in vmError.cpp
181 Aleksey Shipilev Red Hat JDK-8262962 Code IfNode::fold_compares_helper more defensively
181 Harold Seigel Oracle JDK-8262956 Regression introduced with JDK-8250984 - memory might be null in some machines
181 Thejasvi Voniadka Oracle JDK-8262954 Several test failures due to javax.net.ssl.SSLException: Connection reset
182 Calvin Cheung Oracle JDK-8262917 Crash caused by lambda proxy class loaded in Shutdown hook
182 Christoph Göttschkes Microdoc JDK-8262879 [TESTBUG] gc/g1/TestGCLogMessages.java fails if ergonomics detect too small InitialHeapSize
182 Evan Whelan Oracle JDK-8262874 AccessDeniedException caused by delayed file deletion on Windows
182 Aleksey Shipilev Red Hat JDK-8262871 Epsilon: improve performance under contention during virtual space expansion
182 Aleksey Shipilev Red Hat JDK-8262870 Zero error reporting is broken after JDK-8255711
182 Aleksey Shipilev Red Hat JDK-8262869 Zero: skip serviceability/sa tests, set vm.hasSA to false
182 Aleksey Shipilev Red Hat JDK-8262868 java/lang/StringBuilder/HugeCapacity.java fails without Compact Strings
182 Aleksey Shipilev Red Hat JDK-8262867 runtime/cds/serviceability/ReplaceCriticalClassesForSubgraphs.java fails without CompactStrings
182 Aleksey Shipilev Red Hat JDK-8262866 Shenandoah: Rename store-val to IU-barrier
182 Aleksey Shipilev Red Hat JDK-8262865 Add Shenandoah test config to compiler/gcbarriers/UnsafeIntrinsicsTest.java
182 Aleksey Shipilev Red Hat JDK-8262836 Shenandoah: Use object size for full GC humongous compaction
182 Aleksey Shipilev Red Hat JDK-8262835 Shenandoah: Disable class-unloading in I-U mode
182 Aleksey Shipilev Red Hat JDK-8262834 Shenandoah: ShenandoahMarkingContext asserts are unnecessary
182 Aleksey Shipilev Red Hat JDK-8262833 Shenandoah: uninitialized label in VerifyThreadGCState
182 Aleksey Shipilev Red Hat JDK-8262832 Shenandoah: Full GC does not need to remark threads and drain SATB buffers
182 Aleksey Shipilev Red Hat JDK-8262830 gc/shenandoah/mxbeans tests fail with -Xcomp
183 Philip Race Oracle JDK-8262805 Upgrade to FreeType 2.10.4
186 Michael McMahon Oracle JDK-8262475 WindowsFileAttributes does not know about Unix domain sockets
187 Joe Darcy Oracle JDK-8262418 Double-rounding possibility in float fma
187 Harold Seigel Oracle JDK-8262388 runtime/jni/checked/TestCheckedReleaseArrayElements.java fails with stderr not empty
187 Harold Seigel Oracle JDK-8262387 Using -Xcheck:jni can lead to a double-free after JDK-8193234
187 Harold Seigel Oracle JDK-8262371 NMT: tuning statistic shows incorrect hash distribution
187 Harold Seigel Oracle JDK-8262370 aarch64: fix typo in verify_oop_array
189 Martin Doerr SAP JDK-8262171 [PPC64] AES intrinsics write beyond the destination array
190 Harold Seigel Oracle JDK-8262159 Restore HandleArea used in Deoptimization::uncommon_trap
190 Harold Seigel Oracle JDK-8262131 Cannot programmatically retrieve Metaspace max set via JAVA_TOOL_OPTIONS
190 Christoph Langer SAP JDK-8262120 Wrong format in SAP copyright header of OsVersionTest
193 Erik Joelsson Oracle JDK-8262062 The version extra fields needs to be overridable in jib-profiles.js
193 Christoph Langer SAP JDK-8262048 Test java/lang/System/OsVersionTest.java still failing on BigSur patch versions after JDK-8253702
193 Christoph Langer SAP JDK-8262047 BigSur version number reported as 10.16, should be 11.nn
193 Christoph Langer SAP JDK-8262026 Fix incorrect result of Math.abs() with char type
195 Kiran Sidhartha Ravikumar Oracle JDK-8261434 isStandalone property: remove dependency on pretty-print
196 Dmitry Markov Oracle JDK-8261794 Windows IME was disabled after DnD operation
197 Aleksey Shipilev Red Hat JDK-8261310 PPC64 Zero build fails with 'VMError::controlled_crash(int)::FunctionDescriptor functionDescriptor' has incomplete type and cannot be defined
197 Thejasvi Voniadka Oracle JDK-8261628 jdk/net/ExtendedSocketOption/AsynchronousSocketChannelNAPITest.java fails intermittently
199 Attila Szegedi Independent JDK-8261691 Dynalink leaks memory when generating type converters
201 Philip Race Oracle JDK-8261611 Upgrade to LittleCMS 2.12
202 Kiran Sidhartha Ravikumar Oracle JDK-8259700 XML declaration is not followed by a newline
204 Kiran Sidhartha Ravikumar Oracle JDK-8261353 (tz) Upgrade time-zone data to tzdata2021a
208 Rajan Halade Oracle JDK-8261180 Add 2 HARICA roots to cacerts truststore
208 Rajan Halade Oracle JDK-8261175 ProblemList two security/krb5 tests on Linux
208 Roland Westrelin Red Hat JDK-8261376 C2: assert(false) failed: unscheduable graph
209 Dong Bo Huawei JDK-8261375 AArch64: Wrong code generated for shifting right and accumulating four unsigned short integers
210 Jesper Wilhelmsson Oracle JDK-8261374 Remove EA from JDK 16 version string starting with Initial RC promotion on Feb 04, 2021(B35)
210 Kim Barrett Oracle JDK-8261373 ParallelGC: oldgen expansion needs release-store for _end
210 Aleksey Shipilev Red Hat JDK-8261372 StringBuilder::insert is incorrect without Compact Strings
210 Tobias Hartmann Oracle JDK-8260905 C2 compilation fails with assert(vtable_index == Method::invalid_vtable_index) failed: correct sentinel value
210 Tobias Hartmann Oracle JDK-8260894 Uninitialized variable after JDK-8257513
210 Magnus Ihse Bursie Oracle JDK-8260951 Final nroff manpage update for JDK 16
210 Tobias Hartmann Oracle JDK-8260890 C2: assert((constant_addr - _masm.code()->consts()->start()) == con.offset())
210 Tobias Hartmann Oracle JDK-8260889 AllocateUninitializedArray C2 intrinsic fails with void.class input
210 Tobias Hartmann Oracle JDK-8260888 Some fields in HaltNode is not cloned
210 Tobias Hartmann Oracle JDK-8260887 Incorrect encoding of AVX-512 kmovq instruction
210 Tobias Hartmann Oracle JDK-8260886 C1: 3-arg StubAssembler::call_RT stack-use condition is incorrect
210 Tobias Hartmann Oracle JDK-8260885 Incorrect predication condition generated by ADLC
210 Tobias Hartmann Oracle JDK-8260884 Misplaced curly brace in Matcher::find_shared_post_visit
210 Tobias Hartmann Oracle JDK-8260883 C2: assert failed ("Bad derived pointer") with -XX:+VerifyRegisterAllocator
210 Tobias Hartmann Oracle JDK-8260882 Fix optimization-unstable code involving signed integer overflow
211 Erik Gahlin Oracle JDK-8260950 JFR: Events dropped when streaming over a chunk rotation
212 Wang Chao Tencent JDK-8260949 [vector] ZGC: VectorReshape test produces incorrect results with ZGC enabled
214 Aleksey Shipilev Red Hat JDK-8260948 Build failures after JDK-8253353
214 Wang Huang @126.com JDK-8260947 JVM crashes when executing PhaseIdealLoop::match_fill_loop
215 Igor Ignatyev Oracle JDK-8260946 add a regression test for 8260370
215 Vladimir Kozlov Oracle JDK-8260945 Crash in C2: guarantee(n != NULL) failed: No Node
215 Per Liden Oracle JDK-8260944 ZGC: Handle incorrect processor id reported by the operating system
216 Vladimir Ivanov Oracle JDK-8260942 C2: LoopLimit node is not eliminated
217 Vicente Arturo Romero Zaldivar Oracle JDK-8260447 Record compact constructor using Objects.requireNonNull
218 Vladimir Ivanov Oracle JDK-8260446 C2: Empty expression stack when reexecuting tableswitch/lookupswitch instructions after deoptimization
218 Harold Seigel Oracle JDK-8260386 InstanceKlass::has_as_permitted_subclass() fails if subclass was redefined
218 Christian Hagedorn Oracle JDK-8260445 C2: assert(_base == Int) failed: Not an Int
218 Claes Redestad Oracle JDK-8260379 UTF8ZipCoder not thread-safe since JDK-8243469
218 Evan Whelan Oracle JDK-8260358 Deadlock between URLStreamHandler.getHostAddress and file.Handler.openconnection
218 Evan Whelan Oracle JDK-8260357 Failed to launch JVM because of NullPointerException occured on System.props
221 Kim Barrett Oracle JDK-8260443 gc/parallel/TestDynShrinkHeap.java still fails "assert(covered_region.contains(new_memregion)) failed: new region is not in covered_region"
222 Jie Fu Tencent JDK-8260442 [Vector API] Incorrect code-gen for VectorReinterpret operation
222 Thomas Schatzl Oracle JDK-8260441 assert(pss->trim_ticks().seconds() == 0.0) failed: Unexpected partial trimming during evacuation
223 Igor Ignatyev Oracle JDK-8260440 add a regression test for 8259353 and 8259601
223 Leo Jiang Oracle JDK-8260152 JDK 16 L10n resource file update - msg drop 10
224 Martin Buchholz Google JDK-8260151 timed CompletableFuture.get may swallow InterruptedException
224 Kiran Sidhartha Ravikumar Oracle JDK-8259988 (tz) Upgrade time-zone data to tzdata2020f
225 Alexander Zuev Oracle JDK-8260150 [TESTBUG] javax/swing/JComponent/7154030/bug7154030.java failed with "Exception: Failed to hide opaque button"
225 Markus Grönlund Oracle JDK-8260149 SIGSEGV in BFSClosure::closure_impl
225 Roland Westrelin Red Hat JDK-8260148 C2: assert(early->dominates(LCA)) failed: early is high enough
228 Jaroslav Bachorík DataDog JDK-8260147 SIGILL in jdk.jfr.internal.PlatformRecorder.rotateDisk()
229 Erik Gahlin Oracle JDK-8260146 JFR: onFlush invoked out of order with a sorted event stream
229 Vladimir Ivanov Oracle JDK-8260145 C2: assert(outer->outcnt() >= phis + 2 && outer->outcnt() <= phis + 2 + stores + 1) failed: only phis
230 Daniel Daugherty Oracle JDK-8260144 ProblemList runtime/cds/appcds/jigsaw/modulepath/ModulePathAndCP_JFR.java on Windows
230 Daniel Daugherty Oracle JDK-8260143 ProblemList java/awt/Focus/AppletInitialFocusTest/AppletInitialFocusTest1.java on Windows
230 Daniel Daugherty Oracle JDK-8260142 ProblemList two jdk/jfr/startupargs tests on Windows
230 Vicente Arturo Romero Zaldivar Oracle JDK-8260141 static/instance overload leads to 'unexpected static method found in unbound lookup' when resolving method reference
230 Erik Österlund Oracle JDK-8260140 Possible deadlock with vtable/itable creation vs concurrent class unloading
230 Jonathan Gibbons Oracle JDK-8260139 typo in generated HELP page prevents localization
230 Nils Eliasson Oracle JDK-8260138 LoadVectorMaskedNode can't be replaced by zero con
230 Aleksey Shipilev Red Hat JDK-8260137 Zero m68k: "static assertion failed: align" after JDK-8252049
230 Kim Barrett Oracle JDK-8260136 Parallel WeakProcessor may use too few threads
230 Roberto Castaneda Lozano Oracle JDK-8260135 C2: assert(found) failed: memory-writing node is not placed in its original loop or an ancestor of it
230 Xiaohong Gong ARM JDK-8260134 AArch64: Fix reinterpretX2D match rule issue
230 Calvin Cheung Oracle JDK-8260133 JRuby crashes while resolving invokedynamic instruction
230 Xiaohong Gong ARM JDK-8260132 VectorReinterpretNode is incorrectly optimized out
231 Maurizio Cimadamore Oracle JDK-8260131 Check for buffer backed by shared segment kicks in in unexpected places
231 Jonathan Gibbons Oracle JDK-8260130 Revert JDK-8245956 JavaCompiler still uses File API instead of Path API in a specific case
231 Maurizio Cimadamore Oracle JDK-8260129 MemorySegment::asByteBuffer does not respect spatial bounds
231 Stuart Marks Oracle JDK-8260128 broken link in Stream::toList spec
231 Patrick Zhang Ampere JDK-8260127 Correct pretouch chunk size to cap with actual page size
231 Pankaj Bansal Oracle JDK-8260126 Demo selection changes with left/right arrow key. No need to press space for selection.
231 ysuenaga Unknown JDK-8259497 "search codecache" clhsdb command does not work
232 Ningsheng Jian ARM JDK-8260125 AArch64: SVE verify_ptrue fails on some tests
232 Jonathan Gibbons Oracle JDK-8260124 Javac error on jdk16 build 18: invalid flag: -Xdoclint:-missing
232 Maurizio Cimadamore Oracle JDK-8260123 ClassCastException when using custom filesystem with wrapper FileChannel impl
232 Aleksey Shipilev Red Hat JDK-8260122 More Zero architectures need linkage with libatomic
235 Erik Joelsson Oracle JDK-8260121 Update reference to README.md
235 Michael McMahon Oracle JDK-8260120 (so) ServerSocketChannel.bind(UnixDomainSocketAddress)/SocketChannel.bind(UnixDomainSocketAddress) will have unknown user and group owner (win)
236 Christoph Langer SAP JDK-8260119 AIX build fails in Harfbuzz with XLC 16.01.0000.0006
236 Rajan Halade Oracle JDK-8260118 console.sh failed Automatically with exit code 1
236 Vicente Arturo Romero Zaldivar Oracle JDK-8260117 unexpected compilation error with generic sealed interface
236 Christian Hagedorn Oracle JDK-8260116 C2 crashes with SIGFPE due to a division that floats above its zero check
236 Erik Joelsson Oracle JDK-8260115 Doc build is broken by use of new language features
236 Erik Gahlin Oracle JDK-8260114 jdk/jfr/javaagent/TestLoadedAgent.java fails with Mismatch in TestEvent count
237 Jonathan Gibbons Oracle JDK-8260113 doclint reports missing javadoc for JavaFX property methods that have a property description
237 Jonathan Gibbons Oracle JDK-8260110 False positive messages about missing comments for serialization
237 Rajan Halade Oracle JDK-8260109 VerifyCACerts.java fails as soneraclass2ca cert will expire in 90 days
237 Naoto Sato Oracle JDK-8260108 Update the copyright notice in the files generated by CLDR Converter tool
237 Rafael Winterhalter Independent JDK-8260107 (ann) getAnnotatedReceiverType should not parameterize owner(s) of statically nested classes
237 Aleksey Shipilev Red Hat JDK-8260105 Revert changes for JDK-8252505 and related issues
237 Maurizio Cimadamore Oracle JDK-8260104 MappedMemorySegmentImpl#makeMappedSegment() ignores Unmapper#pagePosition
237 Prasanta Sadhukhan Oracle JDK-8260103 This test printed a blank page
238 Wang Huang @126.com JDK-8260102 JVM is failed to inline in jdk.internal.vm.vector.VectorSupport::convert
238 Vicente Arturo Romero Zaldivar Oracle JDK-8260101 program fails with LambdaConversionException at execution time
238 Sandhya Viswanathan Intel JDK-8260100 Vector conversion with part > 0 is not getting intrinsic implementation
238 Maurizio Cimadamore Oracle JDK-8260099 NullPointerException in makeMappedSegment due to NULL Unmapper when length of segment is 0
238 Erik Gahlin Oracle JDK-8260098 JFR: RecordingStream leaks memory
238 Roland Westrelin Red Hat JDK-8260097 Shenandoah: "graph should be schedulable" assert failure
238 Jan Lahoda Oracle JDK-8260096 Binding variables don't correctly support declaration annotations and the final modifier
239 Jie Fu Tencent JDK-8260095 Incorrect 512-bit vector registers restore on x86_32
241 Chris Hegarty Independent JDK-8260094 (bf) slice(int, int) on view buffers fails to adjust index according to primitive size
246 Guoxiong Li Independent JDK-8260093 JDK 17ea: Crash compiling instanceof check involving sealed interface
248 Sergey Bylokhov Amazon JDK-8260092 [macos] Taskbar.Feature.ICON_BADGE_NUMBER no longer supported on MacOS
250 Prasanta Sadhukhan Oracle JDK-8260091 [macos11] JTabbedPane selected tab text is barely legible
250 Jonathan Gibbons Oracle JDK-8260090 Test specify the Classpath exception in the header
250 Sean Coffey Oracle JDK-8258938 TLS connection always receives close_notify exception
250 Robert Mckenna Oracle JDK-8258909 update jdk16u jcheck conf
250 Jonathan Gibbons Oracle JDK-8260089 javac/doclint reports broken HTML on multiline mailto links
251 Vicente Arturo Romero Zaldivar Oracle JDK-8260088 javac crash when compiling code with enhanced switch expressions with option -Xjcov
251 Daniel Daugherty Oracle JDK-8260087 runtime/whitebox/TestWBDeflateIdleMonitors.java fails with Monitor should be deflated.: expected true to equal false
251 Daniel Daugherty Oracle JDK-8260084 runtime/logging/MonitorInflationTest.java crashed in MonitorList::unlink_deflated
252 Daniel Daugherty Oracle JDK-8260082 ProblemList com/sun/jdi/AfterThreadDeathTest.java on Linux-X64
252 Daniel Daugherty Oracle JDK-8260079 ProblemList Naming/DefaultRegistryPort.java and Naming/legalRegistryNames/LegalRegistryNames.java on Windows
252 Daniel Daugherty Oracle JDK-8260077 ProblemList TestJstatdDefaults.java, TestJstatdRmiPort.java, and TestJstatdServer.java
252 Vladimir Ivanov Oracle JDK-8260074 C2: Crash on empty macro node list
253 Jonathan Gibbons Oracle JDK-8260072 doclint should be service-loaded with system class loader
253 Roberto Castaneda Lozano Oracle JDK-8260069 C2: OSR miscompilation caused by invalid memory instruction placement
253 Roman Kennke Red Hat JDK-8260067 Shenandoah: Process references before evacuation during degen
256 Brent Christian Oracle JDK-8260064 Add instrumentation to NativeLibraryTest
256 Jonathan Gibbons Oracle JDK-8260060 Update "type" terminology in generated docs
256 Hannes Wallnoefer Oracle JDK-8260058 --override-methods=summary ignores some signature changes
256 Jie Fu Tencent JDK-8260056 Build broken on Windows after fix for JDK-8258134

No changesets log

JDK-8264312 CDS: java/lang/ModuleLayer.EMPTY_LAYER should be singleton
JDK-8262782 testlibrary_tests/ctw/JarDirTest.java fails with InvalidPathException on windows
JDK-8261191 Release Note: Added 2 HARICA Root CA Certificates
JDK-8260258 Release Note: JDK Time-Zone Data Upgraded to tzdata2020f
JDK-8260251 Release Note: JDK Time-Zone Data Upgraded to tzdata2020e
JDK-8260181 getAnnotatedReceiverType parameterizes types too eagerly
JDK-8260180 [PPC64] runtime/logging/RedefineClasses.java fails with assert: registers not saved on stack
JDK-8260179 assert(size == calc_size) failed: incorrect size calculation on x86_32 with AVX512 machines
JDK-8260178 Regression 21% in DaCapo-lusearch-large after JDK-8236926
JDK-8260177 Update the text handling in the JPasswordField
JDK-8260176 Unicode linebreak matching behavior is incorrect; backout JDK-8235812
JDK-8260175 TestCharVect2 is very slow
JDK-8260174 Add expiry exception for QuoVadis root certificate
JDK-8260173 Add LuxTrust certificate that is expiring in March 2021 to list of allowed but expired certs
JDK-8260172 Localize javadoc search
JDK-8260171 javac should issue an error if an annotation is nested in a local class or interface
JDK-8260170 compiler/c2/cr6340864/TestIntVect.java runs faster in interpreter
JDK-8260083 Update javadoc search spec to reflect relaxed case sensitivity
JDK-8260080 Patterns: Remove unnecessary JLS subsection
JDK-8260073 Disable MemAccess until JDK-8259276 is fixed

Committer push log

Andrew Hughes, Red Hat

Bug Summary
JDK-8263047 x86 32-bit build fails when -fcf-protection is passed in the compiler flags

Attila Szegedi, Independent

Bug Summary
JDK-8261691 Dynalink leaks memory when generating type converters
JDK-8263009 jdk/dynalink/TypeConverterFactoryMemoryLeakTest.java failed with "AssertionError: Should have GCd a method handle by now"

Brent Christian, Oracle

Bug Summary
JDK-8260064 Add instrumentation to NativeLibraryTest

Wang Chao, Tencent

Bug Summary
JDK-8260949 [vector] ZGC: VectorReshape test produces incorrect results with ZGC enabled

Calvin Cheung, Oracle

Bug Summary
JDK-8262917 Crash caused by lambda proxy class loaded in Shutdown hook
JDK-8260133 JRuby crashes while resolving invokedynamic instruction

Christoph Göttschkes, Microdoc

Bug Summary
JDK-8262879 [TESTBUG] gc/g1/TestGCLogMessages.java fails if ergonomics detect too small InitialHeapSize
JDK-8263007 Multiple GC test are missing memory requirements

Christian Hagedorn, Oracle

Bug Summary
JDK-8260116 C2 crashes with SIGFPE due to a division that floats above its zero check
JDK-8260445 C2: assert(_base == Int) failed: Not an Int

Chris Hegarty, Independent

Bug Summary
JDK-8260094 (bf) slice(int, int) on view buffers fails to adjust index according to primitive size

Christoph Langer, SAP

Bug Summary
JDK-8260119 AIX build fails in Harfbuzz with XLC 16.01.0000.0006
JDK-8262047 BigSur version number reported as 10.16, should be 11.nn
JDK-8262026 Fix incorrect result of Math.abs() with char type
JDK-8262048 Test java/lang/System/OsVersionTest.java still failing on BigSur patch versions after JDK-8253702
JDK-8262120 Wrong format in SAP copyright header of OsVersionTest

Sean Coffey, Oracle

Bug Summary
JDK-8258938 TLS connection always receives close_notify exception

Joe Darcy, Oracle

Bug Summary
JDK-8262418 Double-rounding possibility in float fma

Daniel Daugherty, Oracle

Bug Summary
JDK-8260082 ProblemList com/sun/jdi/AfterThreadDeathTest.java on Linux-X64
JDK-8260143 ProblemList java/awt/Focus/AppletInitialFocusTest/AppletInitialFocusTest1.java on Windows
JDK-8260079 ProblemList Naming/DefaultRegistryPort.java and Naming/legalRegistryNames/LegalRegistryNames.java on Windows
JDK-8260144 ProblemList runtime/cds/appcds/jigsaw/modulepath/ModulePathAndCP_JFR.java on Windows
JDK-8260077 ProblemList TestJstatdDefaults.java, TestJstatdRmiPort.java, and TestJstatdServer.java
JDK-8260142 ProblemList two jdk/jfr/startupargs tests on Windows
JDK-8260084 runtime/logging/MonitorInflationTest.java crashed in MonitorList::unlink_deflated
JDK-8260087 runtime/whitebox/TestWBDeflateIdleMonitors.java fails with Monitor should be deflated.: expected true to equal false

Dmitry Markov, Oracle

Bug Summary
JDK-8261794 Windows IME was disabled after DnD operation

Dong Bo, Huawei

Bug Summary
JDK-8261375 AArch64: Wrong code generated for shifting right and accumulating four unsigned short integers

Erik Gahlin, Oracle

Bug Summary
JDK-8260114 jdk/jfr/javaagent/TestLoadedAgent.java fails with Mismatch in TestEvent count
JDK-8260950 JFR: Events dropped when streaming over a chunk rotation
JDK-8260146 JFR: onFlush invoked out of order with a sorted event stream
JDK-8260098 JFR: RecordingStream leaks memory

Erik Österlund, Oracle

Bug Summary
JDK-8260140 Possible deadlock with vtable/itable creation vs concurrent class unloading

Erik Joelsson, Oracle

Bug Summary
JDK-8260115 Doc build is broken by use of new language features
JDK-8262062 The version extra fields needs to be overridable in jib-profiles.js
JDK-8260121 Update reference to README.md

Evan Whelan, Oracle

Bug Summary
JDK-8262874 AccessDeniedException caused by delayed file deletion on Windows
JDK-8260358 Deadlock between URLStreamHandler.getHostAddress and file.Handler.openconnection
JDK-8260357 Failed to launch JVM because of NullPointerException occured on System.props

Hannes Wallnoefer, Oracle

Bug Summary
JDK-8260058 --override-methods=summary ignores some signature changes

Harold Seigel, Oracle

Bug Summary
JDK-8262370 aarch64: fix typo in verify_oop_array
JDK-8262131 Cannot programmatically retrieve Metaspace max set via JAVA_TOOL_OPTIONS
JDK-8260386 InstanceKlass::has_as_permitted_subclass() fails if subclass was redefined
JDK-8262371 NMT: tuning statistic shows incorrect hash distribution
JDK-8262956 Regression introduced with JDK-8250984 - memory might be null in some machines
JDK-8262159 Restore HandleArea used in Deoptimization::uncommon_trap
JDK-8262388 runtime/jni/checked/TestCheckedReleaseArrayElements.java fails with stderr not empty
JDK-8263197 try catch Method failing to work when dividing an integer by 0
JDK-8262387 Using -Xcheck:jni can lead to a double-free after JDK-8193234

Magnus Ihse Bursie, Oracle

Bug Summary
JDK-8260951 Final nroff manpage update for JDK 16

Igor Ignatyev, Oracle

Bug Summary
JDK-8260440 add a regression test for 8259353 and 8259601
JDK-8260946 add a regression test for 8260370

Jaroslav Bachorík, DataDog

Bug Summary
JDK-8260147 SIGILL in jdk.jfr.internal.PlatformRecorder.rotateDisk()

Jie Fu, Tencent

Bug Summary
JDK-8260442 [Vector API] Incorrect code-gen for VectorReinterpret operation
JDK-8260056 Build broken on Windows after fix for JDK-8258134
JDK-8260095 Incorrect 512-bit vector registers restore on x86_32

Jonathan Gibbons, Oracle

Bug Summary
JDK-8260113 doclint reports missing javadoc for JavaFX property methods that have a property description
JDK-8260072 doclint should be service-loaded with system class loader
JDK-8260110 False positive messages about missing comments for serialization
JDK-8260124 Javac error on jdk16 build 18: invalid flag: -Xdoclint:-missing
JDK-8260089 javac/doclint reports broken HTML on multiline mailto links
JDK-8260130 Revert JDK-8245956 JavaCompiler still uses File API instead of Path API in a specific case
JDK-8260090 Test specify the Classpath exception in the header
JDK-8260139 typo in generated HELP page prevents localization
JDK-8260060 Update "type" terminology in generated docs

Jan Lahoda, Oracle

Bug Summary
JDK-8260096 Binding variables don't correctly support declaration annotations and the final modifier

Jesper Wilhelmsson, Oracle

Bug Summary
JDK-8261374 Remove EA from JDK 16 version string starting with Initial RC promotion on Feb 04, 2021(B35)

Kim Barrett, Oracle

Bug Summary
JDK-8260443 gc/parallel/TestDynShrinkHeap.java still fails "assert(covered_region.contains(new_memregion)) failed: new region is not in covered_region"
JDK-8260136 Parallel WeakProcessor may use too few threads
JDK-8261373 ParallelGC: oldgen expansion needs release-store for _end

Alexander Zuev, Oracle

Bug Summary
JDK-8260150 [TESTBUG] javax/swing/JComponent/7154030/bug7154030.java failed with "Exception: Failed to hide opaque button"

Kiran Sidhartha Ravikumar, Oracle

Bug Summary
JDK-8259988 (tz) Upgrade time-zone data to tzdata2020f
JDK-8261353 (tz) Upgrade time-zone data to tzdata2021a
JDK-8261434 isStandalone property: remove dependency on pretty-print
JDK-8259700 XML declaration is not followed by a newline

Vladimir Kozlov, Oracle

Bug Summary
JDK-8260945 Crash in C2: guarantee(n != NULL) failed: No Node

Guoxiong Li, Independent

Bug Summary
JDK-8260093 JDK 17ea: Crash compiling instanceof check involving sealed interface

Leo Jiang, Oracle

Bug Summary
JDK-8260152 JDK 16 L10n resource file update - msg drop 10

Martin Buchholz, Google

Bug Summary
JDK-8260151 timed CompletableFuture.get may swallow InterruptedException

Maurizio Cimadamore, Oracle

Bug Summary
JDK-8260131 Check for buffer backed by shared segment kicks in in unexpected places
JDK-8260123 ClassCastException when using custom filesystem with wrapper FileChannel impl
JDK-8260104 MappedMemorySegmentImpl#makeMappedSegment() ignores Unmapper#pagePosition
JDK-8260129 MemorySegment::asByteBuffer does not respect spatial bounds
JDK-8260099 NullPointerException in makeMappedSegment due to NULL Unmapper when length of segment is 0

Martin Doerr, SAP

Bug Summary
JDK-8262171 [PPC64] AES intrinsics write beyond the destination array

Markus Grönlund, Oracle

Bug Summary
JDK-8260149 SIGSEGV in BFSClosure::closure_impl

Michael McMahon, Oracle

Bug Summary
JDK-8260120 (so) ServerSocketChannel.bind(UnixDomainSocketAddress)/SocketChannel.bind(UnixDomainSocketAddress) will have unknown user and group owner (win)
JDK-8262475 WindowsFileAttributes does not know about Unix domain sockets

Naoto Sato, Oracle

Bug Summary
JDK-8260108 Update the copyright notice in the files generated by CLDR Converter tool

Nils Eliasson, Oracle

Bug Summary
JDK-8260138 LoadVectorMaskedNode can't be replaced by zero con

Ningsheng Jian, ARM

Bug Summary
JDK-8260125 AArch64: SVE verify_ptrue fails on some tests

Pankaj Bansal, Oracle

Bug Summary
JDK-8260126 Demo selection changes with left/right arrow key. No need to press space for selection.

Per Liden, Oracle

Bug Summary
JDK-8260944 ZGC: Handle incorrect processor id reported by the operating system

Philip Race, Oracle

Bug Summary
JDK-8262805 Upgrade to FreeType 2.10.4
JDK-8261611 Upgrade to LittleCMS 2.12

Prasanta Sadhukhan, Oracle

Bug Summary
JDK-8260091 [macos11] JTabbedPane selected tab text is barely legible
JDK-8260103 This test printed a blank page

Patrick Zhang, Ampere

Bug Summary
JDK-8260127 Correct pretouch chunk size to cap with actual page size

Roberto Castaneda Lozano, Oracle

Bug Summary
JDK-8260135 C2: assert(found) failed: memory-writing node is not placed in its original loop or an ancestor of it
JDK-8260069 C2: OSR miscompilation caused by invalid memory instruction placement

Claes Redestad, Oracle

Bug Summary
JDK-8260379 UTF8ZipCoder not thread-safe since JDK-8243469

Rajan Halade, Oracle

Bug Summary
JDK-8261180 Add 2 HARICA roots to cacerts truststore
JDK-8260118 console.sh failed Automatically with exit code 1
JDK-8261175 ProblemList two security/krb5 tests on Linux
JDK-8260109 VerifyCACerts.java fails as soneraclass2ca cert will expire in 90 days

Roman Kennke, Red Hat

Bug Summary
JDK-8260067 Shenandoah: Process references before evacuation during degen

Robert Mckenna, Oracle

Bug Summary
JDK-8258909 update jdk16u jcheck conf

Roland Westrelin, Red Hat

Bug Summary
JDK-8260148 C2: assert(early->dominates(LCA)) failed: early is high enough
JDK-8261376 C2: assert(false) failed: unscheduable graph
JDK-8260097 Shenandoah: "graph should be schedulable" assert failure

Sergey Bylokhov, Amazon

Bug Summary
JDK-8260092 [macos] Taskbar.Feature.ICON_BADGE_NUMBER no longer supported on MacOS

Aleksey Shipilev, Red Hat

Bug Summary
JDK-8262865 Add Shenandoah test config to compiler/gcbarriers/UnsafeIntrinsicsTest.java
JDK-8260948 Build failures after JDK-8253353
JDK-8262962 Code IfNode::fold_compares_helper more defensively
JDK-8262964 Epsilon: clean up unused includes
JDK-8262871 Epsilon: improve performance under contention during virtual space expansion
JDK-8262830 gc/shenandoah/mxbeans tests fail with -Xcomp
JDK-8262966 GitHub actions should use MSVC 14.28
JDK-8262868 java/lang/StringBuilder/HugeCapacity.java fails without Compact Strings
JDK-8262965 jpackage tests fail when Desktop is not supported
JDK-8260122 More Zero architectures need linkage with libatomic
JDK-8261310 PPC64 Zero build fails with 'VMError::controlled_crash(int)::FunctionDescriptor functionDescriptor' has incomplete type and cannot be defined
JDK-8260105 Revert changes for JDK-8252505 and related issues
JDK-8262867 runtime/cds/serviceability/ReplaceCriticalClassesForSubgraphs.java fails without CompactStrings
JDK-8262835 Shenandoah: Disable class-unloading in I-U mode
JDK-8262832 Shenandoah: Full GC does not need to remark threads and drain SATB buffers
JDK-8262986 Shenandoah: re-organize saving/restoring machine state in assembler code
JDK-8262866 Shenandoah: Rename store-val to IU-barrier
JDK-8262834 Shenandoah: ShenandoahMarkingContext asserts are unnecessary
JDK-8262833 Shenandoah: uninitialized label in VerifyThreadGCState
JDK-8262836 Shenandoah: Use object size for full GC humongous compaction
JDK-8261372 StringBuilder::insert is incorrect without Compact Strings
JDK-8262963 UseCompressedClassPointers depends on UseCompressedOops in vmError.cpp
JDK-8262870 Zero error reporting is broken after JDK-8255711
JDK-8260137 Zero m68k: "static assertion failed: align" after JDK-8252049
JDK-8262869 Zero: skip serviceability/sa tests, set vm.hasSA to false

Stuart Marks, Oracle

Bug Summary
JDK-8260128 broken link in Stream::toList spec

Sandhya Viswanathan, Intel

Bug Summary
JDK-8260100 Vector conversion with part > 0 is not getting intrinsic implementation

Tobias Hartmann, Oracle

Bug Summary
JDK-8260889 AllocateUninitializedArray C2 intrinsic fails with void.class input
JDK-8260886 C1: 3-arg StubAssembler::call_RT stack-use condition is incorrect
JDK-8260905 C2 compilation fails with assert(vtable_index == Method::invalid_vtable_index) failed: correct sentinel value
JDK-8260883 C2: assert failed ("Bad derived pointer") with -XX:+VerifyRegisterAllocator
JDK-8260890 C2: assert((constant_addr - _masm.code()->consts()->start()) == con.offset())
JDK-8260882 Fix optimization-unstable code involving signed integer overflow
JDK-8260887 Incorrect encoding of AVX-512 kmovq instruction
JDK-8260885 Incorrect predication condition generated by ADLC
JDK-8260884 Misplaced curly brace in Matcher::find_shared_post_visit
JDK-8260888 Some fields in HaltNode is not cloned
JDK-8260894 Uninitialized variable after JDK-8257513

Thomas Schatzl, Oracle

Bug Summary
JDK-8260441 assert(pss->trim_ticks().seconds() == 0.0) failed: Unexpected partial trimming during evacuation

Thejasvi Voniadka, Oracle

Bug Summary
JDK-8261628 jdk/net/ExtendedSocketOption/AsynchronousSocketChannelNAPITest.java fails intermittently
JDK-8262954 Several test failures due to javax.net.ssl.SSLException: Connection reset

Vladimir Ivanov, Oracle

Bug Summary
JDK-8260145 C2: assert(outer->outcnt() >= phis + 2 && outer->outcnt() <= phis + 2 + stores + 1) failed: only phis
JDK-8260074 C2: Crash on empty macro node list
JDK-8260446 C2: Empty expression stack when reexecuting tableswitch/lookupswitch instructions after deoptimization
JDK-8260942 C2: LoopLimit node is not eliminated

Vicente Arturo Romero Zaldivar, Oracle

Bug Summary
JDK-8260088 javac crash when compiling code with enhanced switch expressions with option -Xjcov
JDK-8260101 program fails with LambdaConversionException at execution time
JDK-8260447 Record compact constructor using Objects.requireNonNull
JDK-8260141 static/instance overload leads to 'unexpected static method found in unbound lookup' when resolving method reference
JDK-8260117 unexpected compilation error with generic sealed interface

Wang Huang, @126.com

Bug Summary
JDK-8260947 JVM crashes when executing PhaseIdealLoop::match_fill_loop
JDK-8260102 JVM is failed to inline in jdk.internal.vm.vector.VectorSupport::convert

Rafael Winterhalter, Independent

Bug Summary
JDK-8260107 (ann) getAnnotatedReceiverType should not parameterize owner(s) of statically nested classes

Xiaohong Gong, ARM

Bug Summary
JDK-8260134 AArch64: Fix reinterpretX2D match rule issue
JDK-8260132 VectorReinterpretNode is incorrectly optimized out

ysuenaga, Unknown

Bug Summary
JDK-8259497 "search codecache" clhsdb command does not work