PUSHES REPORT: 17.0.1

This report shows who pushed the backports to the given release. This usually shows who did the backporting, testing, and review work.

Report generated: Fri Sep 24 01:49:59 CEST 2021

Distribution by priority

Count Priority
2 P1
37 P2
123 P3
46 P4
1 P5

Distribution by components

Count Component
209 100% Total
108 51.7% hotspot
51 24.4% hotspot/compiler
24 11.5% hotspot/runtime
9 4.3% hotspot/jfr
9 4.3% hotspot/gc
6 2.9% hotspot/svc-agent
5 2.4% hotspot/svc
3 1.4% hotspot/jvmti
1 0.5% hotspot/other
42 20.1% tools
24 11.5% tools/javac
9 4.3% tools/javadoc(tool)
5 2.4% tools/jpackage
2 1.0% tools/jextract
1 0.5% tools/jshell
1 0.5% tools
28 13.4% core-libs
8 3.8% core-libs/java.lang
5 2.4% core-libs/java.net
3 1.4% core-libs/java.lang.invoke
2 1.0% core-libs/java.util
2 1.0% core-libs
2 1.0% core-libs/java.lang:reflect
1 0.5% core-libs/java.util.concurrent
1 0.5% core-libs/java.io:serialization
1 0.5% core-libs/java.io
1 0.5% core-libs/java.text
1 0.5% core-libs/java.util:i18n
1 0.5% core-libs/java.nio
12 5.7% security-libs
6 2.9% security-libs/java.security
2 1.0% security-libs/javax.net.ssl
2 1.0% security-libs/javax.crypto:pkcs11
1 0.5% security-libs/javax.crypto
1 0.5% security-libs
9 4.3% client-libs
4 1.9% client-libs/java.awt
2 1.0% client-libs/2d
1 0.5% client-libs
1 0.5% client-libs/javax.swing
1 0.5% client-libs/javax.accessibility
5 2.4% infrastructure
4 1.9% infrastructure/build
1 0.5% infrastructure
3 1.4% core-svc
2 1.0% core-svc/tools
1 0.5% core-svc/java.lang.management
2 1.0% xml
1 0.5% xml/jaxp
1 0.5% xml/javax.xml.transform

Distribution by affiliation

Count Committer
209 100% Total
149 71.3% Oracle
20 9.6% Jan Lahoda
12 5.7% Igor Ignatyev
10 4.8% Daniel Daugherty
8 3.8% Jonathan Gibbons
5 2.4% Vladimir Kozlov
5 2.4% Mandy Chung
4 1.9% Markus Grönlund
4 1.9% Kim Barrett
4 1.9% Nils Eliasson
3 1.4% Weijun Wang
3 1.4% Jim Laskey
3 1.4% Erik Joelsson
3 1.4% Paul Sandoz
3 1.4% Erik Gahlin
3 1.4% Hannes Wallnoefer
3 1.4% Chris Plummer
3 1.4% Vicente Arturo Romero Zaldivar
3 1.4% Christian Hagedorn
3 1.4% Vladimir Ivanov
2 1.0% Brian Burkhalter
2 1.0% Joe Wang
2 1.0% Maurizio Cimadamore
2 1.0% Roger Riggs
2 1.0% Daniel Fuchs
2 1.0% Jorn Vernee
2 1.0% Dean Long
2 1.0% Alexey Semenyuk
2 1.0% Rajan Halade
2 1.0% Naoto Sato
2 1.0% Philip Race
1 0.5% Sibabrata Sahoo
1 0.5% Mark Sheppard
1 0.5% Sean Mullan
1 0.5% Patrick Concannon
1 0.5% Sean Coffey
1 0.5% Jamsheed C M
1 0.5% Jayathirth D V
1 0.5% Leo Korinth
1 0.5% Valerie Peng
1 0.5% Tobias Hartmann
1 0.5% Erik Österlund
1 0.5% Julia Boes
1 0.5% Alex Menkov
1 0.5% Thomas Schatzl
1 0.5% Alexander Zuev
1 0.5% David Holmes
1 0.5% Fernando Guallini
1 0.5% Mikhailo Seledtsov
1 0.5% Ioi Lam
1 0.5% Per Liden
1 0.5% Andy Herrick
1 0.5% Bradford Wetmore
1 0.5% Mikael Vidstedt
1 0.5% Serguei Spitsyn
1 0.5% Alexander Matveev
15 7.2% Red Hat
8 3.8% Roland Westrelin
3 1.4% Aleksey Shipilev
2 1.0% Zhengyu Gu
2 1.0% Severin Gehwolf
9 4.3% Intel
6 2.9% Jatin Bhateja
3 1.4% Sandhya Viswanathan
9 4.3% SAP
7 3.3% Christoph Langer
2 1.0% Martin Doerr
6 2.9% Tencent
5 2.4% Jie Fu
1 0.5% Hui Shi
5 2.4% Amazon
4 1.9% Xin Liu
1 0.5% William Kemper
4 1.9% Independent
3 1.4% Guoxiong Li
1 0.5% Wang Huang
3 1.4% ARM
2 1.0% Eric Liu
1 0.5% Xiaohong Gong
2 1.0% Azul
1 0.5% Alexey Bakhtin
1 0.5% Anton Kozlov
2 1.0% Microdoc
2 1.0% Christoph Göttschkes
2 1.0% NTT DATA
2 1.0% Yasumasa Suenaga
1 0.5% Alibaba
1 0.5% Yi Yang
1 0.5% BellSoft
1 0.5% Boris Ulasevich
1 0.5% Google
1 0.5% Liam Miller-Cushon

Chronological push log:

Days Ago Committer Affiliation Bug Summary
62 Christoph Langer SAP JDK-8271213 Add option to jcmd GC.heap_dump to use existing file
62 Christoph Langer SAP JDK-8271204 stack-use-after-scope in NewObjectA
66 Christoph Langer SAP JDK-8270899 Remove unused buffer int
66 Christoph Langer SAP JDK-8270895 [macOS] Exception from "Printable.print" is swallowed during "PrinterJob.print"
66 Roland Westrelin Red Hat JDK-8270922 C2: assert(false) failed: Bad graph detected in build_loop_late
69 Philip Race Oracle JDK-8270921 Problem List java/awt/Window/MultiWindowApp/MultiWindowAppTest.java on Linux
69 Christoph Langer SAP JDK-8270920 Exclude security/infra/java/security/cert/CertPathValidator/certification/LetsEncryptCA
70 William Kemper Amazon JDK-8270919 Corrupt oop in ClassLoaderData
70 Sibabrata Sahoo Oracle JDK-8270767 Additional tests for MessageDigest with different providers
71 Erik Joelsson Oracle JDK-8270766 Test build/AbsPathsInImage.java fails after JDK-8259848
71 Jim Laskey Oracle JDK-8270765 (JEP-356) - RandomGenerator spec implementation requirements tightly coupled to JDK internal classes
71 Jim Laskey Oracle JDK-8270764 SplittableRandom extends AbstractSplittableGenerator
71 Anton Kozlov Azul JDK-8270763 [macosx-aarch64] Crash with SIGBUS in MarkActivationClosure::do_code_blob during vmTestbase/nsk/jvmti/.../bi04t002 test run
71 Hannes Wallnoefer Oracle JDK-8270762 Handling type arguments from outer classes for inner class in javadoc
71 Christoph Langer SAP JDK-8270761 InfiniteLoopException test may fail on x86 platforms
72 Xin Liu Amazon JDK-8270760 Async UL needs to handle ERANGE on exceeding SEM_VALUE_MAX
72 Yi Yang Alibaba JDK-8270759 Generated lambda class can not access protected static method of target class
72 Vicente Arturo Romero Zaldivar Oracle JDK-8270758 DynamicCallSiteDesc::withArgs doesn't throw NPE
72 Severin Gehwolf Red Hat JDK-8270757 [TESTBUG] Add coverage for jvmci ResolvedJavaType.toJavaName() for lambdas
72 Maurizio Cimadamore Oracle JDK-8270756 java/foreign/Test{Down,Up}call.java time out
72 Markus Grönlund Oracle JDK-8270755 Stress test SEGV while emitting OldObjectSample
72 Markus Grönlund Oracle JDK-8270754 Deadlock during Volano with JFR
72 Erik Joelsson Oracle JDK-8270753 Interim javadoc build does not support platform links
72 Christian Hagedorn Oracle JDK-8270752 C2: Out of bounds array load floats above its range check in loop peeling resulting in SEGV
72 Erik Joelsson Oracle JDK-8270751 Missing build dependency between jdk.jfr-gendata and buildtools-hotspot
73 Sean Mullan Oracle JDK-8270750 (fs) Custom DefaultFileSystemProvider security related loops
73 Christoph Göttschkes Microdoc JDK-8270749 serviceability/sa/Clhsdb tests are using a C2 specific VMStruct field
73 Alexey Bakhtin Azul JDK-8270748 TCP Connection Reset when connecting simple socket to SSL server
74 Serguei Spitsyn Oracle JDK-8270747 fix of JDK-8252657 missed to update history at the end of JVM TI spec
75 Philip Race Oracle JDK-8270746 [macOS] Update named used for Java run loop mode
76 Roger Riggs Oracle JDK-8270745 Cleanup Override in Context-Specific Deserialization Filters
76 Christian Hagedorn Oracle JDK-8270744 C2: Node is wrongly marked as reduction resulting in a wrong execution due to wrong vector instructions
76 Jan Lahoda Oracle JDK-8270743 IncompatibleClassChangeError on empty pattern switch statement case
76 Jan Lahoda Oracle JDK-8270742 Switch statement with a pattern, constant and default label elements crash javac
76 Jan Lahoda Oracle JDK-8270741 Missing unreported constraints on pattern and other case label combination
76 Jatin Bhateja Intel JDK-8270740 compiler/vectorapi/VectorCastShape*Test.java tests failed on avx2 machines
76 Mikhailo Seledtsov Oracle JDK-8270739 Update Platform.isDefaultCDSArchiveSupported() to return true for aarch64 platforms
77 Jonathan Gibbons Oracle JDK-8270738 NPE in HtmlDocletWriter
77 Daniel Daugherty Oracle JDK-8270737 ProblemList 4 SA tests on macOS-aarch64
77 Brian Burkhalter Oracle JDK-8270736 ByteArrayInputStream#read with a byte array of length 0 not consistent with InputStream when at EOF
77 Guoxiong Li Independent JDK-8270735 AssertionError when combining pattern matching and function closure
77 Jatin Bhateja Intel JDK-8270734 corrections in some instruction patterns for KNL x86 platform
77 Jan Lahoda Oracle JDK-8270733 Desugaring of pattern matching enum switch should be improved
77 Jan Lahoda Oracle JDK-8270732 Switches with 'case null:' should be exhaustive
77 Roland Westrelin Red Hat JDK-8270731 C2: assert(!in->is_CFG()) failed: CFG Node with no controlling input?
78 Roger Riggs Oracle JDK-8270730 (test) Add diagnostic info to ProceessBuilder/Basic.java for unexpected output
78 Alexey Semenyuk Oracle JDK-8270729 Directories in /opt/runtimepackagetest and /path/to/jdk-17 are different
78 Martin Doerr SAP JDK-8270728 [PPC64] C2: Math.rint intrinsic uses wrong rounding mode
78 Jan Lahoda Oracle JDK-8270727 (jdeprscan) tools/jdeprscan/tests/jdk/jdeprscan/TestRelease.java failed with "error: cannot access jdk.internal.ValueBased"
78 Jan Lahoda Oracle JDK-8270726 class file for sun.misc.Contended not found
78 Daniel Fuchs Oracle JDK-8270725 [macos-aarch64] test compilation failed with "SocketException: No buffer space available"
78 Jan Lahoda Oracle JDK-8270724 jshell throws exception while parsing illegal "case true"
78 Jan Lahoda Oracle JDK-8270723 javac generates class with invalid stack map
78 Jan Lahoda Oracle JDK-8270722 javac fails to compile nested pattern matching switches
78 Chris Plummer Oracle JDK-8270721 SA's vm object vtable matching code sometimes matches on incorrect type
79 Ioi Lam Oracle JDK-8270720 CDS check_excluded_classes needs DumpTimeTable_lock
79 Vladimir Kozlov Oracle JDK-8270719 [TESTBUG] Missing testing for x86 KNL platforms
79 Vladimir Kozlov Oracle JDK-8270718 ProblemList compiler/vectorapi/VectorCastShape[64|128]Test.java tests on x86
79 Eric Liu ARM JDK-8270717 AArch64: 'bad AD file' in some vector conversion tests
79 Mandy Chung Oracle JDK-8270716 Clarify the behavior of System::gc w.r.t. reference processing
79 Xiaohong Gong ARM JDK-8270715 JVM crashes when running VectorMask query tests
79 Kim Barrett Oracle JDK-8270714 Optimize gc-locker in [Get|Release]StringCritical for latin string
79 Kim Barrett Oracle JDK-8270713 JNI_GetStringCritical does not lock char array
79 Roland Westrelin Red Hat JDK-8270712 C2: assert(false) failed: graph should be schedulable after JDK-8252372
79 Roland Westrelin Red Hat JDK-8270711 C2: assert(false) failed: unscheduable graph
79 Tobias Hartmann Oracle JDK-8270710 SIGSEGV in PhaseCFG::implicit_null_check due to missing null check
80 Erik Gahlin Oracle JDK-8270709 jdk/jfr/jcmd/TestJcmdDump.java with slowdebug bits fails with AttachNotSupportedException
80 Severin Gehwolf Red Hat JDK-8270708 [aarch64] java.library.path not including /usr/lib64
83 Alexander Zuev Oracle JDK-8270707 Password is being converted to String in AccessibleJPasswordField
83 Mikael Vidstedt Oracle JDK-8270706 JFR Terminology Refresh
83 Sandhya Viswanathan Intel JDK-8270705 compiler/codegen/ClearArrayTest.java failed with "assert(false) failed: bad AD file"
83 Weijun Wang Oracle JDK-8270704 The warning for System::setSecurityManager should only appear once for each caller
83 Christian Hagedorn Oracle JDK-8270703 C2: assert(n != __null) failed: Bad immediate dominator info.
83 Nils Eliasson Oracle JDK-8270702 assert(tmp == _callprojs.fallthrough_catchproj) failed: allocation control projection
83 Jamsheed C M Oracle JDK-8270701 C2 compilation fails with assert "missing precedence edge"
84 Vladimir Kozlov Oracle JDK-8270700 [JVMCI] restore original qualified exports to Graal
84 Maurizio Cimadamore Oracle JDK-8270699 java/foreign/TestResourceScope.java timed out
84 Kim Barrett Oracle JDK-8270698 vmTestbase/gc/gctests/PhantomReference/phantom002/TestDescription.java timed out
84 Jatin Bhateja Intel JDK-8270697 assert(is_valid()) failed: invalid register (-1)
84 Naoto Sato Oracle JDK-8270696 Typo in j.t.Normalizer.normalize()
84 Jan Lahoda Oracle JDK-8270695 javac crashes when processing parenthesized pattern in instanceof
84 Aleksey Shipilev Red Hat JDK-8270694 Crash/miscompile in CallGenerator::for_method_handle_inline after JDK-8191998
84 Roland Westrelin Red Hat JDK-8270693 C2 fails with assert(!n->is_Store() && !n->is_LoadStore()) failed: no node with a side effect
84 Roland Westrelin Red Hat JDK-8270692 C2: main loop in micro benchmark never executed
84 Hannes Wallnoefer Oracle JDK-8270691 javadoc generates broken links with {@inheritDoc}
84 Jayathirth D V Oracle JDK-8270690 [macos] [lanai] java/awt/PrintJob/Text/stringwidth.sh doesn't exit on cancelling print dialog
85 Liam Miller-Cushon Google JDK-8270689 JDK-8262891 causes an NPE in Lint.augment
85 Mandy Chung Oracle JDK-8270688 Clarify the behavior of PhantomReference::refersTo
85 Daniel Daugherty Oracle JDK-8270687 ProblemList vmTestbase/nsk/jvmti/scenarios/sampling/SP07/sp07t002/TestDescription.java on Windows-X64 with -Xcomp
85 Naoto Sato Oracle JDK-8270686 Clarify the spec wrt `useOldISOCodes` system property
85 Nils Eliasson Oracle JDK-8270685 [TESTBUG] compiler/compilercontrol/mixed/RandomCommandsTest.java must not fail on Command.quiet
85 Hannes Wallnoefer Oracle JDK-8270684 Module page uses unstyled table class
85 Daniel Daugherty Oracle JDK-8270683 ProblemList sun/management/jdp/JdpDefaultsTest.java on Linux-aarch64
85 Christoph Göttschkes Microdoc JDK-8270682 CallerAccessTest fails for non server variant
85 Martin Doerr SAP JDK-8270681 [s390] Interpreter checks wrong bit for slow path instance allocation
85 Zhengyu Gu Red Hat JDK-8270680 assert(_handle_mark_nesting > 1) failed: memory leak: allocating handle outside HandleMark
85 Jan Lahoda Oracle JDK-8270679 Better error recovery for broken patterns in switch
85 Wang Huang Independent JDK-8270678 JVM crashes when matching VectorMaskCmp Node
85 Jan Lahoda Oracle JDK-8270677 Switch statement containing pattern case label element gets in the loop during execution
85 Leo Korinth Oracle JDK-8270676 Remove assert that ensures thread identifier remains the same
85 Jatin Bhateja Intel JDK-8270675 VectorAPI Long512VectorTest fails on X86 KNL target
86 Jie Fu Tencent JDK-8270674 [REDO] vmTestbase/vm/mlvm/anonloader/stress/oome/metaspace/Test.java failed with OutOfMemoryError
86 Sean Coffey Oracle JDK-8270673 AccessControlException for SunPKCS11 daemon threads
86 Christoph Langer SAP JDK-8270672 javax/swing/reliability/HangDuringStaticInitialization.java fails in Windows debug build
86 Chris Plummer Oracle JDK-8270671 assert(!is_jweak(handle)) failed: wrong method for detroying jweak
86 Nils Eliasson Oracle JDK-8270670 C2: Compile::remove_speculative_types must iterate top-down
86 Jonathan Gibbons Oracle JDK-8270669 Runtime.exec(String, String[], File) documentation contains literal {@link ...}
86 Zhengyu Gu Red Hat JDK-8270668 Shenandoah: Add test for JDK-8268127
86 Jie Fu Tencent JDK-8270667 compiler/loopopts/TestPartialPeelingSinkNodes.java crashes with -XX:+VerifyGraphEdges
86 Thomas Schatzl Oracle JDK-8270666 Rename G1AllowPreventiveGC option to G1UsePreventiveGC
87 Mandy Chung Oracle JDK-8270665 Rename test/jdk/java/lang/invoke/t8150782 to accessClassAndFindClass
87 Xin Liu Amazon JDK-8270664 async logging supports to dynamically change tags and decorators
87 Daniel Daugherty Oracle JDK-8270663 Remove java/util/concurrent/locks/Lock/TimedAcquireLeak.java from ProblemList.txt
87 Alexey Semenyuk Oracle JDK-8270662 Fix jpackage tests to gracefully handle jpackage app launcher crashes
87 Vladimir Kozlov Oracle JDK-8270661 Regression ~5% in 2005 in b27
87 Jim Laskey Oracle JDK-8270660 The documentation of the String.regionMatches method contains error
89 Dean Long Oracle JDK-8270659 illegal access to global field _jvmci_old_thread_counters by terminated thread causes crash
89 Mandy Chung Oracle JDK-8270658 Lookup::accessClass fails with IAE when accessing an arrayClass with a protected inner class as component class
89 Mandy Chung Oracle JDK-8270657 Proxy::newProxyInstance and MethodHandleProxies::asInterfaceInstance should reject sealed interfaces
90 Vladimir Kozlov Oracle JDK-8270656 Add AVX512 and other SSE + AVX combinations testing for tests which generate vector instructions
90 Alex Menkov Oracle JDK-8270655 serviceability/dcmd/framework/InvalidCommandTest.java still fails after JDK-8268433
90 Alexander Matveev Oracle JDK-8270654 tools/jpackage/share/AppImagePackageTest.java failed with "hdiutil: create failed - Resource busy"
90 Brian Burkhalter Oracle JDK-8270653 (fs) Files.copy fails to copy from /proc on some linux kernel versions
90 Joe Wang Oracle JDK-8270648 BCEL: Utility.encode forget to close
90 Sandhya Viswanathan Intel JDK-8270645 Unable to load svml library
90 Jan Lahoda Oracle JDK-8270644 Adjust javac to updated exhaustiveness specification
91 Jonathan Gibbons Oracle JDK-8270643 Add default impl for recent new Reporter.print method
91 Guoxiong Li Independent JDK-8270642 Javac generates uncorrect bytecodes when using nested pattern variables
91 Guoxiong Li Independent JDK-8270641 NPE at at jdk.compiler/com.sun.tools.javac.jvm.Code.emitop
91 Daniel Daugherty Oracle JDK-8270640 ProblemList vmTestbase/vm/mlvm/mixed/stress/regression/b6969574/INDIFY_Test.java on Linux-X64 -Xcomp
91 Daniel Daugherty Oracle JDK-8270639 ProblemList javax/swing/JFileChooser/FileSystemView/SystemIconTest.java on Win-X64
91 Daniel Daugherty Oracle JDK-8270638 ProblemList serviceability/dcmd/gc/RunFinalizationTest.java on Win-X64 and linux-aarch64
91 Daniel Daugherty Oracle JDK-8270637 ProblemList java/awt/KeyboardFocusmanager/TypeAhead/ButtonActionKeyTest/ButtonActionKeyTest.java on win-x64
91 Paul Sandoz Oracle JDK-8270636 Scoped ByteBuffer vector access
91 Aleksey Shipilev Red Hat JDK-8270635 GaloisCounterMode.overlapDetection misses the JDK-8263436 fix again
91 Yasumasa Suenaga NTT DATA JDK-8270634 ProblemList serviceability/sa/TestJmapCoreMetaspace.java with ZGC
91 Jatin Bhateja Intel JDK-8270633 compiler/intrinsics/VectorizedMismatchTest.java failed with failed: length in range
92 Jie Fu Tencent JDK-8270632 Crash in TestMacroLogicVector::testSubWordBoolean: assert(_base >= VectorMask && _base <= VectorZ) failed: Not a Vector
92 Sandhya Viswanathan Intel JDK-8270631 LibraryCallKit::inline_preconditions_checkIndex modifies control flow even if the intrinsic bailed out
92 Vicente Arturo Romero Zaldivar Oracle JDK-8270630 Erroneous generic type inference in a lambda expression with a checked exception
92 Markus Grönlund Oracle JDK-8270629 Klass enqueue element size calculation wrong when traceid value cross compress limit
92 Jan Lahoda Oracle JDK-8270628 Parenthesized pattern is not guarded by source level check
92 Jan Lahoda Oracle JDK-8270627 Parenthesized pattern with guards does not work
92 Per Liden Oracle JDK-8270626 assert(ZAddress::is_marked(addr)) failed: Should be marked
92 Xin Liu Amazon JDK-8270625 Dropped messages of AsyncLogWriter cause memleak
92 Aleksey Shipilev Red Hat JDK-8270624 Update minor GCC version in GitHub Actions pipeline
93 Dean Long Oracle JDK-8270623 [aarch64] Crash with 'Field too big for insn' for some tests under compiler/jvmci/jdk.vm.ci.code.test/src/jdk/vm/ci/code/test/
93 Andy Herrick Oracle JDK-8270622 [TESTBUG] tools/jpackage/windows/WinInstallerIconTest.java failed "AssertionError: Failed: Check icon"
93 Nils Eliasson Oracle JDK-8270621 c2 loop unrolling by 8 results in reading memory past array
93 Roland Westrelin Red Hat JDK-8270620 C2: java/text/Normalizer/ConformanceTest.java test failed with assertion
93 Jorn Vernee Oracle JDK-8270619 Upstream 8268230: Foreign Linker API & Windows user32/kernel32: String conversion seems broken
93 Erik Österlund Oracle JDK-8270618 nmethod::post_compiled_method_load_event racingly called on zombie
93 Jan Lahoda Oracle JDK-8270617 StandardJavaFileManager::setLocationFromPaths() spec contains an error
93 Jan Lahoda Oracle JDK-8270616 StandardJavaFileManager::getJavaFileObjectsFromPaths() methods contain a typo in their spec
93 Jan Lahoda Oracle JDK-8270615 StandardJavaFileManager: default impls of setLocationFromPaths(), getJavaFileObjectsFromPaths() methods don't throw IllegalArgumentException as specified
93 Jan Lahoda Oracle JDK-8270614 StandardJavaFileManager: getJavaFileObjects() impl violates the spec
93 Vicente Arturo Romero Zaldivar Oracle JDK-8270613 j.l.constant.DirectMethodHandleDesc.Kind.valueOf(int) implementation doesn't conform to the spec regarding REF_invokeInterface handling
93 Weijun Wang Oracle JDK-8270612 Provide clear run-time warnings about Security Manager deprecation
94 Jatin Bhateja Intel JDK-8270611 VectorAPI cast operation on mask and shuffle is broken
94 Weijun Wang Oracle JDK-8270610 [BACKOUT] JDK-8196415 Disable SHA-1 Signed JARs
94 Roland Westrelin Red Hat JDK-8270608 C2: assert(!loop->is_member(u_loop)) failed: can be in outer loop or out of both loops only
94 Jorn Vernee Oracle JDK-8270607 Upstream: 8268673: Stack walk across optimized entry frame on fresh native thread fails
94 Hui Shi Tencent JDK-8270606 [REDO] C2 crash when compile negative Arrays.copyOf length after loop
94 Markus Grönlund Oracle JDK-8270605 JFR diagnostic commands lack argument descriptors when viewed using Platform MBean Server
94 Boris Ulasevich BellSoft JDK-8270604 bug in monitor locking/unlocking on ARM32 C1 due to uninitialized BasicObjectLock::_displaced_header
95 Jie Fu Tencent JDK-8270603 Build failure due to VerifyReceiverTypes was not declared after JDK-8268405
97 Erik Gahlin Oracle JDK-8270602 Typo in JFR jdk.Deserialization event
97 Xin Liu Amazon JDK-8270601 semaphores of AsyncLogWriter may be broken when JVM is exiting.
97 Chris Plummer Oracle JDK-8270600 ClhsdbFindPC still fails with java.lang.RuntimeException: 'In java stack' missing from stdout/stderr
97 Joe Wang Oracle JDK-8270599 XML transformation and indentation when using xml:space
97 Igor Ignatyev Oracle JDK-8270598 jsig/Testjsig.java doesn't check exit code
97 Paul Sandoz Oracle JDK-8270597 Refactor and expand scatter/gather tests
97 Erik Gahlin Oracle JDK-8270596 JFR: RecordingStream::dump is missing @since
97 Mark Sheppard Oracle JDK-8270595 [macos-aarch64] java/net/MulticastSocket/Promiscuous.java failed with "SocketException: Cannot allocate memory"
97 Igor Ignatyev Oracle JDK-8270594 mark hotspot serviceability/attach tests which ignore external VM flags
97 Igor Ignatyev Oracle JDK-8270593 mark SDTProbesGNULinuxTest as ignoring external VM flags
97 Igor Ignatyev Oracle JDK-8270592 mark hotspot serviceability/sa tests which ignore external VM flags
97 Igor Ignatyev Oracle JDK-8270591 mark hotspot serviceability/jvmti tests which ignore external VM flags
97 Igor Ignatyev Oracle JDK-8270590 mark hotspot runtime/sealedClasses tests which ignore external VM flags
97 Igor Ignatyev Oracle JDK-8270589 mark hotspot runtime/stringtable tests which ignore external VM flags
97 Igor Ignatyev Oracle JDK-8270588 runtime/handshake tests don't need WhiteBox after AOT removal
97 Igor Ignatyev Oracle JDK-8270587 mark hotspot runtime/verifier tests which ignore external VM flags
97 Igor Ignatyev Oracle JDK-8270586 mark hotspot runtime/symboltable tests which ignore external VM flags
97 Igor Ignatyev Oracle JDK-8270585 mark hotspot runtime/records tests which ignore external VM flags
97 Igor Ignatyev Oracle JDK-8270584 a few runtime/jni tests don't need `/othervm`
97 Vladimir Ivanov Oracle JDK-8270583 Several regressions 4-17% after CHA changes
98 Rajan Halade Oracle JDK-8270582 LetsEncryptCA.java test fails as Let’s Encrypt Authority X3 is retired
98 Valerie Peng Oracle JDK-8270581 Some impls of javax.crypto.Cipher.init() do not throw UnsupportedOperationExc for unsupported modes
98 Vladimir Ivanov Oracle JDK-8270580 C2: assert(_gvn.type(obj)->higher_equal(tjp)) failed: cast_up is no longer needed
98 Vladimir Ivanov Oracle JDK-8270579 assert(!ik->is_interface() && !ik->has_subklass()) failed: inconsistent klass hierarchy
98 Kim Barrett Oracle JDK-8270578 MutableSpaceUsedHelper::take_sample() hits assert(left >= right) failed: avoid overflow
98 Daniel Daugherty Oracle JDK-8270577 ProblemList tools/jpackage/windows/WinInstallerIconTest.java on win-x64
98 Jonathan Gibbons Oracle JDK-8270576 Javac crashes with NullPointerException when finding unencoded XML in
 tag
98 Fernando Guallini Oracle JDK-8270575 javax/net/ssl/SSLSession/TestEnabledProtocols.java failed with "RuntimeException: java.net.SocketException: Connection reset"
98 Paul Sandoz Oracle JDK-8270574 Test libsvml.so is and is not present in jdk image
98 Jonathan Gibbons Oracle JDK-8270573 jdk/javadoc/tool/6176978/T6176978.java uses @ignore w/o bug-id
98 Jonathan Gibbons Oracle JDK-8270572 jdk/javadoc/tool/LangVers.java uses @ignore w/o bug-id
98 Jonathan Gibbons Oracle JDK-8270571 jdk/javadoc/tool/InlineTagsWithBraces.java uses @ignore w/o bug-id
98 Patrick Concannon Oracle JDK-8270570 Test `ADatagramSocket.java` missing /othervm from @run tag
98 Julia Boes Oracle JDK-8270569 java/util/concurrent/forkjoin/AsyncShutdownNow.java fails with java.util.concurrent.RejectedExecutionException
98 Eric Liu ARM JDK-8270568 AArch64: Build failure after JDK-8267663
98 Jie Fu Tencent JDK-8270567 [foreign] assert(allocates2(pc)) failed: not in CodeBuffer memory with ShenandoahGC
99 David Holmes Oracle JDK-8270566 Update the documentation for -Xcheck:jni
99 Yasumasa Suenaga NTT DATA JDK-8270565 ProblemList serviceability/sa/TestJmapCoreMetaspace.java on linux-x64 with ZGC
99 Daniel Daugherty Oracle JDK-8270564 ProblemList jdk/jfr/api/consumer/streaming/TestLatestEvent.java on win-x64
99 Rajan Halade Oracle JDK-8270563 Add expiry exception for identrustdstx3 alias to VerifyCACerts.java test
99 Jonathan Gibbons Oracle JDK-8270562 Residual logging output written to STDOUT, not STDERR
99 Daniel Fuchs Oracle JDK-8270561 [macos-aarch64] 7 java/net/httpclient/websocket tests failed
99 Bradford Wetmore Oracle JDK-8270560 JDK-8268768 missed removing two files

No changesets log

JDK-8273851 macOS Monterey does not have the font Times needed by Serif
JDK-8273399 Revert "8225083: Remove Google certificate that is expiring in December 2021"
JDK-8273213 [Test]: java/net/httpclient/DigestEchoClientSSL.java contains redundant @run tags
JDK-8273212 sun/security/pkcs11/Provider/MultipleLogins.sh fails after JDK-8266182
JDK-8273211 Automate manual steps listed in the test jdk/sun/security/pkcs12/ParamsTest.java
JDK-8273210 RunThese24H.java failed with EXCEPTION_ACCESS_VIOLATION in java_lang_Thread::get_thread_status
JDK-8273209 [macOS] "Apple AWT Internal Exception" when input method is changed
JDK-8273208 Session resumption errors
JDK-8273207 Shenandoah: Resolve UNKNOWN access strength, where possible
JDK-8272960 [macos] Build failure with Xcode 13.0 after JDK-8264848
JDK-8272959 Kerberos Credential Retrieval from Cache not Working in Cross-Realm Setup
JDK-8272955 StackGuardPages test doesn't build with glibc 2.34
JDK-8272954 [Test]: Cleanup: test/jdk/security/infra/java/security/cert/CertPathValidator/certification/BuypassCA.java no longer needs ocspEnabled
JDK-8272953 Shenandoah: Optimize gc/shenandoah/TestRefprocSanity.java for interpreter mode
JDK-8272952 Shenandoah: Provide human-readable labels for test configurations
JDK-8272951 Shenandoah: gc/shenandoah/mxbeans tests should be more resilient
JDK-8272950 [macos] not all KEY_PRESSED events sent when control modifier is used
JDK-8272949 java/util/Random/RandomTestMoments.java had two Gaussian fails
JDK-8272948 security/infra/java/security/cert/CertPathValidator/certification/QuoVadisCA.java fails, Certificate has been revoked
JDK-8272947 security/infra/java/security/cert/CertPathValidator/certification/LetsEncryptCA.java OCSP response error
JDK-8272946 jtreg test security/infra/java/security/cert/CertPathValidator/certification/BuypassCA.java fails
JDK-8272686 Remove Google certificate that is expiring in December 2021
JDK-8272685 Cgroup v1 initialization causes NullPointerException when cgroup path contains colon
JDK-8272684 PhaseMacroExpand::generate_slow_arraycopy crash when clone null CallProjections.fallthrough_ioproj
JDK-8272683 C2: assert(iff->Opcode() == Op_If || iff->Opcode() == Op_CountedLoopEnd || iff->Opcode() == Op_RangeCheck) failed: Check this code when new subtype is added
JDK-8272682 C2: Wrong JVM state used for receiver null check
JDK-8272681 [IR Framework] Some default regexes matching on PrintOptoAssembly in IRNode.java do not work on all platforms
JDK-8272680 ZGC: Arraycopy stub passes invalid oop to load barrier
JDK-8272679 C2: assert(no_dead_loop) failed: dead loop detected
JDK-8272678 ZGC: ZBarrierSetC2::clone_at_expansion fails with "Guard against surprises" assert
JDK-8272677 Repeatable annotations without @Target cannot have containers that target module declarations
JDK-8272676 --with-harfbuzz=system doesn't add -lharfbuzz after JDK-8255790
JDK-8272675 fatal error with variable shift count integer rotate operation.
JDK-8272536 Release Note: Removed IdenTrust Root Certificate
JDK-8272211 Final nroff manpage update for JDK 17
JDK-8272210 JFR Recorder Thread crashed with SIGSEGV in write_klass
JDK-8272209 ProblemList serviceability/sa/TestJmapCore.java on linux-x64 with ZGC
JDK-8272208 ProblemList javax/swing/JComponent/7154030/bug7154030.java in JDK17
JDK-8272207 ProblemList jdk/jfr/event/gc/detailed/TestEvacuationFailedEvent.java in JDK17
JDK-8272206 ZGC several jvm08 perf regressions after JDK-8268372
JDK-8272205 Improve AlgorithmConstraints:checkAlgorithm performance
JDK-8272204 OperatingSystemMXBean getProcessCpuLoad reports incorrect process cpu usage in containers
JDK-8272203 AARCH64: typo in LIR_Assembler::emit_profile_type
JDK-8272200 [TESTBUG] Rename Whitebox API package
JDK-8271818 C2: Avoid redundant uncommon traps in GraphKit::builtin_throw() for JVMTI exception events
JDK-8271817 C2: assert(n != __null) failed: Bad immediate dominator info.
JDK-8271816 Remove EA from JDK 17 version string starting with Initial RC promotion on Aug 5, 2021(B34)
JDK-8271815 C2: assert(!had_error) failed: bad dominance
JDK-8271814 ProblemList serviceability/sa/sadebugd/DebugdConnectTest.java due to 8270326
JDK-8271813 ProblemList SA tests that are failing with ZGC due to JDK-8248912
JDK-8271812 (doc) Clarify Filter Factory example
JDK-8271811 mark hotspot runtime/memory tests which ignore external VM flags
JDK-8271810 mark hotspot runtime/os tests which ignore external VM flags
JDK-8271809 ProblemList 2 locale tests on macOS-x64
JDK-8271808 ProblemList javax/sound/midi/Sequencer/Looping.java
JDK-8271807 JavaThread::java_suspend() fails with "fatal error: Illegal threadstate encountered: 6"
JDK-8271806 runtime/ClassFile/UnsupportedClassFileVersion.java can be run in driver mode
JDK-8271805 Extend jcc erratum mitigation to additional processors
JDK-8271804 TestParallelRefProc fails on single core machines
JDK-8271803 runtime/Safepoint tests use OutputAnalyzer::shouldMatch instead of shouldContaint
JDK-8271802 NPE in DocTreePath.getTreePath()
JDK-8271801 SEGV at read_string_field(oopDesc*, char const*, JavaThread*)+0x54
JDK-8271800 two runtime/ClassFile tests don't check exit code
JDK-8271799 UnicodeReader not translating \u005c\\u005d to \\]
JDK-8271798 runtime/jni/FindClassUtf8/FindClassUtf8.java doesn't have to be run in othervm
JDK-8271797 two runtime/Monitor tests don't check exit code
JDK-8271796 java/awt/Focus/DeiconifiedFrameLoosesFocus/DeiconifiedFrameLoosesFocus.java sometimes failed on ubuntu
JDK-8271795 [macos] JTabbedPane title looks like disabled
JDK-8271794 serviceability/jvmti/GetObjectSizeClass.java doesn't check exit code
JDK-8271793 runtime/handshake/HandshakeTimeoutTest.java can be run in driver mode
JDK-8271792 runtime/StackTrace/LargeClassTest.java can be run in driver mode
JDK-8271791 runtime/handshake/HandshakeTimeoutTest.java test doesn't check exit code
JDK-8271790 runtime/Safepoint/TestAbortVMOnSafepointTimeout.java can be run in driver mode
JDK-8271789 runtime/jni/checked/TestCheckedJniExceptionCheck.java doesn't set -Djava.library.path
JDK-8271788 Wrong path separator in env variable
JDK-8271787 Update java.lang.annotation.Target for changes in JLS 9.6.4.1
JDK-8271786 runtime/duplAttributes/DuplAttributesTest.java doesn't check exit code
JDK-8271785 remove deadcode from runtime/Thread/TestThreadDumpSMRInfo.java test
JDK-8271784 Suspend during block transition may deadlock if lock held
JDK-8271783 ProblemList runtime/InvocationTests/invokevirtualTests.java
JDK-8271782 ZGC: Invalid oop passed to ZBarrierSetRuntime::load_barrier_on_oop_array
JDK-8271772 JFR: Docs for -XX:StartFlightRecording is incorrect
JDK-8271768 a few runtime/memory tests don't check exit code
JDK-8271766 [TEST_BUG] Failure on solaris of java/awt/Window/MultiWindowApp/MultiWindowAppTest.java
JDK-8271757 ProblemList 3 client tests on Linux-X64
JDK-8271756 Missing forward declaration of ZeroFrame
JDK-8271754 Problemlist vmTestbase/nsk/jdi/HiddenClass/events/events001.java
JDK-8271753 java/foreign/stackwalk/TestAsyncStackWalk.java test failed with concurrent GC
JDK-8271751 C2: assert(false) failed: bad AD file after JDK-8267687
JDK-8271749 Remove IdenTrust certificate that is expiring in September 2021
JDK-8271335 Updating RE Configs for BUILD REQUEST 17.0.1+4
JDK-8271285 jarsigner doc is not precise when describing jar file re-signing
JDK-8270790 [PIT][macosx] Failure of closed/java/awt/FontClass/FontStringBounds.java
JDK-8270779 Typo in file name in example for -Xlint:processing
JDK-8270777 [JNI] Clarify the specification in relation to portable use of APIs that involve the Primitive Array Release Modes
JDK-8270774 javapath/java.exe strips double quotes from command line args

Committer push log

Alexey Bakhtin, Azul

Bug Summary
JDK-8270748 TCP Connection Reset when connecting simple socket to SSL server

Anton Kozlov, Azul

Bug Summary
JDK-8270763 [macosx-aarch64] Crash with SIGBUS in MarkActivationClosure::do_code_blob during vmTestbase/nsk/jvmti/.../bi04t002 test run

Alexander Matveev, Oracle

Bug Summary
JDK-8270654 tools/jpackage/share/AppImagePackageTest.java failed with "hdiutil: create failed - Resource busy"

Alex Menkov, Oracle

Bug Summary
JDK-8270655 serviceability/dcmd/framework/InvalidCommandTest.java still fails after JDK-8268433

Alexey Semenyuk, Oracle

Bug Summary
JDK-8270729 Directories in /opt/runtimepackagetest and /path/to/jdk-17 are different
JDK-8270662 Fix jpackage tests to gracefully handle jpackage app launcher crashes

Brian Burkhalter, Oracle

Bug Summary
JDK-8270653 (fs) Files.copy fails to copy from /proc on some linux kernel versions
JDK-8270736 ByteArrayInputStream#read with a byte array of length 0 not consistent with InputStream when at EOF

Boris Ulasevich, BellSoft

Bug Summary
JDK-8270604 bug in monitor locking/unlocking on ARM32 C1 due to uninitialized BasicObjectLock::_displaced_header

Christoph Göttschkes, Microdoc

Bug Summary
JDK-8270682 CallerAccessTest fails for non server variant
JDK-8270749 serviceability/sa/Clhsdb tests are using a C2 specific VMStruct field

Christian Hagedorn, Oracle

Bug Summary
JDK-8270703 C2: assert(n != __null) failed: Bad immediate dominator info.
JDK-8270744 C2: Node is wrongly marked as reduction resulting in a wrong execution due to wrong vector instructions
JDK-8270752 C2: Out of bounds array load floats above its range check in loop peeling resulting in SEGV

Chris Plummer, Oracle

Bug Summary
JDK-8270671 assert(!is_jweak(handle)) failed: wrong method for detroying jweak
JDK-8270600 ClhsdbFindPC still fails with java.lang.RuntimeException: 'In java stack' missing from stdout/stderr
JDK-8270721 SA's vm object vtable matching code sometimes matches on incorrect type

Christoph Langer, SAP

Bug Summary
JDK-8270895 [macOS] Exception from "Printable.print" is swallowed during "PrinterJob.print"
JDK-8271213 Add option to jcmd GC.heap_dump to use existing file
JDK-8270920 Exclude security/infra/java/security/cert/CertPathValidator/certification/LetsEncryptCA
JDK-8270761 InfiniteLoopException test may fail on x86 platforms
JDK-8270672 javax/swing/reliability/HangDuringStaticInitialization.java fails in Windows debug build
JDK-8270899 Remove unused buffer int
JDK-8271204 stack-use-after-scope in NewObjectA

Sean Coffey, Oracle

Bug Summary
JDK-8270673 AccessControlException for SunPKCS11 daemon threads

Liam Miller-Cushon, Google

Bug Summary
JDK-8270689 JDK-8262891 causes an NPE in Lint.augment

Daniel Daugherty, Oracle

Bug Summary
JDK-8270737 ProblemList 4 SA tests on macOS-aarch64
JDK-8270637 ProblemList java/awt/KeyboardFocusmanager/TypeAhead/ButtonActionKeyTest/ButtonActionKeyTest.java on win-x64
JDK-8270639 ProblemList javax/swing/JFileChooser/FileSystemView/SystemIconTest.java on Win-X64
JDK-8270564 ProblemList jdk/jfr/api/consumer/streaming/TestLatestEvent.java on win-x64
JDK-8270638 ProblemList serviceability/dcmd/gc/RunFinalizationTest.java on Win-X64 and linux-aarch64
JDK-8270683 ProblemList sun/management/jdp/JdpDefaultsTest.java on Linux-aarch64
JDK-8270577 ProblemList tools/jpackage/windows/WinInstallerIconTest.java on win-x64
JDK-8270687 ProblemList vmTestbase/nsk/jvmti/scenarios/sampling/SP07/sp07t002/TestDescription.java on Windows-X64 with -Xcomp
JDK-8270640 ProblemList vmTestbase/vm/mlvm/mixed/stress/regression/b6969574/INDIFY_Test.java on Linux-X64 -Xcomp
JDK-8270663 Remove java/util/concurrent/locks/Lock/TimedAcquireLeak.java from ProblemList.txt

Daniel Fuchs, Oracle

Bug Summary
JDK-8270561 [macos-aarch64] 7 java/net/httpclient/websocket tests failed
JDK-8270725 [macos-aarch64] test compilation failed with "SocketException: No buffer space available"

David Holmes, Oracle

Bug Summary
JDK-8270566 Update the documentation for -Xcheck:jni

Dean Long, Oracle

Bug Summary
JDK-8270623 [aarch64] Crash with 'Field too big for insn' for some tests under compiler/jvmci/jdk.vm.ci.code.test/src/jdk/vm/ci/code/test/
JDK-8270659 illegal access to global field _jvmci_old_thread_counters by terminated thread causes crash

Erik Gahlin, Oracle

Bug Summary
JDK-8270709 jdk/jfr/jcmd/TestJcmdDump.java with slowdebug bits fails with AttachNotSupportedException
JDK-8270596 JFR: RecordingStream::dump is missing @since
JDK-8270602 Typo in JFR jdk.Deserialization event

Eric Liu, ARM

Bug Summary
JDK-8270717 AArch64: 'bad AD file' in some vector conversion tests
JDK-8270568 AArch64: Build failure after JDK-8267663

Erik Österlund, Oracle

Bug Summary
JDK-8270618 nmethod::post_compiled_method_load_event racingly called on zombie

Erik Joelsson, Oracle

Bug Summary
JDK-8270753 Interim javadoc build does not support platform links
JDK-8270751 Missing build dependency between jdk.jfr-gendata and buildtools-hotspot
JDK-8270766 Test build/AbsPathsInImage.java fails after JDK-8259848

Fernando Guallini, Oracle

Bug Summary
JDK-8270575 javax/net/ssl/SSLSession/TestEnabledProtocols.java failed with "RuntimeException: java.net.SocketException: Connection reset"

Guoxiong Li, Independent

Bug Summary
JDK-8270735 AssertionError when combining pattern matching and function closure
JDK-8270642 Javac generates uncorrect bytecodes when using nested pattern variables
JDK-8270641 NPE at at jdk.compiler/com.sun.tools.javac.jvm.Code.emitop

Hannes Wallnoefer, Oracle

Bug Summary
JDK-8270762 Handling type arguments from outer classes for inner class in javadoc
JDK-8270691 javadoc generates broken links with {@inheritDoc}
JDK-8270684 Module page uses unstyled table class

Andy Herrick, Oracle

Bug Summary
JDK-8270622 [TESTBUG] tools/jpackage/windows/WinInstallerIconTest.java failed "AssertionError: Failed: Check icon"

Hui Shi, Tencent

Bug Summary
JDK-8270606 [REDO] C2 crash when compile negative Arrays.copyOf length after loop

Igor Ignatyev, Oracle

Bug Summary
JDK-8270584 a few runtime/jni tests don't need `/othervm`
JDK-8270598 jsig/Testjsig.java doesn't check exit code
JDK-8270585 mark hotspot runtime/records tests which ignore external VM flags
JDK-8270590 mark hotspot runtime/sealedClasses tests which ignore external VM flags
JDK-8270589 mark hotspot runtime/stringtable tests which ignore external VM flags
JDK-8270586 mark hotspot runtime/symboltable tests which ignore external VM flags
JDK-8270587 mark hotspot runtime/verifier tests which ignore external VM flags
JDK-8270594 mark hotspot serviceability/attach tests which ignore external VM flags
JDK-8270591 mark hotspot serviceability/jvmti tests which ignore external VM flags
JDK-8270592 mark hotspot serviceability/sa tests which ignore external VM flags
JDK-8270593 mark SDTProbesGNULinuxTest as ignoring external VM flags
JDK-8270588 runtime/handshake tests don't need WhiteBox after AOT removal

Ioi Lam, Oracle

Bug Summary
JDK-8270720 CDS check_excluded_classes needs DumpTimeTable_lock

Jatin Bhateja, Intel

Bug Summary
JDK-8270697 assert(is_valid()) failed: invalid register (-1)
JDK-8270633 compiler/intrinsics/VectorizedMismatchTest.java failed with failed: length in range
JDK-8270740 compiler/vectorapi/VectorCastShape*Test.java tests failed on avx2 machines
JDK-8270734 corrections in some instruction patterns for KNL x86 platform
JDK-8270611 VectorAPI cast operation on mask and shuffle is broken
JDK-8270675 VectorAPI Long512VectorTest fails on X86 KNL target

Julia Boes, Oracle

Bug Summary
JDK-8270569 java/util/concurrent/forkjoin/AsyncShutdownNow.java fails with java.util.concurrent.RejectedExecutionException

Jamsheed C M, Oracle

Bug Summary
JDK-8270701 C2 compilation fails with assert "missing precedence edge"

Jayathirth D V, Oracle

Bug Summary
JDK-8270690 [macos] [lanai] java/awt/PrintJob/Text/stringwidth.sh doesn't exit on cancelling print dialog

Jie Fu, Tencent

Bug Summary
JDK-8270567 [foreign] assert(allocates2(pc)) failed: not in CodeBuffer memory with ShenandoahGC
JDK-8270674 [REDO] vmTestbase/vm/mlvm/anonloader/stress/oome/metaspace/Test.java failed with OutOfMemoryError
JDK-8270603 Build failure due to VerifyReceiverTypes was not declared after JDK-8268405
JDK-8270667 compiler/loopopts/TestPartialPeelingSinkNodes.java crashes with -XX:+VerifyGraphEdges
JDK-8270632 Crash in TestMacroLogicVector::testSubWordBoolean: assert(_base >= VectorMask && _base <= VectorZ) failed: Not a Vector

Jonathan Gibbons, Oracle

Bug Summary
JDK-8270643 Add default impl for recent new Reporter.print method
JDK-8270576 Javac crashes with NullPointerException when finding unencoded XML in
 tag
JDK-8270573 jdk/javadoc/tool/6176978/T6176978.java uses @ignore w/o bug-id
JDK-8270571 jdk/javadoc/tool/InlineTagsWithBraces.java uses @ignore w/o bug-id
JDK-8270572 jdk/javadoc/tool/LangVers.java uses @ignore w/o bug-id
JDK-8270738 NPE in HtmlDocletWriter
JDK-8270562 Residual logging output written to STDOUT, not STDERR
JDK-8270669 Runtime.exec(String, String[], File) documentation contains literal {@link ...}

Jan Lahoda, Oracle

Bug Summary
JDK-8270727 (jdeprscan) tools/jdeprscan/tests/jdk/jdeprscan/TestRelease.java failed with "error: cannot access jdk.internal.ValueBased"
JDK-8270644 Adjust javac to updated exhaustiveness specification
JDK-8270679 Better error recovery for broken patterns in switch
JDK-8270726 class file for sun.misc.Contended not found
JDK-8270733 Desugaring of pattern matching enum switch should be improved
JDK-8270743 IncompatibleClassChangeError on empty pattern switch statement case
JDK-8270695 javac crashes when processing parenthesized pattern in instanceof
JDK-8270722 javac fails to compile nested pattern matching switches
JDK-8270723 javac generates class with invalid stack map
JDK-8270724 jshell throws exception while parsing illegal "case true"
JDK-8270741 Missing unreported constraints on pattern and other case label combination
JDK-8270628 Parenthesized pattern is not guarded by source level check
JDK-8270627 Parenthesized pattern with guards does not work
JDK-8270615 StandardJavaFileManager: default impls of setLocationFromPaths(), getJavaFileObjectsFromPaths() methods don't throw IllegalArgumentException as specified
JDK-8270614 StandardJavaFileManager: getJavaFileObjects() impl violates the spec
JDK-8270616 StandardJavaFileManager::getJavaFileObjectsFromPaths() methods contain a typo in their spec
JDK-8270617 StandardJavaFileManager::setLocationFromPaths() spec contains an error
JDK-8270677 Switch statement containing pattern case label element gets in the loop during execution
JDK-8270742 Switch statement with a pattern, constant and default label elements crash javac
JDK-8270732 Switches with 'case null:' should be exhaustive

Jim Laskey, Oracle

Bug Summary
JDK-8270765 (JEP-356) - RandomGenerator spec implementation requirements tightly coupled to JDK internal classes
JDK-8270764 SplittableRandom extends AbstractSplittableGenerator
JDK-8270660 The documentation of the String.regionMatches method contains error

Joe Wang, Oracle

Bug Summary
JDK-8270648 BCEL: Utility.encode forget to close
JDK-8270599 XML transformation and indentation when using xml:space

Jorn Vernee, Oracle

Bug Summary
JDK-8270619 Upstream 8268230: Foreign Linker API & Windows user32/kernel32: String conversion seems broken
JDK-8270607 Upstream: 8268673: Stack walk across optimized entry frame on fresh native thread fails

Kim Barrett, Oracle

Bug Summary
JDK-8270713 JNI_GetStringCritical does not lock char array
JDK-8270578 MutableSpaceUsedHelper::take_sample() hits assert(left >= right) failed: avoid overflow
JDK-8270714 Optimize gc-locker in [Get|Release]StringCritical for latin string
JDK-8270698 vmTestbase/gc/gctests/PhantomReference/phantom002/TestDescription.java timed out

Alexander Zuev, Oracle

Bug Summary
JDK-8270707 Password is being converted to String in AccessibleJPasswordField

Vladimir Kozlov, Oracle

Bug Summary
JDK-8270700 [JVMCI] restore original qualified exports to Graal
JDK-8270719 [TESTBUG] Missing testing for x86 KNL platforms
JDK-8270656 Add AVX512 and other SSE + AVX combinations testing for tests which generate vector instructions
JDK-8270718 ProblemList compiler/vectorapi/VectorCastShape[64|128]Test.java tests on x86
JDK-8270661 Regression ~5% in 2005 in b27

Leo Korinth, Oracle

Bug Summary
JDK-8270676 Remove assert that ensures thread identifier remains the same

Mandy Chung, Oracle

Bug Summary
JDK-8270688 Clarify the behavior of PhantomReference::refersTo
JDK-8270716 Clarify the behavior of System::gc w.r.t. reference processing
JDK-8270658 Lookup::accessClass fails with IAE when accessing an arrayClass with a protected inner class as component class
JDK-8270657 Proxy::newProxyInstance and MethodHandleProxies::asInterfaceInstance should reject sealed interfaces
JDK-8270665 Rename test/jdk/java/lang/invoke/t8150782 to accessClassAndFindClass

Maurizio Cimadamore, Oracle

Bug Summary
JDK-8270699 java/foreign/TestResourceScope.java timed out
JDK-8270756 java/foreign/Test{Down,Up}call.java time out

Martin Doerr, SAP

Bug Summary
JDK-8270728 [PPC64] C2: Math.rint intrinsic uses wrong rounding mode
JDK-8270681 [s390] Interpreter checks wrong bit for slow path instance allocation

Markus Grönlund, Oracle

Bug Summary
JDK-8270754 Deadlock during Volano with JFR
JDK-8270605 JFR diagnostic commands lack argument descriptors when viewed using Platform MBean Server
JDK-8270629 Klass enqueue element size calculation wrong when traceid value cross compress limit
JDK-8270755 Stress test SEGV while emitting OldObjectSample

Mikael Vidstedt, Oracle

Bug Summary
JDK-8270706 JFR Terminology Refresh

Mikhailo Seledtsov, Oracle

Bug Summary
JDK-8270739 Update Platform.isDefaultCDSArchiveSupported() to return true for aarch64 platforms

Mark Sheppard, Oracle

Bug Summary
JDK-8270595 [macos-aarch64] java/net/MulticastSocket/Promiscuous.java failed with "SocketException: Cannot allocate memory"

Sean Mullan, Oracle

Bug Summary
JDK-8270750 (fs) Custom DefaultFileSystemProvider security related loops

Naoto Sato, Oracle

Bug Summary
JDK-8270686 Clarify the spec wrt `useOldISOCodes` system property
JDK-8270696 Typo in j.t.Normalizer.normalize()

Nils Eliasson, Oracle

Bug Summary
JDK-8270685 [TESTBUG] compiler/compilercontrol/mixed/RandomCommandsTest.java must not fail on Command.quiet
JDK-8270702 assert(tmp == _callprojs.fallthrough_catchproj) failed: allocation control projection
JDK-8270621 c2 loop unrolling by 8 results in reading memory past array
JDK-8270670 C2: Compile::remove_speculative_types must iterate top-down

Patrick Concannon, Oracle

Bug Summary
JDK-8270570 Test `ADatagramSocket.java` missing /othervm from @run tag

Per Liden, Oracle

Bug Summary
JDK-8270626 assert(ZAddress::is_marked(addr)) failed: Should be marked

Philip Race, Oracle

Bug Summary
JDK-8270746 [macOS] Update named used for Java run loop mode
JDK-8270921 Problem List java/awt/Window/MultiWindowApp/MultiWindowAppTest.java on Linux

Paul Sandoz, Oracle

Bug Summary
JDK-8270597 Refactor and expand scatter/gather tests
JDK-8270636 Scoped ByteBuffer vector access
JDK-8270574 Test libsvml.so is and is not present in jdk image

Rajan Halade, Oracle

Bug Summary
JDK-8270563 Add expiry exception for identrustdstx3 alias to VerifyCACerts.java test
JDK-8270582 LetsEncryptCA.java test fails as Let’s Encrypt Authority X3 is retired

Roland Westrelin, Red Hat

Bug Summary
JDK-8270693 C2 fails with assert(!n->is_Store() && !n->is_LoadStore()) failed: no node with a side effect
JDK-8270731 C2: assert(!in->is_CFG()) failed: CFG Node with no controlling input?
JDK-8270608 C2: assert(!loop->is_member(u_loop)) failed: can be in outer loop or out of both loops only
JDK-8270922 C2: assert(false) failed: Bad graph detected in build_loop_late
JDK-8270712 C2: assert(false) failed: graph should be schedulable after JDK-8252372
JDK-8270711 C2: assert(false) failed: unscheduable graph
JDK-8270620 C2: java/text/Normalizer/ConformanceTest.java test failed with assertion
JDK-8270692 C2: main loop in micro benchmark never executed

Roger Riggs, Oracle

Bug Summary
JDK-8270730 (test) Add diagnostic info to ProceessBuilder/Basic.java for unexpected output
JDK-8270745 Cleanup Override in Context-Specific Deserialization Filters

Severin Gehwolf, Red Hat

Bug Summary
JDK-8270708 [aarch64] java.library.path not including /usr/lib64
JDK-8270757 [TESTBUG] Add coverage for jvmci ResolvedJavaType.toJavaName() for lambdas

Aleksey Shipilev, Red Hat

Bug Summary
JDK-8270694 Crash/miscompile in CallGenerator::for_method_handle_inline after JDK-8191998
JDK-8270635 GaloisCounterMode.overlapDetection misses the JDK-8263436 fix again
JDK-8270624 Update minor GCC version in GitHub Actions pipeline

Sibabrata Sahoo, Oracle

Bug Summary
JDK-8270767 Additional tests for MessageDigest with different providers

Serguei Spitsyn, Oracle

Bug Summary
JDK-8270747 fix of JDK-8252657 missed to update history at the end of JVM TI spec

Sandhya Viswanathan, Intel

Bug Summary
JDK-8270705 compiler/codegen/ClearArrayTest.java failed with "assert(false) failed: bad AD file"
JDK-8270631 LibraryCallKit::inline_preconditions_checkIndex modifies control flow even if the intrinsic bailed out
JDK-8270645 Unable to load svml library

Tobias Hartmann, Oracle

Bug Summary
JDK-8270710 SIGSEGV in PhaseCFG::implicit_null_check due to missing null check

Thomas Schatzl, Oracle

Bug Summary
JDK-8270666 Rename G1AllowPreventiveGC option to G1UsePreventiveGC

Valerie Peng, Oracle

Bug Summary
JDK-8270581 Some impls of javax.crypto.Cipher.init() do not throw UnsupportedOperationExc for unsupported modes

Vladimir Ivanov, Oracle

Bug Summary
JDK-8270579 assert(!ik->is_interface() && !ik->has_subklass()) failed: inconsistent klass hierarchy
JDK-8270580 C2: assert(_gvn.type(obj)->higher_equal(tjp)) failed: cast_up is no longer needed
JDK-8270583 Several regressions 4-17% after CHA changes

Vicente Arturo Romero Zaldivar, Oracle

Bug Summary
JDK-8270758 DynamicCallSiteDesc::withArgs doesn't throw NPE
JDK-8270630 Erroneous generic type inference in a lambda expression with a checked exception
JDK-8270613 j.l.constant.DirectMethodHandleDesc.Kind.valueOf(int) implementation doesn't conform to the spec regarding REF_invokeInterface handling

Weijun Wang, Oracle

Bug Summary
JDK-8270610 [BACKOUT] JDK-8196415 Disable SHA-1 Signed JARs
JDK-8270612 Provide clear run-time warnings about Security Manager deprecation
JDK-8270704 The warning for System::setSecurityManager should only appear once for each caller

Bradford Wetmore, Oracle

Bug Summary
JDK-8270560 JDK-8268768 missed removing two files

Wang Huang, Independent

Bug Summary
JDK-8270678 JVM crashes when matching VectorMaskCmp Node

William Kemper, Amazon

Bug Summary
JDK-8270919 Corrupt oop in ClassLoaderData

Xiaohong Gong, ARM

Bug Summary
JDK-8270715 JVM crashes when running VectorMask query tests

Xin Liu, Amazon

Bug Summary
JDK-8270664 async logging supports to dynamically change tags and decorators
JDK-8270760 Async UL needs to handle ERANGE on exceeding SEM_VALUE_MAX
JDK-8270625 Dropped messages of AsyncLogWriter cause memleak
JDK-8270601 semaphores of AsyncLogWriter may be broken when JVM is exiting.

Yasumasa Suenaga, NTT DATA

Bug Summary
JDK-8270565 ProblemList serviceability/sa/TestJmapCoreMetaspace.java on linux-x64 with ZGC
JDK-8270634 ProblemList serviceability/sa/TestJmapCoreMetaspace.java with ZGC

Yi Yang, Alibaba

Bug Summary
JDK-8270759 Generated lambda class can not access protected static method of target class

Zhengyu Gu, Red Hat

Bug Summary
JDK-8270680 assert(_handle_mark_nesting > 1) failed: memory leak: allocating handle outside HandleMark
JDK-8270668 Shenandoah: Add test for JDK-8268127