PUSHES REPORT: 17.0.10

This report shows who pushed the backports to the given release. This usually shows who did the backporting, testing, and review work.

Report generated: Sat Feb 03 07:09:25 CET 2024

Distribution by priority

Count Priority
2 P1
17 P2
71 P3
195 P4
7 P5

Distribution by components

Count Component
292 100% Total
121 41.4% hotspot
57 19.5% hotspot/runtime
33 11.3% hotspot/compiler
10 3.4% hotspot/gc
7 2.4% hotspot/jfr
6 2.1% hotspot/test
4 1.4% hotspot/svc-agent
2 0.7% hotspot/jvmti
2 0.7% hotspot/svc
42 14.4% core-libs
9 3.1% core-libs/java.net
5 1.7% core-libs/java.io
4 1.4% core-libs/java.nio
3 1.0% core-libs/java.util
3 1.0% core-libs/java.util.logging
3 1.0% core-libs
3 1.0% core-libs/java.lang
3 1.0% core-libs/java.util.jar
2 0.7% core-libs/java.util.concurrent
2 0.7% core-libs/javax.naming
1 0.3% core-libs/java.rmi
1 0.3% core-libs/java.lang.invoke
1 0.3% core-libs/java.lang.module
1 0.3% core-libs/java.lang:reflect
1 0.3% core-libs/java.time
37 12.7% security-libs
15 5.1% security-libs/java.security
13 4.5% security-libs/javax.net.ssl
4 1.4% security-libs/javax.crypto
2 0.7% security-libs/javax.security
2 0.7% security-libs/javax.crypto:pkcs11
1 0.3% security-libs/org.ietf.jgss:krb5
34 11.6% client-libs
13 4.5% client-libs/java.awt
7 2.4% client-libs/2d
6 2.1% client-libs
6 2.1% client-libs/javax.swing
1 0.3% client-libs/javax.sound
1 0.3% client-libs/javax.imageio
21 7.2% infrastructure
18 6.2% infrastructure/build
2 0.7% infrastructure/release_eng
1 0.3% infrastructure
21 7.2% tools
9 3.1% tools/jpackage
6 2.1% tools/javac
2 0.7% tools/javadoc(tool)
2 0.7% tools/jshell
1 0.3% tools/jar
1 0.3% tools
16 5.5% core-svc
5 1.7% core-svc/debugger
3 1.0% core-svc/javax.management
3 1.0% core-svc/java.lang.instrument
3 1.0% core-svc/java.lang.management
2 0.7% core-svc/tools

Distribution by affiliation

This Release Pushes

Original Pushes

Count Committer
292 100% Total
202 69.2% SAP
165 56.5% Goetz Lindenmaier
15 5.1% Matthias Baesken
11 3.8% Christoph Langer
4 1.4% Johannes Bechberger
3 1.0% Martin Doerr
2 0.7% Andrew Lu
2 0.7% Ralf Schmelter
36 12.3% Amazon
20 6.8% Aleksey Shipilev
5 1.7% Roy Soumadipta
4 1.4% Sergey Bylokhov
2 0.7% Chad Rakoczy
1 0.3% Paul Hohensee
1 0.3% Jenny Shivayogi
1 0.3% Elif Aslan
1 0.3% Roman Kennke
1 0.3% Evgeny Astigeevich
17 5.8% Red Hat
8 2.7% Thomas Stuefe
3 1.0% Andrew Hughes
2 0.7% Sonia Zaldana Calles
1 0.3% Martin Balao
1 0.3% Francisco Ferrari Bihurriet
1 0.3% Frederic Thevenet
1 0.3% sxa
14 4.8% Independent
5 1.7% amosshi
3 1.0% Gui Cao
2 0.7% Ilya Gavrilin
1 0.3% 116521601+elifaslan1
1 0.3% Fei Yang
1 0.3% yanglongplus
1 0.3% 36649395+airsquared
7 2.4% Azul
3 1.0% Olga Mikhaltcova
2 0.7% Yuri Nesterenko
1 0.3% Alexey Bakhtin
1 0.3% Roman Marchenko
7 2.4% Rivos
5 1.7% Robbin Ehn
2 0.7% Ludovic Henry
3 1.0% Microsoft
1 0.3% Saint Wesonga
1 0.3% Mat Carter
1 0.3% v-terrychow
1 0.3% BellSoft
1 0.3% Sergey Chernyshev
1 0.3% Fujitsu
1 0.3% Masanori Yano
1 0.3% Huawei
1 0.3% Feilong Jiang
1 0.3% IBM
1 0.3% Deepa Kumari
1 0.3% Intel
1 0.3% Sandhya Viswanathan
1 0.3% Loongson
1 0.3% Qi Ao
Count Committer
292 100% Total
164 56.2% Oracle
16 5.5% Igor Ignatyev
10 3.4% Matthew Donovan
9 3.1% Rajan Halade
8 2.7% Daniel Daugherty
6 2.1% Brian Burkhalter
6 2.1% Leonid Mesnik
5 1.7% Chris Plummer
4 1.4% Alexey Semenyuk
4 1.4% Prasanta Sadhukhan
3 1.0% Harshitha Onkar
3 1.0% Sean Coffey
3 1.0% Kevin Walls
3 1.0% Alexander Zvegintsev
3 1.0% Bill Huang
3 1.0% Coleen Phillimore
3 1.0% Alexey Ivanov
2 0.7% Weijun Wang
2 0.7% Ludvig Janiuk
2 0.7% Darragh Clarke
2 0.7% Mahendra Chhipa
2 0.7% Tobias Holenstein
2 0.7% Daniel Fuchs
2 0.7% Stefan Karlsson
2 0.7% Tobias Hartmann
2 0.7% Alex Menkov
2 0.7% Emanuel Peter
2 0.7% Magnus Ihse Bursie
2 0.7% Erik Gahlin
2 0.7% Daniel Jelinski
2 0.7% Vicente Arturo Romero Zaldivar
2 0.7% Christian Stein
2 0.7% Ioi Lam
2 0.7% Damon Nguyen
2 0.7% Weibing Xiao
2 0.7% Jaikiran Pai
2 0.7% Jonathan Gibbons
2 0.7% Mandy Chung
2 0.7% Alisen Chung
1 0.3% Markus Grönlund
1 0.3% Sibabrata Sahoo
1 0.3% Sean Mullan
1 0.3% Michael McMahon
1 0.3% Yoshiki Sato
1 0.3% Albert Yang
1 0.3% Haimay Chao
1 0.3% Douglas Simon
1 0.3% Leo Korinth
1 0.3% Ajit Ghaisas
1 0.3% Valerie Peng
1 0.3% Anthony Scarpino
1 0.3% naveen.n.narayanan
1 0.3% David Leopoldseder
1 0.3% Rajat Mahajan
1 0.3% Thomas Schatzl
1 0.3% Raffaello Giulietti
1 0.3% Damon Fenacci
1 0.3% Jan Lahoda
1 0.3% Lawrence Andrews
1 0.3% David Holmes
1 0.3% Mikhailo Seledtsov
1 0.3% Lance Andersen
1 0.3% Ravi Gupta
1 0.3% Axel Boldt-Christmas
1 0.3% Matias Saavedra Silva
1 0.3% Christian Hagedorn
1 0.3% daniel.skantz
1 0.3% Philip Race
1 0.3% Serguei Spitsyn
1 0.3% Viktor Klang
30 10.3% SAP
15 5.1% Matthias Baesken
7 2.4% Christoph Langer
2 0.7% Goetz Lindenmaier
2 0.7% Ralf Schmelter
2 0.7% Martin Doerr
2 0.7% Johannes Bechberger
27 9.2% Red Hat
18 6.2% Thomas Stuefe
4 1.4% Roland Westrelin
1 0.3% Martin Balao
1 0.3% Frederic Thevenet
1 0.3% Severin Gehwolf
1 0.3% sxa
1 0.3% Alex Kasko
20 6.8% Amazon
10 3.4% Aleksey Shipilev
5 1.7% Roy Soumadipta
3 1.0% Sergey Bylokhov
1 0.3% Xin Liu
1 0.3% Chad Rakoczy
12 4.1% Independent
4 1.4% Eirik Bjørsnøs
1 0.3% Gui Cao
1 0.3% dpakri181
1 0.3% Daohan Qu
1 0.3% Per Liden
1 0.3% yanglongplus
1 0.3% 36649395+airsquared
1 0.3% Archie Cobbs
1 0.3% Ilya Gavrilin
10 3.4% Rivos
6 2.1% Robbin Ehn
3 1.0% Tony Printezis
1 0.3% Ludovic Henry
6 2.1% Tencent
4 1.4% Xuelei Fan
1 0.3% Peng Xie
1 0.3% Jie Fu
3 1.0% Azul
2 0.7% Olga Mikhaltcova
1 0.3% Yuri Nesterenko
3 1.0% Loongson
2 0.7% Sun Yaqi
1 0.3% Qi Ao
3 1.0% Syntacore
3 1.0% Vladimir Kempik
3 1.0% Unknown
3 1.0% N/A
2 0.7% Google
1 0.3% Man Cao
1 0.3% Liam Miller-Cushon
2 0.7% IBM
1 0.3% Amit Kumar
1 0.3% Toshio Nakamura
2 0.7% Microsoft
1 0.3% Mat Carter
1 0.3% v-terrychow
1 0.3% ARM
1 0.3% Nick Gasson
1 0.3% BellSoft
1 0.3% Sergey Chernyshev
1 0.3% Fujitsu
1 0.3% Takuya Kiriyama
1 0.3% Huawei
1 0.3% Feilong Jiang
1 0.3% Intel
1 0.3% Sandhya Viswanathan

Chronological push log:

UTC Time This Release Push By Original Push By Bug Summary
Name Affiliation Name Affiliation
2024/01/09 22:18 Christoph Langer SAP (same) (same) JDK-8323422 [17u] Remove designator DEFAULT_PROMOTED_VERSION_PRE=ea for release 17.0.10
2024/01/09 15:48 Sergey Bylokhov Amazon Lance Andersen Oracle JDK-8323846 ZipFile::getEntry will not return a file entry when there is a directory entry of the same name within a Zip File
2023/12/15 16:23 Alexey Bakhtin Azul Weijun Wang Oracle JDK-8323842 RSA signature verification fails on signed data that does not encode params correctly
2023/12/15 04:12 Saint Wesonga Microsoft Valerie Peng Oracle JDK-8323841 Allocate BadPaddingException only if it will be thrown
2023/11/30 17:54 Christoph Langer SAP (same) (same) JDK-8321136 ProblemList java/lang/invoke/lambda/LambdaFileEncodingSerialization.java on linux-all
2023/11/28 15:44 Martin Balao Red Hat (same) (same) JDK-8320910 DSA signature length value is not accurate in P11Signature
2023/11/28 14:29 Sonia Zaldana Calles Red Hat Jaikiran Pai Oracle JDK-8320900 ModuleDescriptor.hashCode isn't reproducible across builds
2023/11/28 10:58 Andrew Lu SAP Rajan Halade Oracle JDK-8320875 Add three eMudhra emSign roots
2023/11/28 10:58 Roy Soumadipta Amazon (same) (same) JDK-8320874 Parallelize gc/stress/TestStressRSetCoarsening.java test
2023/11/28 10:57 Francisco Ferrari Bihurriet Red Hat Daniel Jelinski Oracle JDK-8320873 Pre shared key sent under both session_ticket and pre_shared_key extensions
2023/11/28 10:55 Sandhya Viswanathan Intel (same) (same) JDK-8320872 VectorMaskGen clobbers rflags on x86_64
2023/11/23 09:01 Goetz Lindenmaier SAP Bill Huang Oracle JDK-8320643 sun/management/jmxremote/bootstrap/RmiBootstrapTest.java#id1failed with "Agent communication error: java.io.EOFException"
2023/11/23 09:01 Goetz Lindenmaier SAP Bill Huang Oracle JDK-8320642 sun/management/jmxremote/bootstrap/RmiSslNoKeyStoreTest.java failed with "Agent communication error: java.io.EOFException"
2023/11/23 08:47 Christoph Langer SAP Thomas Stuefe Red Hat JDK-8320641 Add regression tests for large page logging and user-facing error messages
2023/11/23 08:46 Christoph Langer SAP Thomas Stuefe Red Hat JDK-8320640 Add user-facing warning if THPs are enabled but cannot be used
2023/11/22 11:59 Martin Doerr SAP (same) (same) JDK-8320593 Top of lock-stack does not match the unlocked object
2023/11/22 08:17 Ludovic Henry Rivos Robbin Ehn Rivos JDK-8320576 RISC-V: __builtin___clear_cache can fail silently.
2023/11/21 13:35 Roman Kennke Amazon Albert Yang Oracle JDK-8320514 Parallel: Use PreservedMarks to record promotion-failed objects
2023/11/21 12:27 Goetz Lindenmaier SAP Weijun Wang Oracle JDK-8320513 Call X509KeyManager.chooseClientAlias once for all key types
2023/11/21 12:18 Goetz Lindenmaier SAP Coleen Phillimore Oracle JDK-8320512 Trivial fixes to btree tests
2023/11/21 12:16 Goetz Lindenmaier SAP Bill Huang Oracle JDK-8320511 Convert test/sun/management/jmxremote/bootstrap shell tests to java version
2023/11/21 11:17 Aleksey Shipilev Amazon (same) (same) JDK-8320510 GHA: Cross-compile gtest code
2023/11/21 11:17 Aleksey Shipilev Amazon Darragh Clarke Oracle JDK-8320509 java/lang/Thread/IsAlive.java timed out
2023/11/21 02:21 Gui Cao Independent Robbin Ehn Rivos JDK-8320451 RISC-V: Remove dependency on libatomic by adding cmpxchg 1b
2023/11/20 15:42 sxa Red Hat (same) (same) JDK-8320424 test/jdk/java/io/File/libGetXSpace.c does not compile on Windows 32-bit
2023/11/20 10:50 Goetz Lindenmaier SAP Rajan Halade Oracle JDK-8320395 Add four DigiCert root certificates
2023/11/20 10:47 Goetz Lindenmaier SAP Prasanta Sadhukhan Oracle JDK-8320394 Timeouts on one macOS 12.6.1 host of two Swing JTableHeader tests
2023/11/20 10:42 Goetz Lindenmaier SAP Mikhailo Seledtsov Oracle JDK-8320387 Add diagnostic logging to VMProps.checkDockerSupport
2023/11/16 10:36 Robbin Ehn Rivos (same) (same) JDK-8320227 RISC-V: Update hwprobe query for new extensions
2023/11/16 08:51 Gui Cao Independent Tony Printezis Rivos JDK-8320226 RISC-V: improve MD5 intrinsic
2023/11/15 07:28 Goetz Lindenmaier SAP Xuelei Fan Tencent JDK-8320154 CheckCleanerBound test fails with PasswordCallback object is not released
2023/11/13 22:03 Goetz Lindenmaier SAP Alex Menkov Oracle JDK-8319989 serviceability/dcmd/framework/VMVersionTest.java fails with Unable to send object throw not established PipeIO Listener Thread connection
2023/11/10 15:18 Andrew Hughes Red Hat Sean Mullan Oracle JDK-8319924 NullPointerException in CertStore.getCRLs after 8297955
2023/11/10 11:07 Robbin Ehn Rivos Ludovic Henry Rivos JDK-8319892 RISC-V: Disable detection of V through HWCAP
2023/11/10 11:07 Robbin Ehn Rivos (same) (same) JDK-8319891 RISC-V: hwprobe query is_set return wrong value
2023/11/10 11:07 Robbin Ehn Rivos (same) (same) JDK-8319890 RISC-V: Add riscv_hwprobe syscall
2023/11/10 02:39 Feilong Jiang Huawei (same) (same) JDK-8319870 RISC-V: Rename *_riscv64.ad files to *_riscv.ad under riscv/gc
2023/11/09 14:55 Goetz Lindenmaier SAP Rajan Halade Oracle JDK-8319819 Add Let's Encrypt ISRG Root X2
2023/11/08 20:53 Goetz Lindenmaier SAP Leo Korinth Oracle JDK-8319752 Fix: make test outputs TEST SUCCESS after unsuccessful exit
2023/11/08 05:40 Sergey Bylokhov Amazon (same) (same) JDK-8319685 javax/print/PrintServiceLookup/FlushCustomClassLoader.java fails to free
2023/11/08 01:01 Sergey Bylokhov Amazon (same) (same) JDK-8319675 PrintServiceLookup spawns 2 threads in the current classloader, getting orphaned
2023/11/07 11:17 Goetz Lindenmaier SAP Leonid Mesnik Oracle JDK-8319625 OutputAnalyzer.shouldMatchByLine() fails in some cases
2023/11/07 11:13 Goetz Lindenmaier SAP Rajan Halade Oracle JDK-8319624 sun/security/pkcs11/sslecc/ClientJSSEServerJSSE.java fails with ProviderException
2023/11/07 11:10 Goetz Lindenmaier SAP Leonid Mesnik Oracle JDK-8319623 Update applications/scimark/Scimark.java to accept VM flags
2023/11/07 10:59 Goetz Lindenmaier SAP Jonathan Gibbons Oracle JDK-8319622 Fix deprecation warnings in DPrinter
2023/11/07 10:56 Goetz Lindenmaier SAP Daniel Daugherty Oracle JDK-8319621 jdk/jfr/api/consumer/streaming/TestJVMCrash.java generates unnecessary core file
2023/11/06 23:40 Johannes Bechberger SAP (same) (same) JDK-8319576 JDWP-agent sends broken exception event with onthrow option
2023/11/06 11:56 Aleksey Shipilev Amazon Emanuel Peter Oracle JDK-8319527 C2: add bailout after assert Bad graph detected in build_loop_late
2023/11/06 07:20 Goetz Lindenmaier SAP Ludvig Janiuk Oracle JDK-8319484 Remove JT_JAVA dead code in jib-profiles.js
2023/11/06 07:17 Goetz Lindenmaier SAP Michael McMahon Oracle JDK-8319475 Code in SendPortZero.java is uncommented even after JDK-8236852 was fixed
2023/11/06 07:15 Goetz Lindenmaier SAP Sun Yaqi Loongson JDK-8319470 java/nio/file/Files/CopyAndMove.java fails when using second test directory
2023/11/06 07:13 Goetz Lindenmaier SAP Alexander Zvegintsev Oracle JDK-8319469 Test "java/awt/print/PrinterJob/ImagePrinting/PrintARGBImage.java" fails because the frames of instruction does not display
2023/11/06 07:11 Goetz Lindenmaier SAP Erik Gahlin Oracle JDK-8319468 2 jdk/jfr/api/consumer/streaming tests failed to attach
2023/11/06 07:09 Goetz Lindenmaier SAP Igor Ignatyev Oracle JDK-8319467 mark hotspot runtime/condy tests which ignore external VM flags
2023/11/06 06:57 Ludovic Henry Rivos Thomas Stuefe Red Hat JDK-8319466 (process) jspawnhelper should not use argv[0]
2023/11/03 12:04 Goetz Lindenmaier SAP N/A Unknown JDK-8319371 Extra file added by mistake during the backport of JDK-8283326
2023/11/03 12:02 Frederic Thevenet Red Hat (same) (same) JDK-8319370 Target OS detection in 'test-prebuilt' makefile target is incorrect when running on MSYS2
2023/11/02 11:08 Gui Cao Independent (same) (same) JDK-8319312 RISC-V: Small refactoring for MacroAssembler::test_bit
2023/11/02 08:17 Matthias Baesken SAP (same) (same) JDK-8319290 relax the builddir check in make/autoconf/basic.m4
2023/11/02 08:03 Matthias Baesken SAP (same) (same) JDK-8319289 Handle WideCharToMultiByte return values
2023/10/30 23:03 v-terrychow Microsoft (same) (same) JDK-8319144 Add KEEPALIVE Extended Socket Options Support for Windows
2023/10/30 10:09 Goetz Lindenmaier SAP N/A Unknown JDK-8319096 [macos] ProblemList java/rmi/registry/multipleRegistries/MultipleRegistries.java
2023/10/30 10:06 Goetz Lindenmaier SAP Thomas Schatzl Oracle JDK-8319094 gc/g1/ihop/TestIHOPStatic.java fails due to extra concurrent mark with -Xcomp
2023/10/30 10:02 Goetz Lindenmaier SAP Prasanta Sadhukhan Oracle JDK-8319092 ProgressMonitorInputStream not large file aware (>2GB)
2023/10/27 11:00 Matthias Baesken SAP (same) (same) JDK-8318970 build using devkit on Linux ppc64le RHEL puts path to devkit into libsplashscreen
2023/10/27 10:55 Matthias Baesken SAP (same) (same) JDK-8318969 src/java.desktop/windows/native/libawt/windows/awt_Robot.cpp GetRGBPixels adjust releasing of resources
2023/10/27 10:53 Matthias Baesken SAP (same) (same) JDK-8318968 Java_java_util_prefs_FileSystemPreferences_lockFile0 write result errno in missing case
2023/10/26 18:23 Goetz Lindenmaier SAP Rajan Halade Oracle JDK-8318933 Add Telia Root CA v2
2023/10/26 18:20 Goetz Lindenmaier SAP Matias Saavedra Silva Oracle JDK-8318932 Allow executeAndLog to accept running process
2023/10/26 18:18 Goetz Lindenmaier SAP Brian Burkhalter Oracle JDK-8318930 Cast from jchar* to char* in test java/io/GetXSpace.java
2023/10/26 18:18 Goetz Lindenmaier SAP Matthias Baesken SAP JDK-8318929 compile error on Alpine with gcc12 after 8298619 in libGetXSpace.c
2023/10/26 18:18 Goetz Lindenmaier SAP Brian Burkhalter Oracle JDK-8318928 java/io/File/GetXSpace.java is failing
2023/10/26 18:18 Goetz Lindenmaier SAP Brian Burkhalter Oracle JDK-8318927 java/io/File/GetXSpace.java fails with "53687091200 != 161051996160"
2023/10/26 18:15 Goetz Lindenmaier SAP Erik Gahlin Oracle JDK-8318926 JFR: TestNetworkUtilizationEvent.java expects 2+ Network interfaces on Linux but finding 1
2023/10/26 18:13 Goetz Lindenmaier SAP Jie Fu Tencent JDK-8318925 compiler/uncommontrap/TestDeoptOOM.java fails with release VMs
2023/10/26 18:13 Goetz Lindenmaier SAP Coleen Phillimore Oracle JDK-8318924 Do not hold ttyLock around stack walking
2023/10/26 18:10 Goetz Lindenmaier SAP Leonid Mesnik Oracle JDK-8318917 serviceability/jvmti/HeapMonitor/MyPackage/HeapMonitorStatObjectCorrectnessTest.java failed with Unexpected high difference percentage
2023/10/26 07:43 Matthias Baesken SAP (same) (same) JDK-8318884 Java_sun_awt_windows_ThemeReader_paintBackground release resources in early returns
2023/10/25 10:35 Matthias Baesken SAP (same) (same) JDK-8318807 increase timeout of sun/security/tools/jarsigner/Warning.java
2023/10/25 08:33 Aleksey Shipilev Amazon Alex Menkov Oracle JDK-8318803 test hprof lib: invalid array element type from JavaValueArray.elementSize
2023/10/25 08:33 Aleksey Shipilev Amazon (same) (same) JDK-8318802 New parentheses warnings after HarfBuzz 7.2.0 update
2023/10/25 08:12 Goetz Lindenmaier SAP Ajit Ghaisas Oracle JDK-8318798 [Testbug] Add back test/jdk/java/awt/Graphics2D/DrawPrimitivesTest.java
2023/10/25 08:09 Goetz Lindenmaier SAP Damon Nguyen Oracle JDK-8318795 [macos] java/awt/Choice/ChoicePopupLocation/ChoicePopupLocation.java fails
2023/10/25 08:03 Goetz Lindenmaier SAP Damon Nguyen Oracle JDK-8318794 [macos] java/awt/Focus/UnaccessibleChoice/AccessibleChoiceTest.java fails
2023/10/25 08:00 Goetz Lindenmaier SAP Chris Plummer Oracle JDK-8318792 [macos-aarch64] SA core file tests failing with sun.jvm.hotspot.oops.UnknownOopException
2023/10/25 07:54 Goetz Lindenmaier SAP Chris Plummer Oracle JDK-8318787 nsk/jdi/ReferenceType/instances/instances002: TestFailure: Unexpected size of referenceType.instances(nsk.share.jdi.TestInterfaceImplementer1): 11, expected: 10
2023/10/25 07:51 Goetz Lindenmaier SAP Per Liden Independent JDK-8318786 ZGC: vmTestbase/gc/gctests/SoftReference/soft004/soft004.java fails with assert(_phases->length() <= 1000) failed: Too many recored phases?
2023/10/25 07:26 Matthias Baesken SAP (same) (same) JDK-8318781 Improve description of NativeLibrary JFR event
2023/10/23 14:56 Goetz Lindenmaier SAP Rajan Halade Oracle JDK-8318666 Tests for AffirmTrust roots
2023/10/23 14:54 Goetz Lindenmaier SAP Rajan Halade Oracle JDK-8318665 Enhance test/jdk/javax/net/ssl/TLSCommon/SSLEngineTestCase.java to handle default cases
2023/10/23 14:50 Goetz Lindenmaier SAP Archie Cobbs Independent JDK-8318664 Create a non static nested class without enclosing class throws VerifyError
2023/10/23 14:48 Goetz Lindenmaier SAP Stefan Karlsson Oracle JDK-8318663 Print count in "Too many recored phases?" assert
2023/10/20 06:35 Matthias Baesken SAP (same) (same) JDK-8318578 Improve assertions in growableArray
2023/10/19 09:15 Deepa Kumari IBM dpakri181 Independent JDK-8318493 [PPC] JcmdScale.java Failing on AIX
2023/10/19 09:10 amosshi Independent Alisen Chung Oracle JDK-8318491 java/awt/Mouse/EnterExitEvents/DragWindowTest.java fails with "No MouseReleased event on label!"
2023/10/18 16:56 Ralf Schmelter SAP (same) (same) JDK-8318461 jdk/jfr/event/runtime/TestShutdown.java fails on Linux ppc64le and Linux aarch64
2023/10/18 07:42 Goetz Lindenmaier SAP Alexander Zvegintsev Oracle JDK-8318413 Open source several choice AWT tests
2023/10/18 07:39 Goetz Lindenmaier SAP Olga Mikhaltcova Azul JDK-8318412 compiler/jvmci/jdk.vm.ci.code.test/src/jdk/vm/ci/code/test/NativeCallTest.java fails after JDK-8262901
2023/10/18 07:39 Goetz Lindenmaier SAP Olga Mikhaltcova Azul JDK-8318411 [macos_aarch64] NativeCallTest expected:<-3.8194101E18> but was:<3.02668882E10>
2023/10/18 06:40 Matthias Baesken SAP (same) (same) JDK-8318396 Do not run sun/tools/jhsdb tests concurrently
2023/10/17 14:13 Olga Mikhaltcova Azul Vladimir Kempik Syntacore JDK-8318307 RISC-V: misaligned memory access in String.Compare intrinsic
2023/10/17 08:32 Aleksey Shipilev Amazon Xin Liu Amazon JDK-8318286 [GHA] get-bootjdk action should return the abolute path
2023/10/17 07:51 Sonia Zaldana Calles Red Hat Ravi Gupta Oracle JDK-8318281 Write a test to check various components send Events while mouse and key are used simultaneously
2023/10/17 07:49 amosshi Independent Eirik Bjørsnøs Independent JDK-8318279 Add test coverage for processing of pending block files in signed JARs
2023/10/17 07:46 amosshi Independent David Holmes Oracle JDK-8318277 Test runtime/jni/nativeStack/ needs to detach the native thread
2023/10/17 07:35 amosshi Independent Eirik Bjørsnøs Independent JDK-8318275 Improve readability of the test JarWithOneNonDisabledDigestAlg
2023/10/17 07:30 amosshi Independent naveen.n.narayanan Oracle JDK-8318274 Write a test to verify setAccelerator method of JMenuItem
2023/10/17 07:16 Matthias Baesken SAP (same) (same) JDK-8318270 use close after failing os::fdopen in vmError and ciEnv
2023/10/17 07:15 Matthias Baesken SAP (same) (same) JDK-8318269 make JDKOPT_CHECK_CODESIGN_PARAMS more verbose
2023/10/17 04:58 Thomas Stuefe Red Hat (same) (same) JDK-8318205 NMT: Make peak values available in release builds
2023/10/16 15:26 Goetz Lindenmaier SAP Prasanta Sadhukhan Oracle JDK-8318173 Test javax/swing/dnd/7171812/bug7171812.java fails with java.lang.RuntimeException: Test failed, scroll on drag doesn't work
2023/10/16 15:20 Goetz Lindenmaier SAP Emanuel Peter Oracle JDK-8318171 Increase buffer size for buf (insert_features_names) in Abstract_VM_Version::insert_features_names
2023/10/12 07:19 Goetz Lindenmaier SAP Chris Plummer Oracle JDK-8317988 Most SA tests are skipped on macosx-aarch64 because all executables are signed
2023/10/12 06:11 Christoph Langer SAP (same) (same) JDK-8317985 ProblemList sun/tools/jstat/jstatLineCountsX.sh on linux-ppc64le and aix due to JDK-8248691
2023/10/12 06:10 Christoph Langer SAP (same) (same) JDK-8317984 Exclude java/awt/Graphics2D/DrawString/RotTransText.java on linux
2023/10/11 14:38 Ilya Gavrilin Independent Tony Printezis Rivos JDK-8317961 RISC-V: use andn / orn in the MD5 instrinsic
2023/10/11 08:40 Goetz Lindenmaier SAP Ludvig Janiuk Oracle JDK-8317885 Clarify TLABWasteTargetPercent flag
2023/10/11 08:35 Goetz Lindenmaier SAP Alexey Semenyuk Oracle JDK-8317884 JPackage app-image exe launches multiple exe's in JDK 17+
2023/10/11 08:32 Goetz Lindenmaier SAP Douglas Simon Oracle JDK-8317883 some JVMCI tests fail when VM options include -XX:+EnableJVMCI
2023/10/11 08:27 Goetz Lindenmaier SAP Chris Plummer Oracle JDK-8317882 JDI AfterThreadDeathTest.java failed due to "FAILED: Did not get expected IllegalThreadStateException on a StepRequest.enable()"
2023/10/11 08:24 Goetz Lindenmaier SAP Axel Boldt-Christmas Oracle JDK-8317880 jdk.test.lib.compiler.InMemoryJavaCompiler.compile does not close files
2023/10/11 08:18 Goetz Lindenmaier SAP Matthew Donovan Oracle JDK-8317877 Harmonize/Standardize the SSLSocket/SSLEngine/SSLSocketSSLEngine test templates
2023/10/11 08:16 Goetz Lindenmaier SAP Alexey Ivanov Oracle JDK-8317876 java/awt/List/ListGarbageCollectionTest/AwtListGarbageCollectionTest.java failed with "List wasn't garbage collected"
2023/10/11 08:03 Goetz Lindenmaier SAP Leonid Mesnik Oracle JDK-8317875 test/hotspot/jtreg/vmTestbase/nsk/jdi/VirtualMachine/dispose/dispose003/TestDescription.java fails
2023/10/11 07:54 Goetz Lindenmaier SAP Xuelei Fan Tencent JDK-8317872 Reorg jdk.test.lib.util.ForceGC
2023/10/11 07:51 Goetz Lindenmaier SAP Leonid Mesnik Oracle JDK-8317871 Refactor NSK/JDI tests to create thread using factory
2023/10/10 19:53 Olga Mikhaltcova Azul Vladimir Kempik Syntacore JDK-8317833 RISC-V: String.indexOf intrinsic may produce misaligned memory loads
2023/10/10 18:22 Goetz Lindenmaier SAP Mandy Chung Oracle JDK-8317830 Bad merge of jdk/test/lib/util/ForceGC.java causing test compilation error
2023/10/10 18:22 Goetz Lindenmaier SAP Mandy Chung Oracle JDK-8317829 Adjust ForceGC to invoke System::gc fewer times for negative case
2023/10/10 18:20 Goetz Lindenmaier SAP Serguei Spitsyn Oracle JDK-8317827 vmTestbase/nsk/jvmti/PopFrame/popframe011 fails with "assert(java_thread == _state->get_thread()) failed: Must be"
2023/10/10 06:44 Jenny Shivayogi Amazon Philip Race Oracle JDK-8317782 ImageIO.read() throws incorrect exception type
2023/10/09 23:48 Mat Carter Microsoft (same) (same) JDK-8317762 SunMSCAPI provider leaks memory and keys
2023/10/09 18:51 Roy Soumadipta Amazon (same) (same) JDK-8317749 Parallelize java/util/concurrent/tck/JSR166TestCase.java
2023/10/09 14:42 Robbin Ehn Rivos (same) (same) JDK-8317739 RISC-V: Zero extended narrow oop passed to Atomic::cmpxchg
2023/10/09 14:30 Goetz Lindenmaier SAP (same) (same) JDK-8318424 [17u] Undo backport 8317674 of 8316566 which was pushed to wrong repo.
2023/10/09 13:34 Goetz Lindenmaier SAP Rajat Mahajan Oracle JDK-8317734 Add JRadioButtonMenuItem to bug8031573.java
2023/10/09 13:32 Goetz Lindenmaier SAP Leonid Mesnik Oracle JDK-8317733 failure handler missed jcmd.vm.info command
2023/10/09 13:29 Goetz Lindenmaier SAP Kevin Walls Oracle JDK-8317732 MemoryPoolMBean/isUsageThresholdExceeded tests failed with "isUsageThresholdExceeded() returned false, and is still false, while threshold = MMMMMMM and used peak = NNNNNNN"
2023/10/08 15:15 Goetz Lindenmaier SAP Matthew Donovan Oracle JDK-8317703 Update EngineCloseOnAlert.java for changes to TLS implementation
2023/10/08 13:53 Olga Mikhaltcova Azul Vladimir Kempik Syntacore JDK-8317702 RISC-V: jdk uses misaligned memory access when AvoidUnalignedAccess enabled
2023/10/07 08:21 Goetz Lindenmaier SAP Viktor Klang Oracle JDK-8317694 java/util/concurrent/ScheduledThreadPoolExecutor/BasicCancelTest.java timed out and also had jcmd pipe errors
2023/10/06 16:50 Goetz Lindenmaier SAP Prasanta Sadhukhan Oracle JDK-8317682 Open source few swing text/html tests
2023/10/06 16:47 Goetz Lindenmaier SAP David Leopoldseder Oracle JDK-8317681 [JVMCI] compiler/unsafe/UnsafeGetStableArrayElement test asserts wrong values with Graal
2023/10/06 16:42 Goetz Lindenmaier SAP Brian Burkhalter Oracle JDK-8317680 (fs) java/nio/file/FileStore/Basic.java fails with java.lang.RuntimeException: values differ by more than 1GB
2023/10/06 16:38 Goetz Lindenmaier SAP Daniel Fuchs Oracle JDK-8317679 java/net/httpclient/HandshakeFailureTest.java failed with "RuntimeException: Not found expected SSLHandshakeException in java.io.IOException"
2023/10/06 07:32 Goetz Lindenmaier SAP Roland Westrelin Red Hat JDK-8317654 C2: assert(u->find_out_with(Op_AddP) == nullptr) failed: more than 2 chained AddP nodes?
2023/10/06 07:31 Christoph Langer SAP (same) (same) JDK-8318433 [17u] Remove designator DEFAULT_PROMOTED_VERSION_PRE=ea for release 17.0.9
2023/10/06 07:29 Goetz Lindenmaier SAP Roland Westrelin Red Hat JDK-8317652 assert(cast != nullptr) failed: must have added a cast to pin the node
2023/10/06 07:16 Goetz Lindenmaier SAP Roland Westrelin Red Hat JDK-8317651 Massive (up to ~30x) increase in C2 compilation time since JDK 17
2023/10/06 07:12 Goetz Lindenmaier SAP daniel.skantz Oracle JDK-8317650 C1: ShortLoopOptimizer might lift instructions before their inputs
2023/10/06 07:10 Goetz Lindenmaier SAP Stefan Karlsson Oracle JDK-8317649 TestStringDeduplicationInterned.java fails because extra deduplication
2023/10/06 07:04 Goetz Lindenmaier SAP Jaikiran Pai Oracle JDK-8317648 java/util/zip/DeInflate.java timed out
2023/10/06 06:43 Goetz Lindenmaier SAP Vicente Arturo Romero Zaldivar Oracle JDK-8317647 comments in TestTypeAnnotations still refer to resolved JDK-8068737
2023/10/06 06:43 Goetz Lindenmaier SAP Yoshiki Sato Oracle JDK-8317646 NPE in javazic compiler
2023/10/06 06:41 Goetz Lindenmaier SAP Thomas Stuefe Red Hat JDK-8317645 NMT: count deltas are printed with 32-bit signed size
2023/10/05 18:30 Goetz Lindenmaier SAP Daniel Daugherty Oracle JDK-8317619 adjust timeouts in three more M&M tests
2023/10/05 18:30 Goetz Lindenmaier SAP Daniel Daugherty Oracle JDK-8317618 increase timeout for ContinuousCallSiteTargetChange.java
2023/10/05 18:30 Goetz Lindenmaier SAP Daniel Daugherty Oracle JDK-8317617 adjust timeout for JLI GetObjectSizeIntrinsicsTest.java subtest again
2023/10/05 18:26 Goetz Lindenmaier SAP Matthew Donovan Oracle JDK-8317615 Update CheckStatus.java for changes to TLS implementation
2023/10/05 18:24 Goetz Lindenmaier SAP Matthew Donovan Oracle JDK-8317614 Update TestAllSuites.java for TLS v1.2 and 1.3
2023/10/05 13:02 Christoph Langer SAP (same) (same) JDK-8317598 Exclude java/awt/font/Rotate/RotatedTextTest.java
2023/10/04 21:07 Roy Soumadipta Amazon (same) (same) JDK-8317556 Enable parallelism in vmTestbase/nsk/stress/numeric tests
2023/10/04 19:39 Goetz Lindenmaier SAP Thomas Stuefe Red Hat JDK-8317541 NMT: Display peak values
2023/10/04 19:22 Goetz Lindenmaier SAP Thomas Stuefe Red Hat JDK-8317540 NMT: repurpose Tracking overhead counter as global malloc counter
2023/10/04 19:07 Goetz Lindenmaier SAP Thomas Stuefe Red Hat JDK-8317539 Further simplify NMT backend
2023/10/04 17:59 Roy Soumadipta Amazon (same) (same) JDK-8317536 Parallelize gc/stress/TestStressIHOPMultiThread.java test
2023/10/04 12:37 Aleksey Shipilev Amazon (same) (same) JDK-8317513 Better diagnostic header for VtableStub
2023/10/04 12:32 Fei Yang Independent Ilya Gavrilin Independent JDK-8317512 RISC-V: Change UseVectorizedMismatchIntrinsic option result to warning
2023/10/03 20:43 Goetz Lindenmaier SAP Daniel Daugherty Oracle JDK-8317465 disable TestRedirectLinks.java in slowdebug mode
2023/10/03 20:43 Goetz Lindenmaier SAP Daniel Daugherty Oracle JDK-8317464 adjust timeout for another JLI GetObjectSizeIntrinsicsTest.java subtest
2023/10/03 20:31 Goetz Lindenmaier SAP Amit Kumar IBM JDK-8317463 java/util/zip/Deinflate.java failing on s390x
2023/10/03 20:28 Goetz Lindenmaier SAP Matthew Donovan Oracle JDK-8317462 Update ConnectionTest.java for changes to TLS implementation
2023/10/03 20:25 Goetz Lindenmaier SAP Matthew Donovan Oracle JDK-8317461 validate-source fails after JDK-8298873
2023/10/03 20:25 Goetz Lindenmaier SAP Matthew Donovan Oracle JDK-8317460 Update IllegalRecordVersion.java for changes to TLS implementation
2023/10/03 20:19 Goetz Lindenmaier SAP Kevin Walls Oracle JDK-8317459 MemoryPoolMBean/isUsageThresholdExceeded/isexceeded001/TestDescription.java still failing
2023/10/03 20:15 Goetz Lindenmaier SAP Igor Ignatyev Oracle JDK-8317458 mark hotspot runtime/CDSCompressedKPtrs tests which ignore external VM flags
2023/10/03 20:06 Goetz Lindenmaier SAP Igor Ignatyev Oracle JDK-8317456 mark hotspot runtime/classFileParserBug tests which ignore external VM flags
2023/10/03 19:54 Goetz Lindenmaier SAP Igor Ignatyev Oracle JDK-8317454 mark hotspot runtime/Throwable tests which ignore external VM flags
2023/09/29 09:54 Goetz Lindenmaier SAP Thomas Stuefe Red Hat JDK-8317304 NMT incurs costs if disabled
2023/09/28 16:15 Andrew Hughes Red Hat Rajan Halade Oracle JDK-8317260 Framework for CA interoperability testing
2023/09/28 14:03 Goetz Lindenmaier SAP Matthew Donovan Oracle JDK-8317251 Basics.java fails with SSL handshake exception
2023/09/28 14:00 Goetz Lindenmaier SAP Thomas Stuefe Red Hat JDK-8317249 Dcmd VM.classloaders fails to print the full hierarchy
2023/09/28 13:58 Goetz Lindenmaier SAP Thomas Stuefe Red Hat JDK-8317248 gtest os.release_multi_mappings_vm is still racy
2023/09/28 12:00 Yuri Nesterenko Azul (same) (same) JDK-8318432 Exclude cleaner test failing on older releases
2023/09/28 11:43 Matthias Baesken SAP (same) (same) JDK-8317239 test tools/jpackage/share/RuntimePackageTest.java#id0 fails on RHEL8
2023/09/28 10:06 Johannes Bechberger SAP Eirik Bjørsnøs Independent JDK-8317232 build-test-lib target is broken
2023/09/28 10:06 Johannes Bechberger SAP Peng Xie Tencent JDK-8317231 make build-test-lib is broken
2023/09/28 10:06 Johannes Bechberger SAP (same) (same) JDK-8317230 build-test-lib is broken
2023/09/28 09:20 Ralf Schmelter SAP (same) (same) JDK-8317226 JfrStructCopyFailed uses heap words instead of bytes for object sizes
2023/09/28 09:07 Aleksey Shipilev Amazon (same) (same) JDK-8317224 JMH benchmarks for Fences
2023/09/28 09:06 Aleksey Shipilev Amazon Eirik Bjørsnøs Independent JDK-8317223 Add curl support to createJMHBundle.sh
2023/09/27 17:04 Ilya Gavrilin Independent Tony Printezis Rivos JDK-8317118 RISC-V: implement MD5 intrinsic
2023/09/27 09:26 Andrew Lu SAP Jan Lahoda Oracle JDK-8317037 Verify 4th party information in src/jdk.internal.le/share/legal/jline.md
2023/09/27 08:19 Goetz Lindenmaier SAP Alexey Ivanov Oracle JDK-8317030 Test StretchedFontTest.java fails for Baekmuk font
2023/09/27 08:17 Goetz Lindenmaier SAP Daniel Jelinski Oracle JDK-8317029 Remove delays from httpserver tests
2023/09/27 08:15 Goetz Lindenmaier SAP Alexey Semenyuk Oracle JDK-8317028 Some tools/jpackage/windows/* tests fails with jtreg test timeout
2023/09/27 08:10 Goetz Lindenmaier SAP Matthew Donovan Oracle JDK-8317027 5 javax/net/ssl/SSLEngine tests use @ignore w/o bug-id
2023/09/27 08:05 Goetz Lindenmaier SAP Matthew Donovan Oracle JDK-8317024 Timeout with DTLSOverDatagram test template
2023/09/27 08:02 Goetz Lindenmaier SAP Daniel Daugherty Oracle JDK-8317023 adjust timeouts in JLI GetObjectSizeIntrinsicsTest.java
2023/09/27 08:00 Goetz Lindenmaier SAP Alex Kasko Red Hat JDK-8317021 jpackage: test MSI installation fix
2023/09/27 07:56 Goetz Lindenmaier SAP Aleksey Shipilev Amazon JDK-8317020 Drop --enable-preview from instanceof pattern matching related tests
2023/09/27 07:54 Goetz Lindenmaier SAP Aleksey Shipilev Amazon JDK-8317018 Drop --enable-preview from Record related tests
2023/09/27 07:52 Goetz Lindenmaier SAP Alexey Semenyuk Oracle JDK-8317017 test/jdk/tools/jpackage/windows/WinL10nTest.java test fails if light.exe is not in %PATH%
2023/09/27 07:50 Goetz Lindenmaier SAP Alexey Semenyuk Oracle JDK-8317016 Can't unpack msi installers from test/jdk/tools/jpackage/windows/test/jdk/tools/jpackage/windows/WinShortcutPromptTest.java test
2023/09/27 07:44 Goetz Lindenmaier SAP Thomas Stuefe Red Hat JDK-8317015 Remove VirtualSpaceList::is_full()
2023/09/27 07:42 Goetz Lindenmaier SAP Jonathan Gibbons Oracle JDK-8317013 Test man page that options are documented
2023/09/27 07:36 Goetz Lindenmaier SAP Igor Ignatyev Oracle JDK-8317010 mark hotspot runtime/logging tests which ignore external VM flags
2023/09/27 07:30 Goetz Lindenmaier SAP Igor Ignatyev Oracle JDK-8317008 mark hotspot runtime/cds tests which ignore external VM flags
2023/09/27 07:00 Matthias Baesken SAP Sun Yaqi Loongson JDK-8317004 When multiple users run tools/jpackage/share/LicenseTest.java, Permission denied for writing /var/tmp/*.files
2023/09/26 14:39 Roy Soumadipta Amazon (same) (same) JDK-8316962 serviceability/sa/TestJmapCoreMetaspace.java should run with -XX:-VerifyDependencies
2023/09/26 06:45 Goetz Lindenmaier SAP Igor Ignatyev Oracle JDK-8316934 mark hotspot runtime/PrintStringTableStats/PrintStringTableStatsTest.java test as ignoring external VM flags
2023/09/25 12:13 Goetz Lindenmaier SAP Daniel Fuchs Oracle JDK-8316889 java/net/httpclient/SpecialHeadersTest.java fails with "ERROR: Shutting down connection: HTTP/2 client stopped"
2023/09/25 12:10 Goetz Lindenmaier SAP Brian Burkhalter Oracle JDK-8316888 (fs) Print size values in java/nio/file/FileStore/Basic.java when they differ by > 1GiB
2023/09/25 12:08 Goetz Lindenmaier SAP Sibabrata Sahoo Oracle JDK-8316887 Add a new test library API to execute kinit in SecurityTools.java
2023/09/25 11:48 Goetz Lindenmaier SAP Lawrence Andrews Oracle JDK-8316884 Convert applet manual tests SelectionVisible.java to Frame and automate
2023/09/25 11:46 Goetz Lindenmaier SAP Aleksey Shipilev Amazon JDK-8316883 Drop --enable-preview from Sealed Classes related tests
2023/09/25 09:31 Goetz Lindenmaier SAP Alisen Chung Oracle JDK-8316875 DnD test DisposeFrameOnDragTest.java does not clean up
2023/09/25 09:29 Goetz Lindenmaier SAP Ioi Lam Oracle JDK-8316874 Improve testing with VM option VerifyArchivedFields
2023/09/25 09:27 Goetz Lindenmaier SAP Igor Ignatyev Oracle JDK-8316873 mark hotspot runtime/modules tests which ignore external VM flags
2023/09/25 09:25 Goetz Lindenmaier SAP Igor Ignatyev Oracle JDK-8316872 mark hotspot runtime/Monitor tests which ignore external VM flags
2023/09/25 09:23 Goetz Lindenmaier SAP Igor Ignatyev Oracle JDK-8316871 mark hotspot runtime/ClassFile tests which ignore external VM flags
2023/09/25 09:17 Goetz Lindenmaier SAP Igor Ignatyev Oracle JDK-8316870 mark hotspot runtime/Metaspace tests which ignore external VM flags
2023/09/25 09:15 Goetz Lindenmaier SAP Igor Ignatyev Oracle JDK-8316869 mark hotspot runtime/PerfMemDestroy/PerfMemDestroy.java test as ignoring external VM flags
2023/09/25 06:34 Masanori Yano Fujitsu Takuya Kiriyama Fujitsu JDK-8316809 tools/jpackage/share/jdk/jpackage/tests/UnicodeArgsTest.java fails on Japanese Windows platform
2023/09/22 18:13 116521601+elifaslan1 Independent Tobias Holenstein Oracle JDK-8316760 The value of full_count in the message of insufficient codecache is wrong
2023/09/22 15:48 Aleksey Shipilev Amazon (same) (same) JDK-8316753 Better diagnostic header for CodeBlobs
2023/09/22 15:48 Aleksey Shipilev Amazon Liam Miller-Cushon Google JDK-8316752 ArithmeticException in GaloisCounterMode
2023/09/22 08:18 Goetz Lindenmaier SAP Sean Coffey Oracle JDK-8316733 Test SignedLoggerFinderTest.java is still failing
2023/09/22 08:18 Goetz Lindenmaier SAP Sean Coffey Oracle JDK-8316732 SignedLoggerFinderTest.java test failed
2023/09/22 08:18 Goetz Lindenmaier SAP Sean Coffey Oracle JDK-8316731 Signed jars triggering Logger finder recursion and StackOverflowError
2023/09/22 08:16 Goetz Lindenmaier SAP Brian Burkhalter Oracle JDK-8316730 (dc) Problem listing of java/nio/channels/DatagramChannel/Unref.java has incorrect issue ID
2023/09/22 08:13 Goetz Lindenmaier SAP Alexander Zvegintsev Oracle JDK-8316729 Regression automated test '/open/test/jdk/java/awt/TrayIcon/SystemTrayInstance/SystemTrayInstanceTest.java' fails
2023/09/22 08:11 Goetz Lindenmaier SAP Igor Ignatyev Oracle JDK-8316728 mark hotspot runtime/Safepoint tests which ignore external VM flags
2023/09/22 08:08 Goetz Lindenmaier SAP Igor Ignatyev Oracle JDK-8316727 mark hotspot runtime/Dictionary tests which ignore external VM flags
2023/09/22 08:06 Goetz Lindenmaier SAP Igor Ignatyev Oracle JDK-8316726 mark hotspot runtime/CompressedOops tests which ignore external VM flags
2023/09/22 07:42 Goetz Lindenmaier SAP Weibing Xiao Oracle JDK-8316723 The socket is not closed in Connection::createSocket when the handshake failed for LDAP connection
2023/09/22 07:40 Goetz Lindenmaier SAP Harshitha Onkar Oracle JDK-8316722 [windows] Actual and Preferred Size of AWT Non-resizable frame are different
2023/09/22 07:36 Goetz Lindenmaier SAP Ioi Lam Oracle JDK-8316721 Rename test property vm.cds.archived.java.heap to vm.cds.write.archived.java.heap
2023/09/20 19:59 Elif Aslan Amazon Daohan Qu Independent JDK-8316625 Incorrect regex in TestMetaSpaceLog.java
2023/09/20 15:40 Chad Rakoczy Amazon (same) (same) JDK-8316611 C1: Uninitialized PhiResolver::_loop field
2023/09/20 13:58 Aleksey Shipilev Amazon Christian Stein Oracle JDK-8316600 [GHA] Update checkout action to use v4
2023/09/20 10:24 Sergey Chernyshev BellSoft Sergey Chernyshev BellSoft JDK-8316589 Memory leak in JceSecurity
2023/09/20 07:24 Goetz Lindenmaier SAP Chris Plummer Oracle JDK-8316577 SA fails to properly attach to JVM after having just detached from a different JVM
2023/09/20 07:22 Goetz Lindenmaier SAP Weibing Xiao Oracle JDK-8316576 com.sun.jndi.ldap.Connection.cleanup does not close connections on SocketTimeoutErrors
2023/09/20 07:19 Goetz Lindenmaier SAP N/A Unknown JDK-8316575 Check boxes and radio buttons have rendering issues on Windows in High DPI env
2023/09/20 07:16 Goetz Lindenmaier SAP Harshitha Onkar Oracle JDK-8316574 Make AwtFramePackTest generic by removing @requires tag
2023/09/20 07:16 Goetz Lindenmaier SAP Harshitha Onkar Oracle JDK-8316573 [windows] last button is not shown in AWT Frame with BorderLayout and MenuBar set.
2023/09/20 07:14 Goetz Lindenmaier SAP Mahendra Chhipa Oracle JDK-8316572 sun/net/www/protocol/https/HttpsURLConnection/B6216082.java fails with "SocketException: Unexpected end of file from server"
2023/09/20 07:14 Goetz Lindenmaier SAP Mahendra Chhipa Oracle JDK-8316571 Update java/net tests to eliminate dependency on sun.net.www.MessageHeader and some other internal APIs
2023/09/20 07:12 Goetz Lindenmaier SAP Christian Hagedorn Oracle JDK-8316570 [IR Framework] Add missing compilation level restriction when using FlipC1C2 stress option
2023/09/20 07:10 Goetz Lindenmaier SAP Nick Gasson ARM JDK-8316569 [aarch64] NullPointerException during stack walking (clhsdb "where -a")
2023/09/15 15:03 yanglongplus Independent (same) (same) JDK-8312065 Socket.connect does not timeout when profiling
2023/09/15 14:17 Goetz Lindenmaier SAP Tobias Hartmann Oracle JDK-8316368 C1 should not inline through interface calls with non-subtype receiver
2023/09/15 14:14 Goetz Lindenmaier SAP Tobias Hartmann Oracle JDK-8316366 Failure during CompileOnly parsing leads to ShouldNotReachHere
2023/09/15 14:12 Goetz Lindenmaier SAP Damon Fenacci Oracle JDK-8316365 SegmentedCodeCache fails when using large pages
2023/09/15 14:10 Goetz Lindenmaier SAP Anthony Scarpino Oracle JDK-8316364 ECKeySizeParameterSpec causes too many exceptions on third party providers
2023/09/15 14:08 Goetz Lindenmaier SAP Kevin Walls Oracle JDK-8316362 Handle control characters in java_lang_String::print
2023/09/15 10:47 Goetz Lindenmaier SAP Alexey Ivanov Oracle JDK-8316597 Ideographic characters aren't stretched by AffineTransform.scale(2, 1)
2023/09/15 10:42 Goetz Lindenmaier SAP Toshio Nakamura IBM JDK-8316351 Unexpected round errors in FreetypeFontScaler
2023/09/15 10:40 Goetz Lindenmaier SAP Vicente Arturo Romero Zaldivar Oracle JDK-8316349 Javac inferred type does not conform to equality constraint
2023/09/15 07:45 Qi Ao Loongson (same) (same) JDK-8316338 The macro definition for LoongArch64 zero build is not accurate.
2023/09/14 15:34 Christoph Langer SAP (same) (same) JDK-8316301 java/lang/ProcessHandle/InfoTest.java fails on Windows when run as user with Administrator privileges
2023/09/14 07:23 Matthias Baesken SAP (same) (same) JDK-8316269 RandomTestBsi1999 fails often with timeouts on Linux ppc64le
2023/09/14 05:38 Goetz Lindenmaier SAP Darragh Clarke Oracle JDK-8316247 java/net/DatagramSocket/DatagramSocketMulticasting.java should be hardened
2023/09/13 21:03 Chad Rakoczy Amazon Xuelei Fan Tencent JDK-8316224 clearPassword should be called in a finally try block
2023/09/13 21:02 Evgeny Astigeevich Amazon Coleen Phillimore Oracle JDK-8316223 compiler/codecache/cli tests failing when SegmentedCodeCache used with -Xint
2023/09/13 13:36 Christoph Langer SAP Thomas Stuefe Red Hat JDK-8316194 Test serviceability/dcmd/vm/TrimLibcHeapTest.java failed: RSS use increased
2023/09/12 13:17 36649395+airsquared Independent (same) (same) JDK-8316120 jpackage does not work for module projects unless --module-path is specified
2023/09/11 13:54 Aleksey Shipilev Amazon (same) (same) JDK-8316014 CITime misreports code/total nmethod sizes
2023/09/11 13:53 Aleksey Shipilev Amazon Markus Grönlund Oracle JDK-8316013 fatal error: Possible safepoint reached by thread that does not allow it
2023/09/11 10:47 Aleksey Shipilev Amazon Igor Ignatyev Oracle JDK-8315994 mark hotspot runtime/InvocationTests tests which ignore external VM flags
2023/09/07 14:11 Roman Marchenko Azul Roland Westrelin Red Hat JDK-8315861 SIGSEGV in PhaseIdealLoop::build_loop_late_post_work due to bad immediate dominator info
2023/09/07 13:20 Paul Hohensee Amazon Raffaello Giulietti Oracle JDK-8315858 Formatter.format might take a long time to format an integer or floating-point
2023/09/05 16:45 Martin Doerr SAP (same) (same) JDK-8315837 C1 compilation crashes in LinearScan::resolve_exception_edge
2023/09/05 14:17 Aleksey Shipilev Amazon Christian Stein Oracle JDK-8315697 Update to use jtreg 7.3.1
2023/09/04 12:16 Christoph Langer SAP Daniel Daugherty Oracle JDK-8315642 jdk/jshell/JdiHangingLaunchExecutionControlTest.java - launch timeout
2023/09/02 08:15 Martin Doerr SAP Rajan Halade Oracle JDK-8315836 Add Certigna Root CA - 2
2023/09/01 15:53 Andrew Hughes Red Hat Haimay Chao Oracle JDK-8315551 Increase jdk.jar.maxSignatureFileSize default which is too low for JARs such as WhiteSource/Mend unified agent jar
2023/08/31 15:05 Thomas Stuefe Red Hat Man Cao Google JDK-8315471 TEST_BUG: runtime/os/THPsInThreadStackPreventionTest.java could fail on machine with large number of cores
2023/08/31 14:43 Aleksey Shipilev Amazon Tobias Holenstein Oracle JDK-8315466 C2 crash due to unexpected exception control flow
2023/08/31 14:03 Aleksey Shipilev Amazon Severin Gehwolf Red Hat JDK-8315463 make test TEST="gtest:" exits with error when it shouldn't
2023/08/31 11:50 Thomas Stuefe Red Hat Aleksey Shipilev Amazon JDK-8315453 Rename DisableTHPStackMitigation flag to THPStackMitigation
2023/08/31 04:54 Thomas Stuefe Red Hat (same) (same) JDK-8315433 WSL Linux build crashes after JDK-8310233
2023/08/31 04:15 Sergey Bylokhov Amazon (same) (same) JDK-8315429 MidiSystem.getSoundbank() throws unexpected SecurityException
2023/08/30 17:59 Thomas Stuefe Red Hat (same) (same) JDK-8315397 JDK-8303215 is incomplete
2023/08/30 17:59 Thomas Stuefe Red Hat (same) (same) JDK-8315396 THPs cause huge RSS due to thread start timing issue
2023/08/30 17:56 Thomas Stuefe Red Hat (same) (same) JDK-8315394 [linux] SIGSEGV if kernel was built without hugepage support
2023/08/30 15:57 Aleksey Shipilev Amazon Magnus Ihse Bursie Oracle JDK-8315381 Try to verify gtest version
2023/08/30 09:13 Thomas Stuefe Red Hat (same) (same) JDK-8315349 Fix THP detection on Linux
2023/08/30 08:52 Aleksey Shipilev Amazon Magnus Ihse Bursie Oracle JDK-8315346 Clean up checking of testing requirements in configure
2023/08/30 07:56 Goetz Lindenmaier SAP (same) (same) JDK-8312974 Bump update version for OpenJDK: jdk-17.0.10
2022/04/28 02:48 Yuri Nesterenko Azul Xuelei Fan Tencent JDK-8318430 Buffer clean in PasswordCallback

No changesets log

Committer push log

116521601+elifaslan1, Independent

Bug Summary
JDK-8316760 The value of full_count in the message of insufficient codecache is wrong

36649395+airsquared, Independent

Bug Summary
JDK-8316120 jpackage does not work for module projects unless --module-path is specified

Alexey Bakhtin, Azul

Bug Summary
JDK-8323842 RSA signature verification fails on signed data that does not encode params correctly

amosshi, Independent

Bug Summary
JDK-8318279 Add test coverage for processing of pending block files in signed JARs
JDK-8318275 Improve readability of the test JarWithOneNonDisabledDigestAlg
JDK-8318491 java/awt/Mouse/EnterExitEvents/DragWindowTest.java fails with "No MouseReleased event on label!"
JDK-8318277 Test runtime/jni/nativeStack/ needs to detach the native thread
JDK-8318274 Write a test to verify setAccelerator method of JMenuItem

Andrew Hughes, Red Hat

Bug Summary
JDK-8317260 Framework for CA interoperability testing
JDK-8315551 Increase jdk.jar.maxSignatureFileSize default which is too low for JARs such as WhiteSource/Mend unified agent jar
JDK-8319924 NullPointerException in CertStore.getCRLs after 8297955

Andrew Lu, SAP

Bug Summary
JDK-8320875 Add three eMudhra emSign roots
JDK-8317037 Verify 4th party information in src/jdk.internal.le/share/legal/jline.md

Qi Ao, Loongson

Bug Summary
JDK-8316338 The macro definition for LoongArch64 zero build is not accurate.

Chad Rakoczy, Amazon

Bug Summary
JDK-8316611 C1: Uninitialized PhiResolver::_loop field
JDK-8316224 clearPassword should be called in a finally try block

Christoph Langer, SAP

Bug Summary
JDK-8323422 [17u] Remove designator DEFAULT_PROMOTED_VERSION_PRE=ea for release 17.0.10

Christoph Langer, SAP

Bug Summary
JDK-8318433 [17u] Remove designator DEFAULT_PROMOTED_VERSION_PRE=ea for release 17.0.9
JDK-8320641 Add regression tests for large page logging and user-facing error messages
JDK-8320640 Add user-facing warning if THPs are enabled but cannot be used
JDK-8317598 Exclude java/awt/font/Rotate/RotatedTextTest.java
JDK-8317984 Exclude java/awt/Graphics2D/DrawString/RotTransText.java on linux
JDK-8316301 java/lang/ProcessHandle/InfoTest.java fails on Windows when run as user with Administrator privileges
JDK-8315642 jdk/jshell/JdiHangingLaunchExecutionControlTest.java - launch timeout
JDK-8321136 ProblemList java/lang/invoke/lambda/LambdaFileEncodingSerialization.java on linux-all
JDK-8317985 ProblemList sun/tools/jstat/jstatLineCountsX.sh on linux-ppc64le and aix due to JDK-8248691
JDK-8316194 Test serviceability/dcmd/vm/TrimLibcHeapTest.java failed: RSS use increased

Deepa Kumari, IBM

Bug Summary
JDK-8318493 [PPC] JcmdScale.java Failing on AIX

Evgeny Astigeevich, Amazon

Bug Summary
JDK-8316223 compiler/codecache/cli tests failing when SegmentedCodeCache used with -Xint

Elif Aslan, Amazon

Bug Summary
JDK-8316625 Incorrect regex in TestMetaSpaceLog.java

Francisco Ferrari Bihurriet, Red Hat

Bug Summary
JDK-8320873 Pre shared key sent under both session_ticket and pre_shared_key extensions

Feilong Jiang, Huawei

Bug Summary
JDK-8319870 RISC-V: Rename *_riscv64.ad files to *_riscv.ad under riscv/gc

Frederic Thevenet, Red Hat

Bug Summary
JDK-8319370 Target OS detection in 'test-prebuilt' makefile target is incorrect when running on MSYS2

Fei Yang, Independent

Bug Summary
JDK-8317512 RISC-V: Change UseVectorizedMismatchIntrinsic option result to warning

Gui Cao, Independent

Bug Summary
JDK-8320226 RISC-V: improve MD5 intrinsic
JDK-8320451 RISC-V: Remove dependency on libatomic by adding cmpxchg 1b
JDK-8319312 RISC-V: Small refactoring for MacroAssembler::test_bit

Goetz Lindenmaier, SAP

Bug Summary
JDK-8316730 (dc) Problem listing of java/nio/channels/DatagramChannel/Unref.java has incorrect issue ID
JDK-8317680 (fs) java/nio/file/FileStore/Basic.java fails with java.lang.RuntimeException: values differ by more than 1GB
JDK-8316888 (fs) Print size values in java/nio/file/FileStore/Basic.java when they differ by > 1GiB
JDK-8319468 2 jdk/jfr/api/consumer/streaming tests failed to attach
JDK-8317027 5 javax/net/ssl/SSLEngine tests use @ignore w/o bug-id
JDK-8318424 [17u] Undo backport 8317674 of 8316566 which was pushed to wrong repo.
JDK-8316569 [aarch64] NullPointerException during stack walking (clhsdb "where -a")
JDK-8316570 [IR Framework] Add missing compilation level restriction when using FlipC1C2 stress option
JDK-8317681 [JVMCI] compiler/unsafe/UnsafeGetStableArrayElement test asserts wrong values with Graal
JDK-8318792 [macos-aarch64] SA core file tests failing with sun.jvm.hotspot.oops.UnknownOopException
JDK-8318795 [macos] java/awt/Choice/ChoicePopupLocation/ChoicePopupLocation.java fails
JDK-8318794 [macos] java/awt/Focus/UnaccessibleChoice/AccessibleChoiceTest.java fails
JDK-8319096 [macos] ProblemList java/rmi/registry/multipleRegistries/MultipleRegistries.java
JDK-8318411 [macos_aarch64] NativeCallTest expected:<-3.8194101E18> but was:<3.02668882E10>
JDK-8318798 [Testbug] Add back test/jdk/java/awt/Graphics2D/DrawPrimitivesTest.java
JDK-8316722 [windows] Actual and Preferred Size of AWT Non-resizable frame are different
JDK-8316573 [windows] last button is not shown in AWT Frame with BorderLayout and MenuBar set.
JDK-8316887 Add a new test library API to execute kinit in SecurityTools.java
JDK-8320387 Add diagnostic logging to VMProps.checkDockerSupport
JDK-8320395 Add four DigiCert root certificates
JDK-8317734 Add JRadioButtonMenuItem to bug8031573.java
JDK-8319819 Add Let's Encrypt ISRG Root X2
JDK-8318933 Add Telia Root CA v2
JDK-8317829 Adjust ForceGC to invoke System::gc fewer times for negative case
JDK-8317464 adjust timeout for another JLI GetObjectSizeIntrinsicsTest.java subtest
JDK-8317617 adjust timeout for JLI GetObjectSizeIntrinsicsTest.java subtest again
JDK-8317023 adjust timeouts in JLI GetObjectSizeIntrinsicsTest.java
JDK-8317619 adjust timeouts in three more M&M tests
JDK-8318932 Allow executeAndLog to accept running process
JDK-8317652 assert(cast != nullptr) failed: must have added a cast to pin the node
JDK-8317830 Bad merge of jdk/test/lib/util/ForceGC.java causing test compilation error
JDK-8317251 Basics.java fails with SSL handshake exception
JDK-8312974 Bump update version for OpenJDK: jdk-17.0.10
JDK-8316368 C1 should not inline through interface calls with non-subtype receiver
JDK-8317650 C1: ShortLoopOptimizer might lift instructions before their inputs
JDK-8317654 C2: assert(u->find_out_with(Op_AddP) == nullptr) failed: more than 2 chained AddP nodes?
JDK-8320513 Call X509KeyManager.chooseClientAlias once for all key types
JDK-8317016 Can't unpack msi installers from test/jdk/tools/jpackage/windows/test/jdk/tools/jpackage/windows/WinShortcutPromptTest.java test
JDK-8318930 Cast from jchar* to char* in test java/io/GetXSpace.java
JDK-8316575 Check boxes and radio buttons have rendering issues on Windows in High DPI env
JDK-8320154 CheckCleanerBound test fails with PasswordCallback object is not released
JDK-8317885 Clarify TLABWasteTargetPercent flag
JDK-8319475 Code in SendPortZero.java is uncommented even after JDK-8236852 was fixed
JDK-8316576 com.sun.jndi.ldap.Connection.cleanup does not close connections on SocketTimeoutErrors
JDK-8317647 comments in TestTypeAnnotations still refer to resolved JDK-8068737
JDK-8318929 compile error on Alpine with gcc12 after 8298619 in libGetXSpace.c
JDK-8318412 compiler/jvmci/jdk.vm.ci.code.test/src/jdk/vm/ci/code/test/NativeCallTest.java fails after JDK-8262901
JDK-8318925 compiler/uncommontrap/TestDeoptOOM.java fails with release VMs
JDK-8316884 Convert applet manual tests SelectionVisible.java to Frame and automate
JDK-8320511 Convert test/sun/management/jmxremote/bootstrap shell tests to java version
JDK-8318664 Create a non static nested class without enclosing class throws VerifyError
JDK-8317249 Dcmd VM.classloaders fails to print the full hierarchy
JDK-8317465 disable TestRedirectLinks.java in slowdebug mode
JDK-8316875 DnD test DisposeFrameOnDragTest.java does not clean up
JDK-8318924 Do not hold ttyLock around stack walking
JDK-8317020 Drop --enable-preview from instanceof pattern matching related tests
JDK-8317018 Drop --enable-preview from Record related tests
JDK-8316883 Drop --enable-preview from Sealed Classes related tests
JDK-8316364 ECKeySizeParameterSpec causes too many exceptions on third party providers
JDK-8318665 Enhance test/jdk/javax/net/ssl/TLSCommon/SSLEngineTestCase.java to handle default cases
JDK-8319371 Extra file added by mistake during the backport of JDK-8283326
JDK-8316366 Failure during CompileOnly parsing leads to ShouldNotReachHere
JDK-8317733 failure handler missed jcmd.vm.info command
JDK-8319622 Fix deprecation warnings in DPrinter
JDK-8319752 Fix: make test outputs TEST SUCCESS after unsuccessful exit
JDK-8317539 Further simplify NMT backend
JDK-8319094 gc/g1/ihop/TestIHOPStatic.java fails due to extra concurrent mark with -Xcomp
JDK-8317248 gtest os.release_multi_mappings_vm is still racy
JDK-8316362 Handle control characters in java_lang_String::print
JDK-8317877 Harmonize/Standardize the SSLSocket/SSLEngine/SSLSocketSSLEngine test templates
JDK-8316597 Ideographic characters aren't stretched by AffineTransform.scale(2, 1)
JDK-8316874 Improve testing with VM option VerifyArchivedFields
JDK-8318171 Increase buffer size for buf (insert_features_names) in Abstract_VM_Version::insert_features_names
JDK-8317618 increase timeout for ContinuousCallSiteTargetChange.java
JDK-8317876 java/awt/List/ListGarbageCollectionTest/AwtListGarbageCollectionTest.java failed with "List wasn't garbage collected"
JDK-8318927 java/io/File/GetXSpace.java fails with "53687091200 != 161051996160"
JDK-8318928 java/io/File/GetXSpace.java is failing
JDK-8316247 java/net/DatagramSocket/DatagramSocketMulticasting.java should be hardened
JDK-8317679 java/net/httpclient/HandshakeFailureTest.java failed with "RuntimeException: Not found expected SSLHandshakeException in java.io.IOException"
JDK-8316889 java/net/httpclient/SpecialHeadersTest.java fails with "ERROR: Shutting down connection: HTTP/2 client stopped"
JDK-8319470 java/nio/file/Files/CopyAndMove.java fails when using second test directory
JDK-8317694 java/util/concurrent/ScheduledThreadPoolExecutor/BasicCancelTest.java timed out and also had jcmd pipe errors
JDK-8317463 java/util/zip/Deinflate.java failing on s390x
JDK-8317648 java/util/zip/DeInflate.java timed out
JDK-8316349 Javac inferred type does not conform to equality constraint
JDK-8317882 JDI AfterThreadDeathTest.java failed due to "FAILED: Did not get expected IllegalThreadStateException on a StepRequest.enable()"
JDK-8317880 jdk.test.lib.compiler.InMemoryJavaCompiler.compile does not close files
JDK-8319621 jdk/jfr/api/consumer/streaming/TestJVMCrash.java generates unnecessary core file
JDK-8318926 JFR: TestNetworkUtilizationEvent.java expects 2+ Network interfaces on Linux but finding 1
JDK-8317884 JPackage app-image exe launches multiple exe's in JDK 17+
JDK-8317021 jpackage: test MSI installation fix
JDK-8316574 Make AwtFramePackTest generic by removing @requires tag
JDK-8317008 mark hotspot runtime/cds tests which ignore external VM flags
JDK-8317458 mark hotspot runtime/CDSCompressedKPtrs tests which ignore external VM flags
JDK-8316871 mark hotspot runtime/ClassFile tests which ignore external VM flags
JDK-8317456 mark hotspot runtime/classFileParserBug tests which ignore external VM flags
JDK-8316726 mark hotspot runtime/CompressedOops tests which ignore external VM flags
JDK-8319467 mark hotspot runtime/condy tests which ignore external VM flags
JDK-8316727 mark hotspot runtime/Dictionary tests which ignore external VM flags
JDK-8317010 mark hotspot runtime/logging tests which ignore external VM flags
JDK-8316870 mark hotspot runtime/Metaspace tests which ignore external VM flags
JDK-8316873 mark hotspot runtime/modules tests which ignore external VM flags
JDK-8316872 mark hotspot runtime/Monitor tests which ignore external VM flags
JDK-8316869 mark hotspot runtime/PerfMemDestroy/PerfMemDestroy.java test as ignoring external VM flags
JDK-8316934 mark hotspot runtime/PrintStringTableStats/PrintStringTableStatsTest.java test as ignoring external VM flags
JDK-8316728 mark hotspot runtime/Safepoint tests which ignore external VM flags
JDK-8317454 mark hotspot runtime/Throwable tests which ignore external VM flags
JDK-8317651 Massive (up to ~30x) increase in C2 compilation time since JDK 17
JDK-8317732 MemoryPoolMBean/isUsageThresholdExceeded tests failed with "isUsageThresholdExceeded() returned false, and is still false, while threshold = MMMMMMM and used peak = NNNNNNN"
JDK-8317459 MemoryPoolMBean/isUsageThresholdExceeded/isexceeded001/TestDescription.java still failing
JDK-8317988 Most SA tests are skipped on macosx-aarch64 because all executables are signed
JDK-8317304 NMT incurs costs if disabled
JDK-8317645 NMT: count deltas are printed with 32-bit signed size
JDK-8317541 NMT: Display peak values
JDK-8317540 NMT: repurpose Tracking overhead counter as global malloc counter
JDK-8317646 NPE in javazic compiler
JDK-8318787 nsk/jdi/ReferenceType/instances/instances002: TestFailure: Unexpected size of referenceType.instances(nsk.share.jdi.TestInterfaceImplementer1): 11, expected: 10
JDK-8317682 Open source few swing text/html tests
JDK-8318413 Open source several choice AWT tests
JDK-8319625 OutputAnalyzer.shouldMatchByLine() fails in some cases
JDK-8318663 Print count in "Too many recored phases?" assert
JDK-8319092 ProgressMonitorInputStream not large file aware (>2GB)
JDK-8317871 Refactor NSK/JDI tests to create thread using factory
JDK-8316729 Regression automated test '/open/test/jdk/java/awt/TrayIcon/SystemTrayInstance/SystemTrayInstanceTest.java' fails
JDK-8317029 Remove delays from httpserver tests
JDK-8319484 Remove JT_JAVA dead code in jib-profiles.js
JDK-8317015 Remove VirtualSpaceList::is_full()
JDK-8316721 Rename test property vm.cds.archived.java.heap to vm.cds.write.archived.java.heap
JDK-8317872 Reorg jdk.test.lib.util.ForceGC
JDK-8316577 SA fails to properly attach to JVM after having just detached from a different JVM
JDK-8316365 SegmentedCodeCache fails when using large pages
JDK-8319989 serviceability/dcmd/framework/VMVersionTest.java fails with Unable to send object throw not established PipeIO Listener Thread connection
JDK-8318917 serviceability/jvmti/HeapMonitor/MyPackage/HeapMonitorStatObjectCorrectnessTest.java failed with Unexpected high difference percentage
JDK-8316731 Signed jars triggering Logger finder recursion and StackOverflowError
JDK-8316732 SignedLoggerFinderTest.java test failed
JDK-8317883 some JVMCI tests fail when VM options include -XX:+EnableJVMCI
JDK-8317028 Some tools/jpackage/windows/* tests fails with jtreg test timeout
JDK-8320643 sun/management/jmxremote/bootstrap/RmiBootstrapTest.java#id1failed with "Agent communication error: java.io.EOFException"
JDK-8320642 sun/management/jmxremote/bootstrap/RmiSslNoKeyStoreTest.java failed with "Agent communication error: java.io.EOFException"
JDK-8316572 sun/net/www/protocol/https/HttpsURLConnection/B6216082.java fails with "SocketException: Unexpected end of file from server"
JDK-8319624 sun/security/pkcs11/sslecc/ClientJSSEServerJSSE.java fails with ProviderException
JDK-8319469 Test "java/awt/print/PrinterJob/ImagePrinting/PrintARGBImage.java" fails because the frames of instruction does not display
JDK-8318173 Test javax/swing/dnd/7171812/bug7171812.java fails with java.lang.RuntimeException: Test failed, scroll on drag doesn't work
JDK-8317013 Test man page that options are documented
JDK-8316733 Test SignedLoggerFinderTest.java is still failing
JDK-8317030 Test StretchedFontTest.java fails for Baekmuk font
JDK-8317875 test/hotspot/jtreg/vmTestbase/nsk/jdi/VirtualMachine/dispose/dispose003/TestDescription.java fails
JDK-8317017 test/jdk/tools/jpackage/windows/WinL10nTest.java test fails if light.exe is not in %PATH%
JDK-8318666 Tests for AffirmTrust roots
JDK-8317649 TestStringDeduplicationInterned.java fails because extra deduplication
JDK-8316723 The socket is not closed in Connection::createSocket when the handshake failed for LDAP connection
JDK-8317024 Timeout with DTLSOverDatagram test template
JDK-8320394 Timeouts on one macOS 12.6.1 host of two Swing JTableHeader tests
JDK-8320512 Trivial fixes to btree tests
JDK-8316351 Unexpected round errors in FreetypeFontScaler
JDK-8319623 Update applications/scimark/Scimark.java to accept VM flags
JDK-8317615 Update CheckStatus.java for changes to TLS implementation
JDK-8317462 Update ConnectionTest.java for changes to TLS implementation
JDK-8317703 Update EngineCloseOnAlert.java for changes to TLS implementation
JDK-8317460 Update IllegalRecordVersion.java for changes to TLS implementation
JDK-8316571 Update java/net tests to eliminate dependency on sun.net.www.MessageHeader and some other internal APIs
JDK-8317614 Update TestAllSuites.java for TLS v1.2 and 1.3
JDK-8317461 validate-source fails after JDK-8298873
JDK-8317827 vmTestbase/nsk/jvmti/PopFrame/popframe011 fails with "assert(java_thread == _state->get_thread()) failed: Must be"
JDK-8318786 ZGC: vmTestbase/gc/gctests/SoftReference/soft004/soft004.java fails with assert(_phases->length() <= 1000) failed: Too many recored phases?

Ilya Gavrilin, Independent

Bug Summary
JDK-8317118 RISC-V: implement MD5 intrinsic
JDK-8317961 RISC-V: use andn / orn in the MD5 instrinsic

Johannes Bechberger, SAP

Bug Summary
JDK-8317230 build-test-lib is broken
JDK-8317232 build-test-lib target is broken
JDK-8319576 JDWP-agent sends broken exception event with onthrow option
JDK-8317231 make build-test-lib is broken

Jenny Shivayogi, Amazon

Bug Summary
JDK-8317782 ImageIO.read() throws incorrect exception type

Ludovic Henry, Rivos

Bug Summary
JDK-8319466 (process) jspawnhelper should not use argv[0]
JDK-8320576 RISC-V: __builtin___clear_cache can fail silently.

Mat Carter, Microsoft

Bug Summary
JDK-8317762 SunMSCAPI provider leaks memory and keys

Matthias Baesken, SAP

Bug Summary
JDK-8318970 build using devkit on Linux ppc64le RHEL puts path to devkit into libsplashscreen
JDK-8318396 Do not run sun/tools/jhsdb tests concurrently
JDK-8319289 Handle WideCharToMultiByte return values
JDK-8318578 Improve assertions in growableArray
JDK-8318781 Improve description of NativeLibrary JFR event
JDK-8318807 increase timeout of sun/security/tools/jarsigner/Warning.java
JDK-8318968 Java_java_util_prefs_FileSystemPreferences_lockFile0 write result errno in missing case
JDK-8318884 Java_sun_awt_windows_ThemeReader_paintBackground release resources in early returns
JDK-8318269 make JDKOPT_CHECK_CODESIGN_PARAMS more verbose
JDK-8316269 RandomTestBsi1999 fails often with timeouts on Linux ppc64le
JDK-8319290 relax the builddir check in make/autoconf/basic.m4
JDK-8318969 src/java.desktop/windows/native/libawt/windows/awt_Robot.cpp GetRGBPixels adjust releasing of resources
JDK-8317239 test tools/jpackage/share/RuntimePackageTest.java#id0 fails on RHEL8
JDK-8318270 use close after failing os::fdopen in vmError and ciEnv
JDK-8317004 When multiple users run tools/jpackage/share/LicenseTest.java, Permission denied for writing /var/tmp/*.files

Martin Balao, Red Hat

Bug Summary
JDK-8320910 DSA signature length value is not accurate in P11Signature

Martin Doerr, SAP

Bug Summary
JDK-8315836 Add Certigna Root CA - 2
JDK-8315837 C1 compilation crashes in LinearScan::resolve_exception_edge
JDK-8320593 Top of lock-stack does not match the unlocked object

Masanori Yano, Fujitsu

Bug Summary
JDK-8316809 tools/jpackage/share/jdk/jpackage/tests/UnicodeArgsTest.java fails on Japanese Windows platform

Olga Mikhaltcova, Azul

Bug Summary
JDK-8317702 RISC-V: jdk uses misaligned memory access when AvoidUnalignedAccess enabled
JDK-8318307 RISC-V: misaligned memory access in String.Compare intrinsic
JDK-8317833 RISC-V: String.indexOf intrinsic may produce misaligned memory loads

Paul Hohensee, Amazon

Bug Summary
JDK-8315858 Formatter.format might take a long time to format an integer or floating-point

Robbin Ehn, Rivos

Bug Summary
JDK-8319890 RISC-V: Add riscv_hwprobe syscall
JDK-8319892 RISC-V: Disable detection of V through HWCAP
JDK-8319891 RISC-V: hwprobe query is_set return wrong value
JDK-8320227 RISC-V: Update hwprobe query for new extensions
JDK-8317739 RISC-V: Zero extended narrow oop passed to Atomic::cmpxchg

Roman Kennke, Amazon

Bug Summary
JDK-8320514 Parallel: Use PreservedMarks to record promotion-failed objects

Roman Marchenko, Azul

Bug Summary
JDK-8315861 SIGSEGV in PhaseIdealLoop::build_loop_late_post_work due to bad immediate dominator info

Roy Soumadipta, Amazon

Bug Summary
JDK-8317556 Enable parallelism in vmTestbase/nsk/stress/numeric tests
JDK-8317536 Parallelize gc/stress/TestStressIHOPMultiThread.java test
JDK-8320874 Parallelize gc/stress/TestStressRSetCoarsening.java test
JDK-8317749 Parallelize java/util/concurrent/tck/JSR166TestCase.java
JDK-8316962 serviceability/sa/TestJmapCoreMetaspace.java should run with -XX:-VerifyDependencies

Ralf Schmelter, SAP

Bug Summary
JDK-8318461 jdk/jfr/event/runtime/TestShutdown.java fails on Linux ppc64le and Linux aarch64
JDK-8317226 JfrStructCopyFailed uses heap words instead of bytes for object sizes

Saint Wesonga, Microsoft

Bug Summary
JDK-8323841 Allocate BadPaddingException only if it will be thrown

Sergey Chernyshev, BellSoft

Bug Summary
JDK-8316589 Memory leak in JceSecurity

Sergey Bylokhov, Amazon

Bug Summary
JDK-8319685 javax/print/PrintServiceLookup/FlushCustomClassLoader.java fails to free
JDK-8315429 MidiSystem.getSoundbank() throws unexpected SecurityException
JDK-8319675 PrintServiceLookup spawns 2 threads in the current classloader, getting orphaned
JDK-8323846 ZipFile::getEntry will not return a file entry when there is a directory entry of the same name within a Zip File

Aleksey Shipilev, Amazon

Bug Summary
JDK-8318286 [GHA] get-bootjdk action should return the abolute path
JDK-8316600 [GHA] Update checkout action to use v4
JDK-8317223 Add curl support to createJMHBundle.sh
JDK-8316752 ArithmeticException in GaloisCounterMode
JDK-8316753 Better diagnostic header for CodeBlobs
JDK-8317513 Better diagnostic header for VtableStub
JDK-8315466 C2 crash due to unexpected exception control flow
JDK-8319527 C2: add bailout after assert Bad graph detected in build_loop_late
JDK-8316014 CITime misreports code/total nmethod sizes
JDK-8315346 Clean up checking of testing requirements in configure
JDK-8316013 fatal error: Possible safepoint reached by thread that does not allow it
JDK-8320510 GHA: Cross-compile gtest code
JDK-8320509 java/lang/Thread/IsAlive.java timed out
JDK-8317224 JMH benchmarks for Fences
JDK-8315463 make test TEST="gtest:" exits with error when it shouldn't
JDK-8315994 mark hotspot runtime/InvocationTests tests which ignore external VM flags
JDK-8318802 New parentheses warnings after HarfBuzz 7.2.0 update
JDK-8318803 test hprof lib: invalid array element type from JavaValueArray.elementSize
JDK-8315381 Try to verify gtest version
JDK-8315697 Update to use jtreg 7.3.1

Thomas Stuefe, Red Hat

Bug Summary
JDK-8315394 [linux] SIGSEGV if kernel was built without hugepage support
JDK-8315349 Fix THP detection on Linux
JDK-8315397 JDK-8303215 is incomplete
JDK-8318205 NMT: Make peak values available in release builds
JDK-8315453 Rename DisableTHPStackMitigation flag to THPStackMitigation
JDK-8315471 TEST_BUG: runtime/os/THPsInThreadStackPreventionTest.java could fail on machine with large number of cores
JDK-8315396 THPs cause huge RSS due to thread start timing issue
JDK-8315433 WSL Linux build crashes after JDK-8310233

Sandhya Viswanathan, Intel

Bug Summary
JDK-8320872 VectorMaskGen clobbers rflags on x86_64

sxa, Red Hat

Bug Summary
JDK-8320424 test/jdk/java/io/File/libGetXSpace.c does not compile on Windows 32-bit

Sonia Zaldana Calles, Red Hat

Bug Summary
JDK-8320900 ModuleDescriptor.hashCode isn't reproducible across builds
JDK-8318281 Write a test to check various components send Events while mouse and key are used simultaneously

v-terrychow, Microsoft

Bug Summary
JDK-8319144 Add KEEPALIVE Extended Socket Options Support for Windows

Yuri Nesterenko, Azul

Bug Summary
JDK-8318430 Buffer clean in PasswordCallback
JDK-8318432 Exclude cleaner test failing on older releases

yanglongplus, Independent

Bug Summary
JDK-8312065 Socket.connect does not timeout when profiling