PUSHES REPORT: 17.0.11

This report shows who pushed the backports to the given release. This usually shows who did the backporting, testing, and review work.

Report generated: Sat Apr 20 06:22:45 CEST 2024

Distribution by priority

Count Priority
4 P1
10 P2
60 P3
147 P4
4 P5

Distribution by components

Count Component
225 100% Total
88 39.1% hotspot
34 15.1% hotspot/runtime
24 10.7% hotspot/compiler
13 5.8% hotspot/gc
5 2.2% hotspot/jfr
5 2.2% hotspot/test
4 1.8% hotspot/jvmti
2 0.9% hotspot/svc
1 0.4% hotspot/svc-agent
42 18.7% core-libs
12 5.3% core-libs/java.net
5 2.2% core-libs/java.nio
5 2.2% core-libs/java.io
4 1.8% core-libs/java.lang
3 1.3% core-libs/java.util:i18n
2 0.9% core-libs
2 0.9% core-libs/java.lang:reflect
2 0.9% core-libs/java.time
1 0.4% core-libs/javax.script
1 0.4% core-libs/java.util.concurrent
1 0.4% core-libs/java.nio.charsets
1 0.4% core-libs/java.lang.module
1 0.4% core-libs/java.math
1 0.4% core-libs/javax.naming
1 0.4% core-libs/java.util.jar
38 16.9% client-libs
18 8.0% client-libs/javax.swing
7 3.1% client-libs/java.awt
5 2.2% client-libs/2d
4 1.8% client-libs/javax.accessibility
2 0.9% client-libs
2 0.9% client-libs/javax.sound
24 10.7% security-libs
11 4.9% security-libs/java.security
4 1.8% security-libs/javax.net.ssl
3 1.3% security-libs/javax.crypto:pkcs11
2 0.9% security-libs/javax.xml.crypto
2 0.9% security-libs
1 0.4% security-libs/jdk.security
1 0.4% security-libs/javax.security
13 5.8% infrastructure
10 4.4% infrastructure/build
2 0.9% infrastructure/release_eng
1 0.4% infrastructure
9 4.0% tools
7 3.1% tools/javac
1 0.4% tools/javadoc(tool)
1 0.4% tools/jar
8 3.6% core-svc
3 1.3% core-svc/debugger
2 0.9% core-svc/java.lang.management
1 0.4% core-svc/tools
1 0.4% core-svc/javax.management
1 0.4% core-svc/java.lang.instrument
2 0.9% xml
2 0.9% xml/javax.xml.validation
1 0.4% docs
1 0.4% docs

Distribution by affiliation

This Release Pushes

Original Pushes

Count Committer
225 100% Total
135 60.0% SAP
87 38.7% Goetz Lindenmaier
17 7.6% Andrew Lu
12 5.3% Matthias Baesken
10 4.4% Amos SHI
5 2.2% Christoph Langer
3 1.3% Johannes Bechberger
1 0.4% Martin Doerr
55 24.4% Amazon
31 13.8% Aleksey Shipilev
9 4.0% Sergey Bylokhov
4 1.8% William Kemper
2 0.9% Paul Hohensee
2 0.9% Dan Lutker
2 0.9% Elif Aslan
2 0.9% Volker Simonis
1 0.4% David Alvarez
1 0.4% Ben Taylor
1 0.4% Oli Gillespie
12 5.3% Red Hat
5 2.2% Sonia Zaldana Calles
2 0.9% Jonathan Dowland
2 0.9% Severin Gehwolf
1 0.4% ariasdereyna
1 0.4% Andrew Hughes
1 0.4% Zdenek Zambersky
4 1.8% BellSoft
4 1.8% Dmitry Chuyko
3 1.3% Independent
3 1.3% Gui Cao
3 1.3% Oracle
2 0.9% Darragh Clarke
1 0.4% Jaikiran Pai
2 0.9% Azul
1 0.4% Alexey Bakhtin
1 0.4% Roman Marchenko
2 0.9% Google
2 0.9% Liam Miller-Cushon
2 0.9% Intel
2 0.9% Sandhya Viswanathan
1 0.4% Alibaba
1 0.4% Liang Mao
1 0.4% DataDog
1 0.4% Jaroslav Bachorík
1 0.4% Fujitsu
1 0.4% Kimura Yukihiro
1 0.4% IBM
1 0.4% Ichiroh Takiguchi
1 0.4% Microsoft
1 0.4% Saint Wesonga
1 0.4% Rivos
1 0.4% Ludovic Henry
1 0.4% Unknown
1 0.4% syan
Count Committer
225 100% Total
134 59.6% Oracle
9 4.0% Prasanta Sadhukhan
7 3.1% Weijun Wang
5 2.2% Markus Grönlund
5 2.2% Kim Barrett
4 1.8% Abhishek Kumar
4 1.8% Jaikiran Pai
4 1.8% Justin Lu
3 1.3% Harshitha Onkar
3 1.3% Leo Korinth
3 1.3% Darragh Clarke
3 1.3% Daniel Fuchs
3 1.3% Tobias Hartmann
3 1.3% Emanuel Peter
3 1.3% Leonid Mesnik
3 1.3% Mikhailo Seledtsov
3 1.3% Rajan Halade
3 1.3% Renjith Kannath Pariyangad
3 1.3% Damon Nguyen
2 0.9% Brian Burkhalter
2 0.9% Calvin Cheung
2 0.9% Mark Powers
2 0.9% Valerie Peng
2 0.9% Tobias Holenstein
2 0.9% Gergö Barany
2 0.9% Kevin Walls
2 0.9% Matthew Donovan
2 0.9% johny.jose
2 0.9% Magnus Ihse Bursie
2 0.9% David Holmes
2 0.9% Daniel Jelinski
2 0.9% Weibing Xiao
2 0.9% Naoto Sato
2 0.9% Joe Darcy
1 0.4% Mark Sheppard
1 0.4% Ludvig Janiuk
1 0.4% Michael McMahon
1 0.4% Albert Yang
1 0.4% Roberto Castaneda Lozano
1 0.4% Joe Wang
1 0.4% Ravi Reddy
1 0.4% Sean Coffey
1 0.4% Jayathirth D V
1 0.4% Roger Riggs
1 0.4% Stefan Karlsson
1 0.4% Alexander Zvegintsev
1 0.4% Erik Österlund
1 0.4% Dean Long
1 0.4% Alex Menkov
1 0.4% Rajat Mahajan
1 0.4% Thomas Schatzl
1 0.4% Daniel Daugherty
1 0.4% Alexander Zuev
1 0.4% Lawrence Andrews
1 0.4% Vicente Arturo Romero Zaldivar
1 0.4% Ioi Lam
1 0.4% Lance Andersen
1 0.4% Ravi Gupta
1 0.4% Coleen Phillimore
1 0.4% Kevin Driver
1 0.4% Alexey Ivanov
1 0.4% Ramkumar Sunderbabu
1 0.4% Jonathan Gibbons
1 0.4% Mandy Chung
1 0.4% Alisen Chung
1 0.4% Jesper Wilhelmsson
1 0.4% Philip Race
26 11.6% SAP
13 5.8% Matthias Baesken
5 2.2% Christoph Langer
3 1.3% Goetz Lindenmaier
2 0.9% Martin Doerr
2 0.9% Johannes Bechberger
1 0.4% Richard Reingruber
24 10.7% Amazon
9 4.0% Aleksey Shipilev
4 1.8% William Kemper
3 1.3% Sergey Bylokhov
2 0.9% Paul Hohensee
2 0.9% Elif Aslan
1 0.4% David Alvarez
1 0.4% Jenny Shivayogi
1 0.4% eastig
1 0.4% Volker Simonis
16 7.1% Independent
2 0.9% Zhengyu Gu
2 0.9% Gui Cao
1 0.4% Artem Semenov
1 0.4% Dingli Zhang
1 0.4% gregor
1 0.4% Guoxiong Li
1 0.4% liach
1 0.4% 145339032+msobiers
1 0.4% Chen Liang
1 0.4% Archie Cobbs
1 0.4% ae40515
1 0.4% darraghclarke98
1 0.4% Andrey Turbanov
1 0.4% Daohan Qu
8 3.6% Red Hat
2 0.9% Severin Gehwolf
2 0.9% Thomas Stuefe
2 0.9% Roland Westrelin
1 0.4% Andrew Haley
1 0.4% Andrew Hughes
3 1.3% Alibaba
1 0.4% yansendao.ysd
1 0.4% Yi Yang
1 0.4% xingqizheng.xqz
3 1.3% Intel
2 0.9% Sandhya Viswanathan
1 0.4% Scott Gibbons
2 0.9% Azul
1 0.4% Roman Marchenko
1 0.4% Ekaterina Vergizova
2 0.9% Google
1 0.4% Justin King
1 0.4% Liam Miller-Cushon
2 0.9% IBM
1 0.4% Ichiroh Takiguchi
1 0.4% gaurav.chaudhari
2 0.9% Loongson
1 0.4% Leslie Zhai
1 0.4% Sun Guoyun
1 0.4% DataDog
1 0.4% Jaroslav Bachorík
1 0.4% Fujitsu
1 0.4% Kimura Yukihiro
1 0.4% Tencent
1 0.4% Jie Fu

Chronological push log:

UTC Time This Release Push By Original Push By Bug Summary
Name Affiliation Name Affiliation
2024/04/08 08:17 Christoph Langer SAP (same) (same) JDK-8329836 [17u] Remove designator DEFAULT_PROMOTED_VERSION_PRE=ea for release 17.0.11
2024/03/15 08:58 Goetz Lindenmaier SAP Jesper Wilhelmsson Oracle JDK-8328255 Add SipHash attribution file
2024/03/15 08:50 Goetz Lindenmaier SAP Richard Reingruber SAP JDK-8328252 [macosx-aarch64] SIGBUS in MarkActivationClosure::do_code_blob reached from Unsafe_CopySwapMemory0
2024/03/05 09:06 Sergey Bylokhov Amazon Alexander Zvegintsev Oracle JDK-8327292 Test "api/java_awt/interactive/SystemTrayTests.html" failed because A blue ball icon is added outside of the system tray
2024/03/05 08:59 Goetz Lindenmaier SAP Jaikiran Pai Oracle JDK-8327291 Use loopback IP addresses in security policy files of httpclient tests
2024/02/27 09:52 Christoph Langer SAP (same) (same) JDK-8326772 Remove obsolete comments for class sun.security.ssl.SunJSSE
2024/02/27 09:46 Goetz Lindenmaier SAP Matthias Baesken SAP JDK-8326770 Handle problems in core-related tests on macOS when codesign tool does not work
2024/02/27 09:44 Goetz Lindenmaier SAP Michael McMahon Oracle JDK-8326768 Update SimpleSSLContext keystore to use SANs for localhost IP addresses
2024/02/26 18:17 Sergey Bylokhov Amazon Rajat Mahajan Oracle JDK-8326696 JDK-8294427 breaks Windows L&F on all older Windows versions
2024/02/26 12:35 Aleksey Shipilev Amazon Leonid Mesnik Oracle JDK-8326680 update jcstress to 0.16
2024/02/26 08:54 Aleksey Shipilev Amazon Jie Fu Tencent JDK-8326642 Invalid test group of lib-test after JDK-8323515
2024/02/26 08:54 Aleksey Shipilev Amazon (same) (same) JDK-8326641 Create test alias "all" for all test roots
2024/02/26 07:07 Andrew Lu SAP Alexey Ivanov Oracle JDK-8326634 HTML formatting for PassFailJFrame instructions
2024/02/23 09:06 Andrew Lu SAP Lawrence Andrews Oracle JDK-8326562 Add screen capture functionality to PassFailJFrame
2024/02/23 08:48 Goetz Lindenmaier SAP Markus Grönlund Oracle JDK-8326561 misc tests fail "assert(ms < 1000) failed: Un-interruptable sleep, short time use only"
2024/02/23 08:46 Goetz Lindenmaier SAP Jaikiran Pai Oracle JDK-8326559 ModuleDescriptor.hashCode is inconsistent
2024/02/22 13:50 Aleksey Shipilev Amazon Rajan Halade Oracle JDK-8326492 Add Certainly roots R1 and E1
2024/02/22 13:45 syan Unknown yansendao.ysd Alibaba JDK-8326491 [TESTBUG]testMemoryFailCount in jdk/internal/platform/docker/TestDockerMemoryMetrics.java always fail because OOM killed
2024/02/22 02:55 Andrew Lu SAP Mikhailo Seledtsov Oracle JDK-8326441 runtime/ErrorHandling/ tests ignore external VM flags
2024/02/21 11:16 Johannes Bechberger SAP (same) (same) JDK-8325585 Remove no longer necessary calls to set/unset-in-asgct flag in JDK 17
2024/02/21 11:15 Darragh Clarke Oracle (same) (same) JDK-8326400 java/net/HttpURLConnection/HttpURLConnectionExpectContinueTest.java fails intermittently in timeout
2024/02/21 00:24 Zdenek Zambersky Red Hat Dingli Zhang Independent JDK-8326374 Fix the format of several tables in building.md
2024/02/19 09:38 Darragh Clarke Oracle (same) (same) JDK-8326155 Test java/net/HttpURLConnection/HttpURLConnectionExpectContinueTest.java failed: java.net.BindException: Address already in use
2024/02/19 09:34 Andrew Lu SAP Tobias Hartmann Oracle JDK-8326154 compiler/tiered/LevelTransitionTest.java fails with -XX:CompileThreshold=100 -XX:TieredStopAtLevel=1
2024/02/19 08:24 Amos SHI SAP Prasanta Sadhukhan Oracle JDK-8326133 Open source swing security manager test
2024/02/19 08:23 Amos SHI SAP Brian Burkhalter Oracle JDK-8326132 java/io/File/createTempFile/SpecialTempFile.java fails in Windows 11
2024/02/17 00:34 Sergey Bylokhov Amazon (same) (same) JDK-8326095 Enable "maybe-uninitialized" warning for FreeType 2.13.1
2024/02/16 20:59 Jaikiran Pai Oracle (same) (same) JDK-8326088 HttpClient may use incorrect key when finding pooled HTTP/2 connection for IPv6 address
2024/02/16 12:09 Goetz Lindenmaier SAP Daniel Daugherty Oracle JDK-8326043 ProblemList vmTestbase/nsk/jvmti/scenarios/capability/CM03/cm03t001/TestDescription.java on linux-all
2024/02/16 03:32 Sergey Bylokhov Amazon (same) (same) JDK-8326011 Parallelize sun/java2d/marlin/ClipShapeTest.java
2024/02/15 12:24 Aleksey Shipilev Amazon (same) (same) JDK-8325951 ClassLoaderData::print_on should print address of class loader
2024/02/13 08:52 Matthias Baesken SAP (same) (same) JDK-8325719 fix typo hpage_pdm_size
2024/02/13 08:52 Matthias Baesken SAP (same) (same) JDK-8325718 os::Linux::print_system_memory_info enhance the THP output with /sys/kernel/mm/transparent_hugepage/hpage_pmd_size
2024/02/13 08:45 Matthias Baesken SAP (same) (same) JDK-8325717 prioritize /etc/os-release over /etc/SuSE-release in hs_err/info output
2024/02/09 18:52 Dan Lutker Amazon johny.jose Oracle JDK-8325572 (tz) Update Timezone Data to 2024a
2024/02/07 07:37 Aleksey Shipilev Amazon Sean Coffey Oracle JDK-8325386 Test java/security/cert/CertPathBuilder/akiExt/AKISerialNumber.java is failing
2024/02/06 02:00 Andrew Lu SAP Justin Lu Oracle JDK-8325273 ISO 4217 Amendment 176 Update
2024/02/05 13:28 Matthias Baesken SAP (same) (same) JDK-8325245 handle setsocktopt return values
2024/02/03 21:38 Aleksey Shipilev Amazon Magnus Ihse Bursie Oracle JDK-8325198 Capture hotspot replay files in GHA
2024/02/03 21:36 Aleksey Shipilev Amazon (same) (same) JDK-8325195 GHA: Avoid multiple test suites per job
2024/02/01 08:51 Andrew Lu SAP Justin Lu Oracle JDK-8325103 Refactor Currency tests to use JUnit
2024/02/01 08:33 Matthias Baesken SAP Daniel Jelinski Oracle JDK-8325102 (aio) AsynchronousSocketChannel init fails in IPv6 only Windows env
2024/01/31 13:07 Amos SHI SAP Prasanta Sadhukhan Oracle JDK-8325050 Open source swing text/html and tree test
2024/01/30 18:19 Elif Aslan Amazon (same) (same) JDK-8324993 Enable parallelism in vmTestbase/nsk/stress/jni tests
2024/01/30 16:46 William Kemper Amazon (same) (same) JDK-8324982 Shenandoah: gc state should be synchronized to java threads only once per safepoint
2024/01/30 11:58 Goetz Lindenmaier SAP Matthias Baesken SAP JDK-8324946 Exclude sun/security/pkcs11/sslecc/ClientJSSEServerJSSE.java on Linux ppc64le
2024/01/30 08:30 Liang Mao Alibaba Markus Grönlund Oracle JDK-8324928 RunThese24H.java SIGSEGV in JfrThreadGroup::thread_group_id
2024/01/30 08:28 Amos SHI SAP Kevin Walls Oracle JDK-8324927 MonitorVmStartTerminate.java timed out
2024/01/30 08:24 Amos SHI SAP Justin Lu Oracle JDK-8324925 KeytoolReaderP12Test.java fail on localized Windows platform
2024/01/30 08:24 Amos SHI SAP Daniel Fuchs Oracle JDK-8324924 java/nio/channels/DatagramChannel/Connect.java timed out
2024/01/30 08:23 Amos SHI SAP Prasanta Sadhukhan Oracle JDK-8324923 Open source few more headless Swing misc tests
2024/01/30 08:20 Amos SHI SAP Prasanta Sadhukhan Oracle JDK-8324921 [macos14] javax/swing/JMenuItem/4654927/bug4654927.java: component must be showing on the screen to determine its location
2024/01/30 08:20 Amos SHI SAP Abhishek Kumar Oracle JDK-8324918 Open source few swing JInternalFrame and JMenuBar tests
2024/01/29 14:40 Severin Gehwolf Red Hat Thomas Stuefe Red Hat JDK-8324851 libCreationTimeHelper.so fails to link in JDK 21
2024/01/29 14:40 ariasdereyna Red Hat liach Independent JDK-8324850 Class.getReflectionFactory() is not thread-safe
2024/01/29 14:30 Gui Cao Independent xingqizheng.xqz Alibaba JDK-8324848 RISC-V: Incorrect implementation in VM_Version::parse_satp_mode
2024/01/29 13:31 Severin Gehwolf Red Hat (same) (same) JDK-8324842 (fs) Add support for BasicFileAttributes.creationTime() for Linux
2024/01/29 09:11 Aleksey Shipilev Amazon (same) (same) JDK-8324827 GHA: Generic jtreg errors are not reported
2024/01/29 08:24 Andrew Lu SAP Joe Darcy Oracle JDK-8324822 Using -proc:full should be considered requesting explicit annotation processing
2024/01/29 08:24 Andrew Lu SAP Abhishek Kumar Oracle JDK-8324820 Open source few swing JList and JMenuBar tests
2024/01/26 18:44 Elif Aslan Amazon (same) (same) JDK-8324780 Enable parallelism in vmTestbase/nsk/stress/threads tests
2024/01/26 06:59 Goetz Lindenmaier SAP Mark Powers Oracle JDK-8324748 NSS tests failing on OL9 linux-aarch64 hosts
2024/01/26 02:17 Andrew Lu SAP Ravi Gupta Oracle JDK-8324745 Write a test to check textArea triggers MouseEntered/MouseExited events properly
2024/01/25 09:07 Goetz Lindenmaier SAP Justin Lu Oracle JDK-8324706 Refactor java.util.Currency:i18n shell tests to plain java tests
2024/01/25 09:05 Goetz Lindenmaier SAP Rajan Halade Oracle JDK-8324704 Refactor PKCS11Test tests
2024/01/25 09:02 Goetz Lindenmaier SAP Matthew Donovan Oracle JDK-8324702 Update javax.net.ssl TLS tests to use SSLContextTemplate or SSLEngineTemplate
2024/01/25 08:58 Goetz Lindenmaier SAP Leo Korinth Oracle JDK-8324701 Remove unused imports under test/lib and jtreg/gc
2024/01/25 02:26 Andrew Lu SAP Philip Race Oracle JDK-8324671 [test bug] javax/swing/JTableHeader/6889007/bug6889007.java fails
2024/01/25 02:25 Andrew Lu SAP Joe Darcy Oracle JDK-8324670 Add -proc:full to describe current default annotation processing policy
2024/01/24 18:12 William Kemper Amazon (same) (same) JDK-8324656 Shenandoah: Heap could be corrupted by oom during evacuation
2024/01/24 16:08 Andrew Hughes Red Hat (same) (same) JDK-8324184 Windows VS2010 build failed with "error C2275: 'int64_t'"
2024/01/24 12:41 Matthias Baesken SAP David Holmes Oracle JDK-8324624 Document the effects of building with _GNU_SOURCE in os_posix.hpp
2024/01/24 12:39 Matthias Baesken SAP Emanuel Peter Oracle JDK-8324623 Remove unused code/headerfile dtraceAttacher.hpp
2024/01/24 12:39 Aleksey Shipilev Amazon David Holmes Oracle JDK-8324620 JNI invocation of an abstract instance method corrupts the stack
2024/01/23 17:23 Ben Taylor Amazon Mandy Chung Oracle JDK-8324554 Proxy.newProxyInstance throws NPE if loader is null and interface not visible from class loader
2024/01/23 09:15 Jonathan Dowland Red Hat Ioi Lam Oracle JDK-8324494 Add man page doc for -XX:+VerifySharedSpaces
2024/01/23 08:45 Goetz Lindenmaier SAP Gergö Barany Oracle JDK-8324490 Increase timeout for JDK tests that are close to the limit when run with libgraal
2024/01/23 08:42 Goetz Lindenmaier SAP Weijun Wang Oracle JDK-8324489 Compatibility.java reads both stdout and stderr of JdkUtils
2024/01/23 08:40 Goetz Lindenmaier SAP Valerie Peng Oracle JDK-8324488 PKCS11 tests fail with NSS 3.91
2024/01/23 08:40 Goetz Lindenmaier SAP Magnus Ihse Bursie Oracle JDK-8324487 JAVA_FLAGS removed from jtreg running in JDK-8317039
2024/01/23 08:40 Goetz Lindenmaier SAP Ludvig Janiuk Oracle JDK-8324486 Enable specifying the JDK used to run jtreg
2024/01/23 08:34 Goetz Lindenmaier SAP Rajan Halade Oracle JDK-8324484 PKCS11 tests silently skip execution
2024/01/23 08:34 Goetz Lindenmaier SAP Matthew Donovan Oracle JDK-8324483 sun/security/ssl/SSLSocketImpl/BlockedAsyncClose.java fails with jtreg test timeout
2024/01/23 08:32 Goetz Lindenmaier SAP Daohan Qu Independent JDK-8324482 Remove obsolete code and comments in TestLVT.java
2024/01/23 07:59 Ludovic Henry Rivos Guoxiong Li Independent JDK-8324435 Prefer to PTRACE_GETREGSET instead of PTRACE_GETREGS in method 'ps_proc.c::process_get_lwp_regs'
2024/01/22 08:43 Andrew Lu SAP Renjith Kannath Pariyangad Oracle JDK-8324283 WheelModifier.java fails by timeout
2024/01/19 15:49 Goetz Lindenmaier SAP Weijun Wang Oracle JDK-8324218 Update XML Security for Java to 3.0.3
2024/01/19 07:35 Johannes Bechberger SAP Artem Semenov Independent JDK-8324191 [macos14] Expand/collapse a JTree using keyboard freezes the application in macOS 14 Sonoma
2024/01/18 15:12 Goetz Lindenmaier SAP Matthias Baesken SAP JDK-8324145 filter out harmful -std* flags added by autoconf from CXX
2024/01/18 08:05 Matthias Baesken SAP (same) (same) JDK-8324113 Adjust hs_err output in malloc/mmap error cases
2024/01/17 21:31 Goetz Lindenmaier SAP Weibing Xiao Oracle JDK-8324062 Better Error Handling for Jar Tool When Processing Non-existent Files
2024/01/17 21:26 Goetz Lindenmaier SAP Naoto Sato Oracle JDK-8324060 test/jdk/sun/nio/cs/TestCharsetMapping.java is spuriously passing
2024/01/17 21:23 Goetz Lindenmaier SAP Leslie Zhai Loongson JDK-8324059 Disable runtime/os/TestTracePageSizes.java for ShenandoahGC
2024/01/17 21:22 Goetz Lindenmaier SAP (same) (same) JDK-8323806 [17u] VS2017 build fails with warning after 8293117.
2024/01/17 21:21 Goetz Lindenmaier SAP Weijun Wang Oracle JDK-8324056 Update XML Security for Java to 3.0.2
2024/01/17 18:14 William Kemper Amazon (same) (same) JDK-8324043 Shenandoah: Unused memory in regions compacted during a full GC should be mangled
2024/01/17 08:25 Andrew Lu SAP Prasanta Sadhukhan Oracle JDK-8323960 Open source few headless Swing misc tests
2024/01/17 08:21 Andrew Lu SAP Renjith Kannath Pariyangad Oracle JDK-8323959 Improve stability of WheelModifier.java test
2024/01/15 22:45 Sergey Bylokhov Amazon Martin Doerr SAP JDK-8323753 [AIX] vmTestbase/nsk/jvmti/RunAgentThread/agentthr001/TestDescription.java crashing due to empty while loop
2024/01/11 07:32 Goetz Lindenmaier SAP Daniel Jelinski Oracle JDK-8323569 pkcs11 native libraries make JNI calls into java code while holding GC lock
2024/01/11 07:29 Goetz Lindenmaier SAP Darragh Clarke Oracle JDK-8323568 java/net/Socket/Timeouts.java fails with AssertionError on test temporal post condition
2024/01/11 07:26 Goetz Lindenmaier SAP Jonathan Gibbons Oracle JDK-8323566 improve `JavadocTester.runTests`
2024/01/10 12:22 Dmitry Chuyko BellSoft Tobias Hartmann Oracle JDK-8323514 [AArch64] C1 compilation fails because monitor offset in OSR buffer is too large for immediate
2024/01/10 08:37 Goetz Lindenmaier SAP Ravi Reddy Oracle JDK-8323494 [BACKOUT] 8225377: type annotations are not visible to javac plugins across compilation boundaries
2024/01/10 06:20 Gui Cao Independent (same) (same) JDK-8323441 RISC-V: Enable fast class initialization checks
2024/01/10 01:10 Ichiroh Takiguchi IBM (same) (same) JDK-8323435 Chinese characters in RTF are not decoded
2024/01/09 22:18 Christoph Langer SAP (same) (same) JDK-8324022 [17u] Remove designator DEFAULT_PROMOTED_VERSION_PRE=ea for release 17.0.10
2024/01/09 17:24 Dan Lutker Amazon johny.jose Oracle JDK-8323340 (tz) Update Timezone Data to 2023d
2024/01/09 15:48 Sergey Bylokhov Amazon Lance Andersen Oracle JDK-8324013 ZipFile::getEntry will not return a file entry when there is a directory entry of the same name within a Zip File
2024/01/09 08:51 William Kemper Amazon (same) (same) JDK-8323263 Shenandoah: Encountered reference count always attributed to first worker thread
2024/01/09 06:15 Christoph Langer SAP (same) (same) JDK-8323252 Clean up code after JDK-8322417
2024/01/08 10:33 Oli Gillespie Amazon Scott Gibbons Intel JDK-8323160 Data loss in AVX3 Base64 decoding
2024/01/08 09:15 Goetz Lindenmaier SAP Mikhailo Seledtsov Oracle JDK-8323149 Simplify at-requires checkDockerSupport()
2024/01/08 09:13 Goetz Lindenmaier SAP Justin King Google JDK-8323147 Memory leaks in Metaspace gtests
2024/01/08 08:22 Aleksey Shipilev Amazon Tobias Hartmann Oracle JDK-8323134 [BACKOUT] 8318562: Computational test more than 2x slower when AVX instructions are used
2024/01/08 07:07 Goetz Lindenmaier SAP Roger Riggs Oracle JDK-8323125 [test-library] Warnings cleanup of the test library
2024/01/05 15:32 Jonathan Dowland Red Hat Harshitha Onkar Oracle JDK-8323071 Open source several Swing Text related tests
2024/01/05 09:58 Aleksey Shipilev Amazon (same) (same) JDK-8323051 GHA: Parallelize hotspot_compiler test jobs
2024/01/05 09:57 Aleksey Shipilev Amazon Stefan Karlsson Oracle JDK-8323050 Add relaxed add_and_fetch for macos aarch64 atomics
2024/01/05 07:54 Andrew Lu SAP Weijun Wang Oracle JDK-8323037 Update Public Suffix List to b5bf572
2024/01/05 02:02 Sergey Bylokhov Amazon Mark Powers Oracle JDK-8323029 NPE in PKCS7.parseOldSignedData
2024/01/04 13:00 Matthias Baesken SAP (same) (same) JDK-8323004 Enhance agentlib:jdwp help output by info about allow option
2024/01/04 09:26 Aleksey Shipilev Amazon (same) (same) JDK-8322968 [17u] Amend Atomics gtest with 1-byte tests
2024/01/03 17:14 Aleksey Shipilev Amazon Leo Korinth Oracle JDK-8322965 Stop mixing signed and unsigned types in bit operations
2024/01/03 11:29 Aleksey Shipilev Amazon eastig Amazon JDK-8322941 AArch64: Set relocInfo::offset_unit to 4
2024/01/03 10:50 Aleksey Shipilev Amazon (same) (same) JDK-8205076 [17u] Inet6AddressImpl.c: `lookupIfLocalHost` accesses `int InetAddress.preferIPv6Address` as a boolean
2024/01/03 10:47 Aleksey Shipilev Amazon Thomas Stuefe Red Hat JDK-8322935 C2: VM may crash after hitting node limit
2024/01/03 10:43 Aleksey Shipilev Amazon Matthias Baesken SAP JDK-8322934 increase javacserver connection timeout values and max retry attempts
2024/01/02 20:23 Sergey Bylokhov Amazon (same) (same) JDK-8322869 support latest VS2022 MSC_VER in abstract_vm_version.cpp
2024/01/02 18:12 Aleksey Shipilev Amazon Kim Barrett Oracle JDK-8322864 Support byte-sized atomic bitset operations
2023/12/31 13:55 Goetz Lindenmaier SAP Roland Westrelin Red Hat JDK-8322798 C2: large byte array clone triggers "failed: malformed control flow" assertion failure on linux-x86
2023/12/31 13:53 Goetz Lindenmaier SAP Leo Korinth Oracle JDK-8322797 GC: Make TestArrayAllocatorMallocLimit use createTestJvm
2023/12/31 13:51 Goetz Lindenmaier SAP Calvin Cheung Oracle JDK-8322796 Duplicate class names in dynamicArchive tests can lead to test failure
2023/12/29 14:03 Goetz Lindenmaier SAP (same) (same) JDK-8322773 Console read line with zero out should zero out when throwing exception
2023/12/29 08:25 Amos SHI SAP Kevin Walls Oracle JDK-8322769 Remove vmTestbase/nsk/monitoring/ThreadMXBean/ThreadInfo/Deadlock/JavaDeadlock001/TestDescription.java from problemlist.
2023/12/26 03:17 Andrew Lu SAP Alisen Chung Oracle JDK-8322741 Update FreeType to 2.13.2
2023/12/24 10:43 Goetz Lindenmaier SAP Weibing Xiao Oracle JDK-8322730 File.mkdirs() occasionally fails to create folders on Windows shared folder
2023/12/24 10:42 Goetz Lindenmaier SAP Dean Long Oracle JDK-8322728 SIGSEGV in ciVirtualCallTypeData::translate_from
2023/12/23 10:58 Goetz Lindenmaier SAP gregor Independent JDK-8322717 Fix comment typo in PKCS12Passwd.java
2023/12/23 10:58 Goetz Lindenmaier SAP gaurav.chaudhari IBM JDK-8322716 Fixup of jar filename typo in BadFactoryTest.sh
2023/12/23 10:56 Goetz Lindenmaier SAP Tobias Holenstein Oracle JDK-8322714 compiler/interpreter/TestVerifyStackAfterDeopt.java failed with SIGBUS in PcDescContainer::find_pc_desc_internal
2023/12/23 10:54 Goetz Lindenmaier SAP Emanuel Peter Oracle JDK-8322712 C2 SuperWord: wrong result, load should not be moved before store if not comparable
2023/12/23 10:52 Goetz Lindenmaier SAP Leonid Mesnik Oracle JDK-8322711 Mark com/sun/management/HotSpotDiagnosticMXBean/CheckOrigin.java as vm.flagless
2023/12/23 10:49 Goetz Lindenmaier SAP Roland Westrelin Red Hat JDK-8322709 C2: "control input must dominate current control" assert failure
2023/12/23 03:19 Gui Cao Independent (same) (same) JDK-8322705 test runtime/Unsafe/InternalErrorTest.java timeout on linux-riscv64 platform
2023/12/22 11:11 Jaroslav Bachorík DataDog (same) (same) JDK-8322689 Accessing jmethodID might lead to spurious crashes
2023/12/22 10:26 Goetz Lindenmaier SAP Thomas Schatzl Oracle JDK-8322687 jdk/jfr/event/gc/collection/TestGCCauseWith[Serial|Parallel].java : GC cause 'GCLocker Initiated GC' not in the valid causes
2023/12/22 10:23 Goetz Lindenmaier SAP Weijun Wang Oracle JDK-8322685 jtreg is confused when folder name is the same as the test name
2023/12/22 10:22 Goetz Lindenmaier SAP Tobias Holenstein Oracle JDK-8322684 Fix ignored bad CompileCommands in tests
2023/12/22 10:20 Goetz Lindenmaier SAP Mikhailo Seledtsov Oracle JDK-8322682 Create extented container test groups
2023/12/22 10:18 Goetz Lindenmaier SAP Alex Menkov Oracle JDK-8322680 NullPointerException because listenAddress[0] is null
2023/12/22 00:01 Kimura Yukihiro Fujitsu (same) (same) JDK-8322654 jdk/java/lang/instrument/BootClassPath/BootClassPathTest.sh fails on Japanese Windows
2023/12/21 15:26 Matthias Baesken SAP (same) (same) JDK-8322640 test/jdk/com/sun/jndi/ldap/LdapPoolTimeoutTest.java fails with ConnectException: Connection timed out: no further information
2023/12/21 12:32 Matthias Baesken SAP (same) (same) JDK-8322632 Add ReleaseIntArrayElements in Java_sun_awt_X11_XlibWrapper_SetBitmapShape XlbWrapper.c to early return
2023/12/21 11:41 Goetz Lindenmaier SAP Abhishek Kumar Oracle JDK-8322629 [macOS, Accessibility] VoiceOver: No announcements on JRadioButtonMenuItem and JCheckBoxMenuItem
2023/12/21 02:21 Andrew Lu SAP Leonid Mesnik Oracle JDK-8322578 Enable CreateCoredumpOnCrash for testing in makefiles
2023/12/19 15:05 Sonia Zaldana Calles Red Hat Brian Burkhalter Oracle JDK-8322470 test/jdk/jdk/internal/math/FloatingDecimal/TestFloatingDecimal should use RandomFactory
2023/12/19 15:04 Sonia Zaldana Calles Red Hat Mark Sheppard Oracle JDK-8322469 Test java/net/Inet6Address/serialize/Inet6AddressSerializationTest.java fails due to dynamic reconfigurations of network interface during test
2023/12/19 13:23 Aleksey Shipilev Amazon Ekaterina Vergizova Azul JDK-8322422 Configurable InlineCacheBuffer size
2023/12/19 11:31 Sandhya Viswanathan Intel (same) (same) JDK-8322411 Computational test more than 2x slower when AVX instructions are used
2023/12/19 11:30 Aleksey Shipilev Amazon Roberto Castaneda Lozano Oracle JDK-8322410 C2 compilation fails with "Exceeded _node_regs array"
2023/12/19 11:30 Sandhya Viswanathan Intel (same) (same) JDK-8322407 Incorrect x86 instruction encoding for VSIB addressing mode
2023/12/19 11:29 Sonia Zaldana Calles Red Hat Gergö Barany Oracle JDK-8322406 java/lang/ref/ReachabilityFenceTest.java should run with -Xbatch
2023/12/19 11:08 Aleksey Shipilev Amazon Kim Barrett Oracle JDK-8322405 Add atomic bitset functions
2023/12/19 10:53 Aleksey Shipilev Amazon Kevin Driver Oracle JDK-8322402 SSLEngine throws NPE parsing CertificateRequests
2023/12/19 10:50 Aleksey Shipilev Amazon Kim Barrett Oracle JDK-8322401 Possible pointer overflow in PretouchTask chunk claiming
2023/12/18 23:06 Liam Miller-Cushon Google Vicente Arturo Romero Zaldivar Oracle JDK-8322334 javac crashes while adding type annotations to the return type of a constructor
2023/12/18 11:27 Goetz Lindenmaier SAP Alexander Zuev Oracle JDK-8322281 [macOS, Accessibility] VoiceOver: Incorrect announcements of JRadioButton
2023/12/16 10:49 Goetz Lindenmaier SAP Naoto Sato Oracle JDK-8322246 Console read line with zero out should zero out underlying buffer
2023/12/15 16:23 Alexey Bakhtin Azul Weijun Wang Oracle JDK-8322210 RSA signature verification fails on signed data that does not encode params correctly
2023/12/15 12:47 Goetz Lindenmaier SAP Abhishek Kumar Oracle JDK-8322183 [macos] a11y : Screen magnifier does not reflect JRadioButton value change
2023/12/15 12:44 Goetz Lindenmaier SAP Andrew Haley Red Hat JDK-8322182 Crash in PrintOptoAssembly
2023/12/15 12:43 Goetz Lindenmaier SAP Aleksey Shipilev Amazon JDK-8322181 C2: Incorrect computation after JDK-8273454
2023/12/15 12:43 Goetz Lindenmaier SAP Zhengyu Gu Independent JDK-8322180 C2: Transform (-a)*(-b) into a*b
2023/12/15 04:12 Saint Wesonga Microsoft Valerie Peng Oracle JDK-8322155 Allocate BadPaddingException only if it will be thrown
2023/12/13 14:41 Sonia Zaldana Calles Red Hat darraghclarke98 Independent JDK-8321992 HttpURLConnection timeouts with Expect: 100-Continue and no chunking
2023/12/13 12:56 Goetz Lindenmaier SAP Archie Cobbs Independent JDK-8321979 (javac) investigate failing tests in JavacParserTest
2023/12/13 12:54 Goetz Lindenmaier SAP Damon Nguyen Oracle JDK-8321978 [macOS] javax/swing/plaf/aqua/CustomComboBoxFocusTest.java failure
2023/12/13 12:52 Goetz Lindenmaier SAP Andrey Turbanov Independent JDK-8321977 Use String.equals instead of String.compareTo in java.desktop
2023/12/13 09:23 Aleksey Shipilev Amazon Kim Barrett Oracle JDK-8321966 Atomic::add to pointer type may return wrong value
2023/12/13 09:22 Aleksey Shipilev Amazon Weijun Wang Oracle JDK-8321965 oddPart in MutableBigInteger::mutableModInverse contains info on final result
2023/12/13 08:55 Aleksey Shipilev Amazon 145339032+msobiers Independent JDK-8321960 Parallelize sun/security/rsa/SignedObjectChain.java subtests
2023/12/12 22:11 Liam Miller-Cushon Google (same) (same) JDK-8321934 type annotations are not visible to javac plugins across compilation boundaries
2023/12/12 09:05 Aleksey Shipilev Amazon Yi Yang Alibaba JDK-8321887 C2: StressGCM should have higher priority than frequency-based policy
2023/12/12 08:44 Aleksey Shipilev Amazon Zhengyu Gu Independent JDK-8321848 Shenandoah: Shenandoah degenerated GC and full GC need to cleanup old OopMapCache entries
2023/12/11 15:38 Aleksey Shipilev Amazon Kim Barrett Oracle JDK-8321803 Atomic operations on scoped enums don't build with clang
2023/12/09 14:33 Goetz Lindenmaier SAP Chen Liang Independent JDK-8321635 Correct range notations in MethodTypeDesc specification
2023/12/08 18:04 Sergey Bylokhov Amazon ae40515 Independent JDK-8321607 The SendRawSysexMessage test may cause a JVM crash
2023/12/08 15:11 Sonia Zaldana Calles Red Hat Aleksey Shipilev Amazon JDK-8321600 Make Xerces DatatypeException stackless
2023/12/08 10:29 Goetz Lindenmaier SAP Coleen Phillimore Oracle JDK-8321588 Test vmTestbase/nsk/stress/except/except011.java failed: ExceptionInInitializerError: target class not found
2023/12/08 10:27 Goetz Lindenmaier SAP Damon Nguyen Oracle JDK-8321587 The selected item in an editable JComboBox with titled border is not visible in Aqua LAF
2023/12/08 10:21 Goetz Lindenmaier SAP Prasanta Sadhukhan Oracle JDK-8321586 test/jdk/javax/swing/plaf/aqua/CustomComboBoxFocusTest.java fails on mac aarch64
2023/12/07 21:16 Paul Hohensee Amazon (same) (same) JDK-8321549 MonitoringSupport_lock should be unconditionally initialized after 8304074
2023/12/07 16:09 Paul Hohensee Amazon (same) (same) JDK-8320374 [JMX] Add an approximation of total bytes allocated on the Java heap by the JVM
2023/12/07 13:01 Volker Simonis Amazon Jenny Shivayogi Amazon JDK-8321528 Memory leak in jspawnhelper spawnChild after JDK-8307990
2023/12/07 08:29 Goetz Lindenmaier SAP Jaikiran Pai Oracle JDK-8321511 sun.security.ssl.SSLHandshake.getHandshakeProducer() incorrectly checks handshakeConsumers
2023/12/07 08:28 Goetz Lindenmaier SAP Prasanta Sadhukhan Oracle JDK-8321510 [macosx] When Alt+down arrow key is pressed, the combobox popup does not appear.
2023/12/07 08:26 Goetz Lindenmaier SAP Damon Nguyen Oracle JDK-8321508 [macosx] JComboBox paints the border incorrectly
2023/12/07 08:24 Goetz Lindenmaier SAP Prasanta Sadhukhan Oracle JDK-8321507 [macos] Aqua LAF does not fire an action event if combo box menu is displayed
2023/12/07 08:22 Goetz Lindenmaier SAP Prasanta Sadhukhan Oracle JDK-8321506 [macosx] closed/javax/swing/JComboBox/4517214/bug4517214.java fails on MacOS
2023/12/06 13:58 Volker Simonis Amazon (same) (same) JDK-8321469 jspawnhelper must close its writing side of a pipe before reading from it
2023/12/06 11:56 Goetz Lindenmaier SAP Harshitha Onkar Oracle JDK-8321465 Update HarfBuzz to 8.2.2
2023/12/06 11:54 Roman Marchenko Azul (same) (same) JDK-8321464 JvmtiEnvBase doesn't zero _ext_event_callbacks
2023/12/06 11:53 Goetz Lindenmaier SAP Calvin Cheung Oracle JDK-8321463 SPECjvm2008/xml.transform with CDS fails with "can't seal package nu.xom"
2023/12/06 11:49 Goetz Lindenmaier SAP Daniel Fuchs Oracle JDK-8321461 java/net/httpclient/SpecialHeadersTest failing after JDK-8301306
2023/12/06 11:49 Goetz Lindenmaier SAP Sun Guoyun Loongson JDK-8321460 java/net/httpclient/* fail with -Xcomp
2023/12/04 11:27 Goetz Lindenmaier SAP Daniel Fuchs Oracle JDK-8321265 java/net/httpclient/ManyRequestsLegacy.java failed with connection timeout
2023/12/04 09:00 Goetz Lindenmaier SAP Renjith Kannath Pariyangad Oracle JDK-8321246 Invalid TargetDataLine after screen lock when using JFileChooser or COM library
2023/12/04 08:58 Goetz Lindenmaier SAP Jayathirth D V Oracle JDK-8321245 Additional negative value check in JPEG decoding
2023/12/04 08:46 Goetz Lindenmaier SAP Harshitha Onkar Oracle JDK-8321244 Update Libpng to 1.6.40
2023/12/04 08:44 Goetz Lindenmaier SAP Severin Gehwolf Red Hat JDK-8321243 containers/docker/TestMemoryWithCgroupV1.java get OOM killed with Parallel GC
2023/12/04 08:36 Goetz Lindenmaier SAP Erik Österlund Oracle JDK-8321241 Deadlock in TestCSLocker.java due to blocking GC while allocating
2023/12/04 08:34 Goetz Lindenmaier SAP Joe Wang Oracle JDK-8321240 XML Schema Validation reports an required attribute twice via ErrorHandler
2023/12/04 08:34 Goetz Lindenmaier SAP Emanuel Peter Oracle JDK-8321239 Speed up compiler/jsr292/methodHandleExceptions/TestAMEnotNPE.java
2023/12/04 08:31 Goetz Lindenmaier SAP Albert Yang Oracle JDK-8321238 GC lock/jni/jnilock001 test failed "assert(gch->gc_cause() == GCCause::_scavenge_alot || !gch->incremental_collection_failed()) failed: Twice in a row"
2023/12/04 08:29 Goetz Lindenmaier SAP Ramkumar Sunderbabu Oracle JDK-8321237 gc/lock tests failed with "OutOfMemoryError: Java heap space: failed reallocation of scalar replaced objects"
2023/12/01 13:57 Dmitry Chuyko BellSoft Markus Grönlund Oracle JDK-8321177 jdk/jfr/event/runtime/TestActiveSettingEvent.java failed with "Expected two batches of Active Setting events"
2023/12/01 11:38 Matthias Baesken SAP (same) (same) JDK-8321172 Improve exception messages thrown by sun.nio.ch.Net native methods (win)
2023/11/30 17:54 Christoph Langer SAP (same) (same) JDK-8321447 ProblemList java/lang/invoke/lambda/LambdaFileEncodingSerialization.java on linux-all
2023/11/30 15:16 Johannes Bechberger SAP (same) (same) JDK-8321118 com/sun/jdi/JdwpOnThrowTest.java failed with "transport error 202: bind failed: Address already in use"
2023/11/29 17:38 David Alvarez Amazon (same) (same) JDK-8317960 [17u] Excessive CPU usage on AbstractQueuedSynchronized.isEnqueued
2023/11/29 17:05 Dmitry Chuyko BellSoft Markus Grönlund Oracle JDK-8321034 HelidonAppTest.java fails "assert(event->should_commit()) failed: invariant" from compiled frame"
2023/11/29 13:52 Dmitry Chuyko BellSoft Markus Grönlund Oracle JDK-8320978 JFR: Disabling the JfrThreadSampler commits only a partially disabled state
2023/11/29 10:01 Martin Doerr SAP (same) (same) JDK-8320966 ppc64 TypeEntries::type_unknown logic looks wrong, missed optimization opportunity
2023/11/29 07:21 Goetz Lindenmaier SAP (same) (same) JDK-8320885 Bump update version for OpenJDK: jdk-17.0.11

No changesets log

Committer push log

Darragh Clarke, Oracle

Bug Summary
JDK-8326155 Test java/net/HttpURLConnection/HttpURLConnectionExpectContinueTest.java failed: java.net.BindException: Address already in use

Alexey Bakhtin, Azul

Bug Summary
JDK-8322210 RSA signature verification fails on signed data that does not encode params correctly

David Alvarez, Amazon

Bug Summary
JDK-8317960 [17u] Excessive CPU usage on AbstractQueuedSynchronized.isEnqueued

Andrew Hughes, Red Hat

Bug Summary
JDK-8324184 Windows VS2010 build failed with "error C2275: 'int64_t'"

Andrew Lu, SAP

Bug Summary
JDK-8324671 [test bug] javax/swing/JTableHeader/6889007/bug6889007.java fails
JDK-8324670 Add -proc:full to describe current default annotation processing policy
JDK-8326562 Add screen capture functionality to PassFailJFrame
JDK-8326154 compiler/tiered/LevelTransitionTest.java fails with -XX:CompileThreshold=100 -XX:TieredStopAtLevel=1
JDK-8322578 Enable CreateCoredumpOnCrash for testing in makefiles
JDK-8326634 HTML formatting for PassFailJFrame instructions
JDK-8323959 Improve stability of WheelModifier.java test
JDK-8325273 ISO 4217 Amendment 176 Update
JDK-8323960 Open source few headless Swing misc tests
JDK-8324820 Open source few swing JList and JMenuBar tests
JDK-8325103 Refactor Currency tests to use JUnit
JDK-8326441 runtime/ErrorHandling/ tests ignore external VM flags
JDK-8322741 Update FreeType to 2.13.2
JDK-8323037 Update Public Suffix List to b5bf572
JDK-8324822 Using -proc:full should be considered requesting explicit annotation processing
JDK-8324283 WheelModifier.java fails by timeout
JDK-8324745 Write a test to check textArea triggers MouseEntered/MouseExited events properly

ariasdereyna, Red Hat

Bug Summary
JDK-8324850 Class.getReflectionFactory() is not thread-safe

Amos SHI, SAP

Bug Summary
JDK-8324921 [macos14] javax/swing/JMenuItem/4654927/bug4654927.java: component must be showing on the screen to determine its location
JDK-8326132 java/io/File/createTempFile/SpecialTempFile.java fails in Windows 11
JDK-8324924 java/nio/channels/DatagramChannel/Connect.java timed out
JDK-8324925 KeytoolReaderP12Test.java fail on localized Windows platform
JDK-8324927 MonitorVmStartTerminate.java timed out
JDK-8324923 Open source few more headless Swing misc tests
JDK-8324918 Open source few swing JInternalFrame and JMenuBar tests
JDK-8326133 Open source swing security manager test
JDK-8325050 Open source swing text/html and tree test
JDK-8322769 Remove vmTestbase/nsk/monitoring/ThreadMXBean/ThreadInfo/Deadlock/JavaDeadlock001/TestDescription.java from problemlist.

Ben Taylor, Amazon

Bug Summary
JDK-8324554 Proxy.newProxyInstance throws NPE if loader is null and interface not visible from class loader

Christoph Langer, SAP

Bug Summary
JDK-8324022 [17u] Remove designator DEFAULT_PROMOTED_VERSION_PRE=ea for release 17.0.10

Christoph Langer, SAP

Bug Summary
JDK-8329836 [17u] Remove designator DEFAULT_PROMOTED_VERSION_PRE=ea for release 17.0.11
JDK-8323252 Clean up code after JDK-8322417
JDK-8321447 ProblemList java/lang/invoke/lambda/LambdaFileEncodingSerialization.java on linux-all
JDK-8326772 Remove obsolete comments for class sun.security.ssl.SunJSSE

Liam Miller-Cushon, Google

Bug Summary
JDK-8322334 javac crashes while adding type annotations to the return type of a constructor
JDK-8321934 type annotations are not visible to javac plugins across compilation boundaries

Dmitry Chuyko, BellSoft

Bug Summary
JDK-8323514 [AArch64] C1 compilation fails because monitor offset in OSR buffer is too large for immediate
JDK-8321034 HelidonAppTest.java fails "assert(event->should_commit()) failed: invariant" from compiled frame"
JDK-8321177 jdk/jfr/event/runtime/TestActiveSettingEvent.java failed with "Expected two batches of Active Setting events"
JDK-8320978 JFR: Disabling the JfrThreadSampler commits only a partially disabled state

Darragh Clarke, Oracle

Bug Summary
JDK-8326400 java/net/HttpURLConnection/HttpURLConnectionExpectContinueTest.java fails intermittently in timeout

Dan Lutker, Amazon

Bug Summary
JDK-8323340 (tz) Update Timezone Data to 2023d
JDK-8325572 (tz) Update Timezone Data to 2024a

Elif Aslan, Amazon

Bug Summary
JDK-8324993 Enable parallelism in vmTestbase/nsk/stress/jni tests
JDK-8324780 Enable parallelism in vmTestbase/nsk/stress/threads tests

Gui Cao, Independent

Bug Summary
JDK-8323441 RISC-V: Enable fast class initialization checks
JDK-8324848 RISC-V: Incorrect implementation in VM_Version::parse_satp_mode
JDK-8322705 test runtime/Unsafe/InternalErrorTest.java timeout on linux-riscv64 platform

Goetz Lindenmaier, SAP

Bug Summary
JDK-8321979 (javac) investigate failing tests in JavacParserTest
JDK-8323806 [17u] VS2017 build fails with warning after 8293117.
JDK-8323494 [BACKOUT] 8225377: type annotations are not visible to javac plugins across compilation boundaries
JDK-8322281 [macOS, Accessibility] VoiceOver: Incorrect announcements of JRadioButton
JDK-8322629 [macOS, Accessibility] VoiceOver: No announcements on JRadioButtonMenuItem and JCheckBoxMenuItem
JDK-8322183 [macos] a11y : Screen magnifier does not reflect JRadioButton value change
JDK-8321507 [macos] Aqua LAF does not fire an action event if combo box menu is displayed
JDK-8321978 [macOS] javax/swing/plaf/aqua/CustomComboBoxFocusTest.java failure
JDK-8328252 [macosx-aarch64] SIGBUS in MarkActivationClosure::do_code_blob reached from Unsafe_CopySwapMemory0
JDK-8321506 [macosx] closed/javax/swing/JComboBox/4517214/bug4517214.java fails on MacOS
JDK-8321508 [macosx] JComboBox paints the border incorrectly
JDK-8321510 [macosx] When Alt+down arrow key is pressed, the combobox popup does not appear.
JDK-8323125 [test-library] Warnings cleanup of the test library
JDK-8328255 Add SipHash attribution file
JDK-8321245 Additional negative value check in JPEG decoding
JDK-8324062 Better Error Handling for Jar Tool When Processing Non-existent Files
JDK-8320885 Bump update version for OpenJDK: jdk-17.0.11
JDK-8322712 C2 SuperWord: wrong result, load should not be moved before store if not comparable
JDK-8322709 C2: "control input must dominate current control" assert failure
JDK-8322181 C2: Incorrect computation after JDK-8273454
JDK-8322798 C2: large byte array clone triggers "failed: malformed control flow" assertion failure on linux-x86
JDK-8322180 C2: Transform (-a)*(-b) into a*b
JDK-8324489 Compatibility.java reads both stdout and stderr of JdkUtils
JDK-8322714 compiler/interpreter/TestVerifyStackAfterDeopt.java failed with SIGBUS in PcDescContainer::find_pc_desc_internal
JDK-8322246 Console read line with zero out should zero out underlying buffer
JDK-8322773 Console read line with zero out should zero out when throwing exception
JDK-8321243 containers/docker/TestMemoryWithCgroupV1.java get OOM killed with Parallel GC
JDK-8321635 Correct range notations in MethodTypeDesc specification
JDK-8322182 Crash in PrintOptoAssembly
JDK-8322682 Create extented container test groups
JDK-8321241 Deadlock in TestCSLocker.java due to blocking GC while allocating
JDK-8324059 Disable runtime/os/TestTracePageSizes.java for ShenandoahGC
JDK-8322796 Duplicate class names in dynamicArchive tests can lead to test failure
JDK-8324486 Enable specifying the JDK used to run jtreg
JDK-8324946 Exclude sun/security/pkcs11/sslecc/ClientJSSEServerJSSE.java on Linux ppc64le
JDK-8322730 File.mkdirs() occasionally fails to create folders on Windows shared folder
JDK-8324145 filter out harmful -std* flags added by autoconf from CXX
JDK-8322717 Fix comment typo in PKCS12Passwd.java
JDK-8322684 Fix ignored bad CompileCommands in tests
JDK-8322716 Fixup of jar filename typo in BadFactoryTest.sh
JDK-8321238 GC lock/jni/jnilock001 test failed "assert(gch->gc_cause() == GCCause::_scavenge_alot || !gch->incremental_collection_failed()) failed: Twice in a row"
JDK-8321237 gc/lock tests failed with "OutOfMemoryError: Java heap space: failed reallocation of scalar replaced objects"
JDK-8322797 GC: Make TestArrayAllocatorMallocLimit use createTestJvm
JDK-8326770 Handle problems in core-related tests on macOS when codesign tool does not work
JDK-8323566 improve `JavadocTester.runTests`
JDK-8324490 Increase timeout for JDK tests that are close to the limit when run with libgraal
JDK-8321246 Invalid TargetDataLine after screen lock when using JFileChooser or COM library
JDK-8321460 java/net/httpclient/* fail with -Xcomp
JDK-8321265 java/net/httpclient/ManyRequestsLegacy.java failed with connection timeout
JDK-8321461 java/net/httpclient/SpecialHeadersTest failing after JDK-8301306
JDK-8323568 java/net/Socket/Timeouts.java fails with AssertionError on test temporal post condition
JDK-8324487 JAVA_FLAGS removed from jtreg running in JDK-8317039
JDK-8322687 jdk/jfr/event/gc/collection/TestGCCauseWith[Serial|Parallel].java : GC cause 'GCLocker Initiated GC' not in the valid causes
JDK-8322685 jtreg is confused when folder name is the same as the test name
JDK-8322711 Mark com/sun/management/HotSpotDiagnosticMXBean/CheckOrigin.java as vm.flagless
JDK-8323147 Memory leaks in Metaspace gtests
JDK-8326561 misc tests fail "assert(ms < 1000) failed: Un-interruptable sleep, short time use only"
JDK-8326559 ModuleDescriptor.hashCode is inconsistent
JDK-8324748 NSS tests failing on OL9 linux-aarch64 hosts
JDK-8322680 NullPointerException because listenAddress[0] is null
JDK-8323569 pkcs11 native libraries make JNI calls into java code while holding GC lock
JDK-8324488 PKCS11 tests fail with NSS 3.91
JDK-8324484 PKCS11 tests silently skip execution
JDK-8326043 ProblemList vmTestbase/nsk/jvmti/scenarios/capability/CM03/cm03t001/TestDescription.java on linux-all
JDK-8324706 Refactor java.util.Currency:i18n shell tests to plain java tests
JDK-8324704 Refactor PKCS11Test tests
JDK-8324482 Remove obsolete code and comments in TestLVT.java
JDK-8324701 Remove unused imports under test/lib and jtreg/gc
JDK-8322728 SIGSEGV in ciVirtualCallTypeData::translate_from
JDK-8323149 Simplify at-requires checkDockerSupport()
JDK-8321463 SPECjvm2008/xml.transform with CDS fails with "can't seal package nu.xom"
JDK-8321239 Speed up compiler/jsr292/methodHandleExceptions/TestAMEnotNPE.java
JDK-8321511 sun.security.ssl.SSLHandshake.getHandshakeProducer() incorrectly checks handshakeConsumers
JDK-8324483 sun/security/ssl/SSLSocketImpl/BlockedAsyncClose.java fails with jtreg test timeout
JDK-8321588 Test vmTestbase/nsk/stress/except/except011.java failed: ExceptionInInitializerError: target class not found
JDK-8321586 test/jdk/javax/swing/plaf/aqua/CustomComboBoxFocusTest.java fails on mac aarch64
JDK-8324060 test/jdk/sun/nio/cs/TestCharsetMapping.java is spuriously passing
JDK-8321587 The selected item in an editable JComboBox with titled border is not visible in Aqua LAF
JDK-8321465 Update HarfBuzz to 8.2.2
JDK-8324702 Update javax.net.ssl TLS tests to use SSLContextTemplate or SSLEngineTemplate
JDK-8321244 Update Libpng to 1.6.40
JDK-8326768 Update SimpleSSLContext keystore to use SANs for localhost IP addresses
JDK-8324056 Update XML Security for Java to 3.0.2
JDK-8324218 Update XML Security for Java to 3.0.3
JDK-8327291 Use loopback IP addresses in security policy files of httpclient tests
JDK-8321977 Use String.equals instead of String.compareTo in java.desktop
JDK-8321240 XML Schema Validation reports an required attribute twice via ErrorHandler

Ichiroh Takiguchi, IBM

Bug Summary
JDK-8323435 Chinese characters in RTF are not decoded

Jaroslav Bachorík, DataDog

Bug Summary
JDK-8322689 Accessing jmethodID might lead to spurious crashes

Johannes Bechberger, SAP

Bug Summary
JDK-8324191 [macos14] Expand/collapse a JTree using keyboard freezes the application in macOS 14 Sonoma
JDK-8321118 com/sun/jdi/JdwpOnThrowTest.java failed with "transport error 202: bind failed: Address already in use"
JDK-8325585 Remove no longer necessary calls to set/unset-in-asgct flag in JDK 17

Jonathan Dowland, Red Hat

Bug Summary
JDK-8324494 Add man page doc for -XX:+VerifySharedSpaces
JDK-8323071 Open source several Swing Text related tests

Jaikiran Pai, Oracle

Bug Summary
JDK-8326088 HttpClient may use incorrect key when finding pooled HTTP/2 connection for IPv6 address

Kimura Yukihiro, Fujitsu

Bug Summary
JDK-8322654 jdk/java/lang/instrument/BootClassPath/BootClassPathTest.sh fails on Japanese Windows

Liang Mao, Alibaba

Bug Summary
JDK-8324928 RunThese24H.java SIGSEGV in JfrThreadGroup::thread_group_id

Ludovic Henry, Rivos

Bug Summary
JDK-8324435 Prefer to PTRACE_GETREGSET instead of PTRACE_GETREGS in method 'ps_proc.c::process_get_lwp_regs'

Matthias Baesken, SAP

Bug Summary
JDK-8325102 (aio) AsynchronousSocketChannel init fails in IPv6 only Windows env
JDK-8322632 Add ReleaseIntArrayElements in Java_sun_awt_X11_XlibWrapper_SetBitmapShape XlbWrapper.c to early return
JDK-8324113 Adjust hs_err output in malloc/mmap error cases
JDK-8324624 Document the effects of building with _GNU_SOURCE in os_posix.hpp
JDK-8323004 Enhance agentlib:jdwp help output by info about allow option
JDK-8325719 fix typo hpage_pdm_size
JDK-8325245 handle setsocktopt return values
JDK-8321172 Improve exception messages thrown by sun.nio.ch.Net native methods (win)
JDK-8325718 os::Linux::print_system_memory_info enhance the THP output with /sys/kernel/mm/transparent_hugepage/hpage_pmd_size
JDK-8325717 prioritize /etc/os-release over /etc/SuSE-release in hs_err/info output
JDK-8324623 Remove unused code/headerfile dtraceAttacher.hpp
JDK-8322640 test/jdk/com/sun/jndi/ldap/LdapPoolTimeoutTest.java fails with ConnectException: Connection timed out: no further information

Martin Doerr, SAP

Bug Summary
JDK-8320966 ppc64 TypeEntries::type_unknown logic looks wrong, missed optimization opportunity

Oli Gillespie, Amazon

Bug Summary
JDK-8323160 Data loss in AVX3 Base64 decoding

Paul Hohensee, Amazon

Bug Summary
JDK-8320374 [JMX] Add an approximation of total bytes allocated on the Java heap by the JVM
JDK-8321549 MonitoringSupport_lock should be unconditionally initialized after 8304074

Roman Marchenko, Azul

Bug Summary
JDK-8321464 JvmtiEnvBase doesn't zero _ext_event_callbacks

Saint Wesonga, Microsoft

Bug Summary
JDK-8322155 Allocate BadPaddingException only if it will be thrown

Sergey Bylokhov, Amazon

Bug Summary
JDK-8323753 [AIX] vmTestbase/nsk/jvmti/RunAgentThread/agentthr001/TestDescription.java crashing due to empty while loop
JDK-8326095 Enable "maybe-uninitialized" warning for FreeType 2.13.1
JDK-8326696 JDK-8294427 breaks Windows L&F on all older Windows versions
JDK-8323029 NPE in PKCS7.parseOldSignedData
JDK-8326011 Parallelize sun/java2d/marlin/ClipShapeTest.java
JDK-8322869 support latest VS2022 MSC_VER in abstract_vm_version.cpp
JDK-8327292 Test "api/java_awt/interactive/SystemTrayTests.html" failed because A blue ball icon is added outside of the system tray
JDK-8321607 The SendRawSysexMessage test may cause a JVM crash
JDK-8324013 ZipFile::getEntry will not return a file entry when there is a directory entry of the same name within a Zip File

Severin Gehwolf, Red Hat

Bug Summary
JDK-8324842 (fs) Add support for BasicFileAttributes.creationTime() for Linux
JDK-8324851 libCreationTimeHelper.so fails to link in JDK 21

Aleksey Shipilev, Amazon

Bug Summary
JDK-8322968 [17u] Amend Atomics gtest with 1-byte tests
JDK-8205076 [17u] Inet6AddressImpl.c: `lookupIfLocalHost` accesses `int InetAddress.preferIPv6Address` as a boolean
JDK-8323134 [BACKOUT] 8318562: Computational test more than 2x slower when AVX instructions are used
JDK-8322941 AArch64: Set relocInfo::offset_unit to 4
JDK-8322405 Add atomic bitset functions
JDK-8326492 Add Certainly roots R1 and E1
JDK-8323050 Add relaxed add_and_fetch for macos aarch64 atomics
JDK-8321803 Atomic operations on scoped enums don't build with clang
JDK-8321966 Atomic::add to pointer type may return wrong value
JDK-8322410 C2 compilation fails with "Exceeded _node_regs array"
JDK-8321887 C2: StressGCM should have higher priority than frequency-based policy
JDK-8322935 C2: VM may crash after hitting node limit
JDK-8325198 Capture hotspot replay files in GHA
JDK-8325951 ClassLoaderData::print_on should print address of class loader
JDK-8322422 Configurable InlineCacheBuffer size
JDK-8326641 Create test alias "all" for all test roots
JDK-8325195 GHA: Avoid multiple test suites per job
JDK-8324827 GHA: Generic jtreg errors are not reported
JDK-8323051 GHA: Parallelize hotspot_compiler test jobs
JDK-8322934 increase javacserver connection timeout values and max retry attempts
JDK-8326642 Invalid test group of lib-test after JDK-8323515
JDK-8324620 JNI invocation of an abstract instance method corrupts the stack
JDK-8321965 oddPart in MutableBigInteger::mutableModInverse contains info on final result
JDK-8321960 Parallelize sun/security/rsa/SignedObjectChain.java subtests
JDK-8322401 Possible pointer overflow in PretouchTask chunk claiming
JDK-8321848 Shenandoah: Shenandoah degenerated GC and full GC need to cleanup old OopMapCache entries
JDK-8322402 SSLEngine throws NPE parsing CertificateRequests
JDK-8322965 Stop mixing signed and unsigned types in bit operations
JDK-8322864 Support byte-sized atomic bitset operations
JDK-8325386 Test java/security/cert/CertPathBuilder/akiExt/AKISerialNumber.java is failing
JDK-8326680 update jcstress to 0.16

Volker Simonis, Amazon

Bug Summary
JDK-8321469 jspawnhelper must close its writing side of a pipe before reading from it
JDK-8321528 Memory leak in jspawnhelper spawnChild after JDK-8307990

Sandhya Viswanathan, Intel

Bug Summary
JDK-8322411 Computational test more than 2x slower when AVX instructions are used
JDK-8322407 Incorrect x86 instruction encoding for VSIB addressing mode

syan, Unknown

Bug Summary
JDK-8326491 [TESTBUG]testMemoryFailCount in jdk/internal/platform/docker/TestDockerMemoryMetrics.java always fail because OOM killed

Sonia Zaldana Calles, Red Hat

Bug Summary
JDK-8321992 HttpURLConnection timeouts with Expect: 100-Continue and no chunking
JDK-8322406 java/lang/ref/ReachabilityFenceTest.java should run with -Xbatch
JDK-8321600 Make Xerces DatatypeException stackless
JDK-8322469 Test java/net/Inet6Address/serialize/Inet6AddressSerializationTest.java fails due to dynamic reconfigurations of network interface during test
JDK-8322470 test/jdk/jdk/internal/math/FloatingDecimal/TestFloatingDecimal should use RandomFactory

William Kemper, Amazon

Bug Summary
JDK-8323263 Shenandoah: Encountered reference count always attributed to first worker thread
JDK-8324982 Shenandoah: gc state should be synchronized to java threads only once per safepoint
JDK-8324656 Shenandoah: Heap could be corrupted by oom during evacuation
JDK-8324043 Shenandoah: Unused memory in regions compacted during a full GC should be mangled

Zdenek Zambersky, Red Hat

Bug Summary
JDK-8326374 Fix the format of several tables in building.md