PUSHES REPORT: 17.0.12

This report shows who pushed the backports to the given release. This usually shows who did the backporting, testing, and review work.

Report generated: Thu Jun 20 07:44:49 CEST 2024

Distribution by priority

Count Priority
2 P1
4 P2
52 P3
180 P4
5 P5

Distribution by components

Count Component
243 100% Total
81 33.3% hotspot
27 11.1% hotspot/runtime
21 8.6% hotspot/compiler
17 7.0% hotspot/gc
7 2.9% hotspot/test
4 1.6% hotspot/jfr
4 1.6% hotspot/svc
1 0.4% hotspot/jvmti
53 21.8% core-libs
15 6.2% core-libs/java.net
8 3.3% core-libs/java.util:i18n
6 2.5% core-libs/java.nio
5 2.1% core-libs/java.lang
4 1.6% core-libs
2 0.8% core-libs/java.util
2 0.8% core-libs/java.util.jar
1 0.4% core-libs/java.rmi
1 0.4% core-libs/java.util.concurrent
1 0.4% core-libs/javax.script
1 0.4% core-libs/java.lang.foreign
1 0.4% core-libs/java.lang:class_loading
1 0.4% core-libs/java.lang.invoke
1 0.4% core-libs/java.util.logging
1 0.4% core-libs/java.util:collections
1 0.4% core-libs/java.math
1 0.4% core-libs/java.lang:reflect
1 0.4% core-libs/javax.naming
50 20.6% client-libs
21 8.6% client-libs/javax.swing
18 7.4% client-libs/java.awt
5 2.1% client-libs/2d
5 2.1% client-libs
1 0.4% client-libs/javax.accessibility
21 8.6% security-libs
9 3.7% security-libs/java.security
4 1.6% security-libs
3 1.2% security-libs/javax.net.ssl
3 1.2% security-libs/javax.crypto:pkcs11
2 0.8% security-libs/javax.security
19 7.8% tools
5 2.1% tools/jpackage
5 2.1% tools/jlink
4 1.6% tools/javadoc(tool)
3 1.2% tools/javac
1 0.4% tools/launcher
1 0.4% tools
13 5.3% infrastructure
11 4.5% infrastructure/build
1 0.4% infrastructure/release_eng
1 0.4% infrastructure
5 2.1% core-svc
3 1.2% core-svc/debugger
1 0.4% core-svc/javax.management
1 0.4% core-svc/java.lang.management
1 0.4% other-libs
1 0.4% other-libs

Distribution by affiliation

This Release Pushes

Original Pushes

Count Committer
243 100% Total
173 71.2% SAP
72 29.6% Goetz Lindenmaier
37 15.2% Andrew Lu
30 12.3% Amos SHI
13 5.3% Matthias Baesken
8 3.3% Christoph Langer
8 3.3% Martin Doerr
5 2.1% Richard Reingruber
29 11.9% Amazon
15 6.2% Aleksey Shipilev
3 1.2% Elif Aslan
3 1.2% Sergey Bylokhov
2 0.8% acmoraru
2 0.8% rkmaurya
1 0.4% Roy Soumadipta
1 0.4% Ben Taylor
1 0.4% William Kemper
1 0.4% Dan Lutker
13 5.3% Red Hat
4 1.6% Sonia Zaldana Calles
3 1.2% Robert Toyonaga
2 0.8% ariasdereyna
1 0.4% Martin Balao
1 0.4% Andrew Hughes
1 0.4% fitzsim
1 0.4% Thomas Stuefe
7 2.9% Azul
4 1.6% Jan Kratochvil
2 0.8% Roman Marchenko
1 0.4% Sergey Nazarkin
6 2.5% Independent
6 2.5% Gui Cao
6 2.5% Unknown
5 2.1% syan
1 0.4% sroy
5 2.1% IBM
4 1.6% Amit Kumar
1 0.4% psoujany
1 0.4% Alibaba
1 0.4% Liang Mao
1 0.4% Ampere
1 0.4% Patrick Zhang
1 0.4% DataDog
1 0.4% Richard Startin
1 0.4% Rivos
1 0.4% Robbin Ehn
Count Committer
243 100% Total
155 63.8% Oracle
11 4.5% Harshitha Onkar
11 4.5% Prasanta Sadhukhan
9 3.7% Matthew Donovan
8 3.3% Jaikiran Pai
8 3.3% Justin Lu
6 2.5% Leonid Mesnik
4 1.6% Daniel Fuchs
4 1.6% Stefan Karlsson
4 1.6% Alexey Semenyuk
4 1.6% Lance Andersen
4 1.6% Jonathan Gibbons
3 1.2% Brian Burkhalter
3 1.2% Abhishek Kumar
3 1.2% Alex Menkov
3 1.2% Thomas Schatzl
3 1.2% Daniel Jelinski
3 1.2% Alexey Ivanov
3 1.2% Mandy Chung
3 1.2% Christian Hagedorn
2 0.8% Calvin Cheung
2 0.8% Albert Yang
2 0.8% Tejesh R
2 0.8% Douglas Simon
2 0.8% Sean Coffey
2 0.8% Maurizio Cimadamore
2 0.8% Roger Riggs
2 0.8% Alexander Zvegintsev
2 0.8% Kim Barrett
2 0.8% Alexander Zuev
2 0.8% Magnus Ihse Bursie
2 0.8% Erik Gahlin
2 0.8% Lawrence Andrews
2 0.8% Rajan Halade
2 0.8% Alisen Chung
2 0.8% Jesper Wilhelmsson
1 0.4% Sibabrata Sahoo
1 0.4% Sean Mullan
1 0.4% Alan Bateman
1 0.4% Michael McMahon
1 0.4% Haimay Chao
1 0.4% Stefan Johansson
1 0.4% Jim Laskey
1 0.4% Kevin Walls
1 0.4% Tobias Hartmann
1 0.4% Brent Christian
1 0.4% Erik Joelsson
1 0.4% Rajat Mahajan
1 0.4% Prajwal Kumaraswamy
1 0.4% David Holmes
1 0.4% Prasadarao Koppula
1 0.4% Mikhailo Seledtsov
1 0.4% Claes Redestad
1 0.4% Dmitry Markov
1 0.4% Vladimir Kozlov
1 0.4% Afshin Zafari
1 0.4% Joe Darcy
1 0.4% Philip Race
1 0.4% Sangheon Kim
1 0.4% Serguei Spitsyn
1 0.4% Alexander Matveev
1 0.4% Viktor Klang
25 10.3% SAP
7 2.9% Christoph Langer
7 2.9% Matthias Baesken
6 2.5% Martin Doerr
3 1.2% Goetz Lindenmaier
2 0.8% Richard Reingruber
18 7.4% Amazon
11 4.5% Aleksey Shipilev
2 0.8% Elif Aslan
2 0.8% Sergey Bylokhov
1 0.4% Roy Soumadipta
1 0.4% Yi-Fan Tsai
1 0.4% William Kemper
14 5.8% Independent
3 1.2% Eirik Bjørsnøs
2 0.8% Gui Cao
2 0.8% Guoxiong Li
1 0.4% Andrey Turbanov
1 0.4% REDMOND+singhnitin
1 0.4% Zhengyu Gu
1 0.4% 609083568
1 0.4% Yumin Qi
1 0.4% amitlocham09
1 0.4% Archie Cobbs
9 3.7% Red Hat
2 0.8% Robert Toyonaga
2 0.8% Thomas Stuefe
2 0.8% Roland Westrelin
1 0.4% Sonia Zaldana Calles
1 0.4% Martin Balao
1 0.4% Severin Gehwolf
3 1.2% IBM
2 0.8% Amit Kumar
1 0.4% psoujany
3 1.2% Rivos
3 1.2% Robbin Ehn
3 1.2% Unknown
1 0.4% N/A
1 0.4% syan
1 0.4% sroy
2 0.8% Alibaba
1 0.4% gaodan.gao
1 0.4% xingqizheng.xqz
2 0.8% Loongson
1 0.4% sunxu01
1 0.4% Sun Yaqi
1 0.4% @gentoo.org
1 0.4% sam
1 0.4% @imt-soft.com
1 0.4% songpv
1 0.4% Ampere
1 0.4% Patrick Zhang
1 0.4% Azul
1 0.4% Jan Kratochvil
1 0.4% BellSoft
1 0.4% Boris Ulasevich
1 0.4% Google
1 0.4% Liam Miller-Cushon
1 0.4% Huawei
1 0.4% Hamlin Li
1 0.4% Tencent
1 0.4% Xuelei Fan
1 0.4% VMWare
1 0.4% Vyom Tewari

Chronological push log:

UTC Time Priority Component Bug Summary This Release Push By Original Push By
Name Affiliation Name Affiliation
2024/05/29 06:57 P3 tools/jpackage JDK-8333143 System.exit(0) kills the launched 3rd party application Martin Doerr SAP Alexey Semenyuk Oracle
2024/05/28 20:05 P3 tools/jpackage JDK-8333115 Launcher causes lingering busy cursor Martin Doerr SAP Alexey Semenyuk Oracle
2024/05/28 17:12 P3 hotspot/gc JDK-8333102 Parallel: Parallel GC resizes heap even if -Xms = -Xmx Ben Taylor Amazon Zhengyu Gu Independent
2024/05/28 08:32 P4 core-libs/java.lang JDK-8333039 java/lang/ProcessBuilder/PipelineLeaksFD.java fail: More or fewer pipes than expected rkmaurya Amazon Roger Riggs Oracle
2024/05/28 08:32 P4 core-libs/java.lang JDK-8333038 File descriptor leak with ProcessBuilder.startPipeline rkmaurya Amazon Roger Riggs Oracle
2024/05/28 05:17 P4 hotspot/runtime JDK-8333020 gtest wrappers should be marked as flagless syan Unknown Leonid Mesnik Oracle
2024/05/27 09:32 P4 tools/jpackage JDK-8332970 [macos] Test tools/jpackage/macosx/MacAppStoreJlinkOptionsTest.java timed out on macOS Andrew Lu SAP Alexander Matveev Oracle
2024/05/27 08:30 P4 core-libs/java.lang:reflect JDK-8332963 Reduce memory footprint of java.lang.reflect.Constructor/Method Aleksey Shipilev Amazon Claes Redestad Oracle
2024/05/23 21:17 P4 hotspot/runtime JDK-8332848 Replace the deprecated/obsolete gethostbyname and inet_addr calls fitzsim Red Hat David Holmes Oracle
2024/05/23 09:21 P3 hotspot/test JDK-8332801 test/hotspot/jtreg/applications/ctw/modules/jdk_crypto_ec.java cannot handle empty modules Andrew Lu SAP Leonid Mesnik Oracle
2024/05/23 09:20 P4 tools/jpackage JDK-8332799 tools/jpackage/share/RuntimeImageTest.java fails with -XX:+UseZGC Andrew Lu SAP Alexey Semenyuk Oracle
2024/05/23 09:19 P4 hotspot/compiler JDK-8332798 Add more test cases for JDK-8319372 Andrew Lu SAP Christian Hagedorn Oracle
2024/05/22 21:55 P4 hotspot/runtime JDK-8332763 Consolidate file_exists into os:file_exists Elif Aslan Amazon Yumin Qi Independent
2024/05/17 14:09 P3 security-libs/java.security JDK-8332481 Add GlobalSign 2 TLS root certificates ariasdereyna Red Hat Rajan Halade Oracle
2024/05/17 08:26 P4 client-libs JDK-8332446 Compilation failures in java.desktop module with gcc 14 Jan Kratochvil Azul sam @gentoo.org
2024/05/16 13:35 P4 core-libs/java.net JDK-8332392 Use pattern matching for instanceof in KeepAliveCache Christoph Langer SAP (same) (same)
2024/05/16 11:22 P4 infrastructure/build JDK-8332385 error: template-id not allowed for constructor/destructor in C++20 Jan Kratochvil Azul (same) (same)
2024/05/16 11:22 P4 hotspot/runtime JDK-8332384 Remove unnecessary template parameter lists in GrowableArray Jan Kratochvil Azul Kim Barrett Oracle
2024/05/16 11:21 P4 client-libs/2d JDK-8332383 Build failure with GCC8.3.1 after 8313643 Jan Kratochvil Azul 609083568 Independent
2024/05/16 10:18 P4 core-libs/java.net JDK-8332379 Reduce runtime and improve efficiency of KeepAliveTest Christoph Langer SAP (same) (same)
2024/05/16 08:30 P4 hotspot/runtime JDK-8332366 LogConfigurationTest intermittently fails on AArch64 Liang Mao Alibaba gaodan.gao Alibaba
2024/05/16 07:17 P4 hotspot/runtime JDK-8332355 On Linux aarch64, CDS archives should be using 64K alignment by default Thomas Stuefe Red Hat (same) (same)
2024/05/16 02:03 P4 hotspot/gc JDK-8332339 TestPLABResize.java and TestPLABPromotion.java are failing intermittently Andrew Lu SAP Leonid Mesnik Oracle
2024/05/14 14:15 P4 tools/jlink JDK-8332234 New test JmodExcludedFiles.java fails on Windows when --with-external-symbols-in-bundles=public is used Sonia Zaldana Calles Red Hat Christoph Langer SAP
2024/05/14 09:31 P4 hotspot/runtime JDK-8332221 [PPC64] Use more constexpr in class Register Martin Doerr SAP (same) (same)
2024/05/14 08:20 P4 tools/javadoc(tool) JDK-8332183 jdk/javadoc/tool/CheckManPageOptions.java depends on source hierarchy Andrew Lu SAP Jonathan Gibbons Oracle
2024/05/14 08:20 P3 hotspot/svc JDK-8332182 vmTestbase/nsk/jvmti/scenarios/hotswap/HS201/hs201t002/TestDescription.java fails with NoClassDefFoundError Andrew Lu SAP Alex Menkov Oracle
2024/05/13 17:00 P4 hotspot/jvmti JDK-8332162 JvmtiEventControllerPrivate::set_event_callbacks CLEARING_MASK computation is incorrect Roman Marchenko Azul Serguei Spitsyn Oracle
2024/05/13 14:27 P3 hotspot/runtime JDK-8332152 [s390x] Represent Registers as values Amit Kumar IBM (same) (same)
2024/05/13 12:40 P3 security-libs/java.security JDK-8332150 sun/security/mscapi/KeytoolChangeAlias.java fails with "Alias <246810> does not exist" syan Unknown Matthew Donovan Oracle
2024/05/13 12:21 P4 hotspot/compiler JDK-8332149 Some jtreg tests failing on x86 with error 'unrecognized VM options' (C2 flags) syan Unknown REDMOND+singhnitin Independent
2024/05/13 12:15 P3 hotspot/compiler JDK-8332147 [S390] Need to bailout cleanly if creation of stubs fails when code cache is out of space Amit Kumar IBM (same) (same)
2024/05/13 10:41 P3 hotspot/compiler JDK-8332137 PPC64: Represent Registers as values Martin Doerr SAP (same) (same)
2024/05/13 09:17 P4 hotspot/gc JDK-8332135 TestStringDeduplicationInterned.java waits for the wrong condition acmoraru Amazon Stefan Karlsson Oracle
2024/05/10 12:41 P4 hotspot/svc JDK-8332069 Enable parallelism in vmTestbase/nsk/monitoring/stress/lowmem tests acmoraru Amazon Aleksey Shipilev Amazon
2024/05/10 09:19 P3 core-libs/java.nio JDK-8332045 (dc) DatagramSocket.receive does not always throw when the channel is closed Goetz Lindenmaier SAP Alan Bateman Oracle
2024/05/10 07:09 P3 client-libs/javax.swing JDK-8332027 Test javax/swing/JFileChooser/4524490/bug4524490.java fails with InvocationTargetException Andrew Lu SAP Prasanta Sadhukhan Oracle
2024/05/09 09:38 P5 core-svc/debugger JDK-8331990 Remove sun/tools/jhsdb/BasicLauncherTest.java from problem list Christoph Langer SAP Martin Doerr SAP
2024/05/08 13:55 P4 hotspot/compiler JDK-8331938 Improve assert_different_registers Martin Doerr SAP Kim Barrett Oracle
2024/05/08 12:38 P4 hotspot/runtime JDK-8331933 [s390] CPUInfoTest fails due to uppercase feature string Amit Kumar IBM amitlocham09 Independent
2024/05/06 08:40 P4 infrastructure/build JDK-8331641 [17u]: Bump GHA bootstrap JDK to 17.0.11 Christoph Langer SAP (same) (same)
2024/05/05 04:29 P4 hotspot/compiler JDK-8331690 RISC-V: Save and restore FRM in the call stub Gui Cao Independent Hamlin Li Huawei
2024/05/04 06:31 P3 core-libs/javax.naming JDK-8331685 Inconsistent behavior in com.sun.jndi.ldap.Connection::createSocket Christoph Langer SAP (same) (same)
2024/04/30 15:26 P4 hotspot/jfr JDK-8331430 JFR: CompilerPhase event test fails on windows 32 bit Robert Toyonaga Red Hat (same) (same)
2024/04/30 07:27 P4 tools/jlink JDK-8331387 Copyright year was modified unintentionally in jlink.properties and ImagePluginStack.java Matthias Baesken SAP Calvin Cheung Oracle
2024/04/30 07:26 P4 tools/jlink JDK-8331386 CDSPluginTest should only expect classes_nocoops.jsa exists on supported 64-bit platforms Matthias Baesken SAP sunxu01 Loongson
2024/04/29 13:44 P2 hotspot/gc JDK-8331308 Epsilon: Premature OOM when allocating object larger than uncommitted heap size Aleksey Shipilev Amazon Guoxiong Li Independent
2024/04/29 10:02 P5 hotspot/runtime JDK-8331289 RISC-V: Range check auipc + signed 12 imm instruction Robbin Ehn Rivos (same) (same)
2024/04/29 08:36 P4 infrastructure/build JDK-8331270 createJMHBundle.sh support configurable maven repo mirror syan Unknown (same) (same)
2024/04/29 07:41 P4 tools/jlink JDK-8330018 Generate CDS archive when creating custom JDK image Matthias Baesken SAP Calvin Cheung Oracle
2024/04/29 04:15 P4 client-libs/2d JDK-8331256 Add a test to check default rendering engine Sergey Bylokhov Amazon (same) (same)
2024/04/28 21:52 P4 hotspot/compiler JDK-8331249 javax/management/remote/mandatory/notif/NotifReconnectDeadlockTest.java fails on libgraal Amos SHI SAP Douglas Simon Oracle
2024/04/28 21:51 P4 client-libs/javax.swing JDK-8331248 Open source several Swing HTMLDocument related tests Amos SHI SAP Harshitha Onkar Oracle
2024/04/28 21:51 P4 core-libs/java.util.logging JDK-8331247 StackOverflowError when starting Apache Tomcat with signed jar Amos SHI SAP Sean Coffey Oracle
2024/04/28 21:50 P3 core-libs/java.util.concurrent JDK-8331240 java/util/concurrent/ConcurrentLinkedQueue/WhiteBox.java shows intermittent failures on linux ppc64le and aarch64 Amos SHI SAP Viktor Klang Oracle
2024/04/28 21:50 P4 core-libs/java.net JDK-8331239 java/net/httpclient/ManyRequest.java should not use "localhost" in URIs Amos SHI SAP Daniel Fuchs Oracle
2024/04/28 21:48 P4 client-libs/java.awt JDK-8331238 [macos14] Problem list tests which fail due to macOS bug described in JDK-8322653 Amos SHI SAP Harshitha Onkar Oracle
2024/04/28 20:12 P4 tools/jlink JDK-8331234 Add a test to verify JMOD files created in the images do not have debug symbols Sonia Zaldana Calles Red Hat Mandy Chung Oracle
2024/04/26 09:00 P4 infrastructure/build JDK-8331173 AppendFile/WriteFile has differences between make 3.81 and 4+ Roman Marchenko Azul Magnus Ihse Bursie Oracle
2024/04/26 08:59 P4 hotspot/jfr JDK-8331172 jdk/jfr/jcmd/TestJcmdDumpPathToGCRoots.java failed with "Expected chains but found none" Robert Toyonaga Red Hat Erik Gahlin Oracle
2024/04/26 08:54 P2 hotspot/gc JDK-8331171 Epsilon: 'EpsilonHeap::allocate_work' misuses the parameter 'size' as size in bytes Aleksey Shipilev Amazon Guoxiong Li Independent
2024/04/25 15:14 P3 core-libs/java.nio JDK-8331138 NPE when creating default file system when default file system provider is packaged as JAR file on class path Amos SHI SAP Lance Andersen Oracle
2024/04/25 15:11 P2 client-libs/java.awt JDK-8331136 [macos14] Running any AWT app prints Secure coding warning Amos SHI SAP Harshitha Onkar Oracle
2024/04/25 09:12 P4 hotspot/gc JDK-8331110 G1: Excessive is_obj_dead_cond calls in verification Aleksey Shipilev Amazon Stefan Karlsson Oracle
2024/04/23 07:19 P3 core-libs/java.util JDK-8330899 Robustness improvements to java/util/prefs/AddNodeChangeListener.jar Amos SHI SAP Brent Christian Oracle
2024/04/23 07:19 P4 core-svc/javax.management JDK-8330897 javax/management/remote/mandatory/notif/NotifReconnectDeadlockTest.java update Amos SHI SAP Kevin Walls Oracle
2024/04/23 07:18 P4 client-libs/javax.swing JDK-8330896 Open source few more swing text/html tests Amos SHI SAP Prasanta Sadhukhan Oracle
2024/04/23 07:18 P4 client-libs JDK-8330895 Modify TrayIconScalingTest.java, PrintLatinCJKTest.java to use new PassFailJFrame's builder pattern usage Amos SHI SAP Lawrence Andrews Oracle
2024/04/23 07:18 P4 client-libs/java.awt JDK-8330894 Open source AWT Key, Text Event related tests Amos SHI SAP Harshitha Onkar Oracle
2024/04/23 07:17 P3 client-libs/javax.swing JDK-8330885 Background not refreshed when painting over a transparent JFrame Amos SHI SAP Tejesh R Oracle
2024/04/23 07:17 P4 client-libs/java.awt JDK-8330884 Open source AWT Event related tests Amos SHI SAP Harshitha Onkar Oracle
2024/04/23 07:16 P4 client-libs/javax.swing JDK-8330883 Open source few swing JFormattedTextField and JPopupMenu tests Amos SHI SAP Abhishek Kumar Oracle
2024/04/23 07:14 P4 client-libs/javax.swing JDK-8330882 Opensource SwingGraphics manual test Amos SHI SAP Prasanta Sadhukhan Oracle
2024/04/23 07:14 P4 hotspot/test JDK-8330876 Allow TEST_VM_FLAGLESS to set flagless mode Amos SHI SAP Leonid Mesnik Oracle
2024/04/23 07:13 P4 client-libs/javax.swing JDK-8330874 Opensource JTextArea manual tests Amos SHI SAP Prasanta Sadhukhan Oracle
2024/04/23 07:13 P4 client-libs/javax.swing JDK-8330873 Open source several Swing Text/HTML related tests Amos SHI SAP Harshitha Onkar Oracle
2024/04/23 06:41 P3 client-libs/javax.swing JDK-8330867 GetGraphicsTest needs to be headful Amos SHI SAP Prasanta Sadhukhan Oracle
2024/04/23 06:41 P4 client-libs/java.awt JDK-8330866 Open source AWT Graphics,GridBagLayout related tests Amos SHI SAP Prasanta Sadhukhan Oracle
2024/04/22 13:56 P4 core-libs/java.nio JDK-8330830 (zipfs) jdk/jdk/nio/zipfs/TestLocOffsetFromZip64EF.java failing with ZipException:R0 on OL9 Goetz Lindenmaier SAP Eirik Bjørsnøs Independent
2024/04/22 13:56 P4 core-libs/java.nio JDK-8330827 (zipfs) Make test/jdk/jdk/nio/zipfs/TestLocOffsetFromZip64EF.java independent of the zip command line Goetz Lindenmaier SAP Eirik Bjørsnøs Independent
2024/04/22 13:52 P4 hotspot/compiler JDK-8330826 compiler/c2/aarch64/TestFarJump.java fails on AArch64 due to unexpected PrintAssembly output Goetz Lindenmaier SAP Boris Ulasevich BellSoft
2024/04/22 01:10 P3 security-libs/java.security JDK-8330756 Add a security category to the java -XshowSettings option Andrew Lu SAP Sean Coffey Oracle
2024/04/19 14:39 P4 hotspot/runtime JDK-8330692 Monitor deflation unlink phase prolongs time to safepoint Aleksey Shipilev Amazon (same) (same)
2024/04/19 10:12 P3 core-libs/java.net JDK-8330651 HttpURLConnection cache issues leading to crashes in JGSS w/ native GSS introduced by 8303809 Andrew Lu SAP Michael McMahon Oracle
2024/04/19 10:10 P3 security-libs/javax.crypto:pkcs11 JDK-8330649 sun/security/pkcs11 tests fail on Linux RHEL 8.6 and newer Andrew Lu SAP Matthew Donovan Oracle
2024/04/19 09:39 P4 hotspot/runtime JDK-8330637 RISC-V: Simplify and remove CORRECT_COMPILER_ATOMIC_SUPPORT in atomic_linux_riscv.hpp Gui Cao Independent (same) (same)
2024/04/19 09:39 P5 hotspot/runtime JDK-8330636 RISC-V: Remove PlatformCmpxchg<4> Gui Cao Independent Robbin Ehn Rivos
2024/04/19 09:39 P4 hotspot/runtime JDK-8330635 RISC-V: Shenandoah GC crashes due to incorrect atomic memory operations Gui Cao Independent xingqizheng.xqz Alibaba
2024/04/18 01:06 P4 client-libs JDK-8330550 Refactor timeout handler in PassFailJFrame Andrew Lu SAP Alexey Ivanov Oracle
2024/04/18 01:05 P4 client-libs/javax.swing JDK-8330547 Opensource JMenuBar manual test Andrew Lu SAP Prasanta Sadhukhan Oracle
2024/04/16 09:07 P4 client-libs/java.awt JDK-8330350 [macos14] Problem list LightweightEventTest.java which fails due to macOS bug described in JDK-8322653 Goetz Lindenmaier SAP N/A Unknown
2024/04/16 09:05 P3 security-libs/java.security JDK-8330349 JDK server does not send a dummy change_cipher_spec record after HelloRetryRequest message Goetz Lindenmaier SAP Prasadarao Koppula Oracle
2024/04/16 09:03 P4 core-libs/java.util:i18n JDK-8330348 Update IANA Language Subtag Registry to Version 2024-03-07 Goetz Lindenmaier SAP Justin Lu Oracle
2024/04/16 09:00 P4 core-libs/java.net JDK-8330347 java/net/httpclient/MaxStreams.java failed with didn't finish within the time-out Goetz Lindenmaier SAP Daniel Jelinski Oracle
2024/04/16 08:56 P4 tools/javadoc(tool) JDK-8330346 remove boilerplate from use of runTests Goetz Lindenmaier SAP Jonathan Gibbons Oracle
2024/04/16 01:57 P4 client-libs/javax.swing JDK-8330300 test javax/swing/JSplitPane/4885629/bug4885629.java fails on windows hidpi Andrew Lu SAP Philip Race Oracle
2024/04/11 12:41 P4 hotspot/compiler JDK-8330102 RISC-V: Need to sync CPU features with related JVM flags Gui Cao Independent (same) (same)
2024/04/11 09:31 P4 core-libs/java.util:i18n JDK-8330091 Update IANA Language Subtag Registry to Version 2023-10-16 Goetz Lindenmaier SAP Justin Lu Oracle
2024/04/11 09:29 P4 core-libs/java.net JDK-8330090 Improve test proxy performance Goetz Lindenmaier SAP Daniel Jelinski Oracle
2024/04/11 09:28 P4 core-libs/java.net JDK-8330089 Update HttpInputStreamTest and BodyProcessorInputStreamTest to use hg.openjdk.org Goetz Lindenmaier SAP Jaikiran Pai Oracle
2024/04/11 09:26 P4 core-libs/java.net JDK-8330088 Update java/net/httpclient/BasicAuthTest.java to check basic auth over HTTP/2 Goetz Lindenmaier SAP Daniel Fuchs Oracle
2024/04/11 09:25 P4 tools JDK-8330086 Fix typos in test/langtools files Goetz Lindenmaier SAP Jaikiran Pai Oracle
2024/04/11 08:39 P3 client-libs/java.awt JDK-8330082 AWT Assertion Failure in ::GetDIBits(hBMDC, hBM, 0, 1, 0, gpBitmapInfo, 0) 'awt_Win32GraphicsDevice.cpp', at line 185 Christoph Langer SAP (same) (same)
2024/04/11 07:09 P4 hotspot/gc JDK-8330073 Enable parallelism in vmTestbase/gc/vector tests Roy Soumadipta Amazon (same) (same)
2024/04/09 18:22 P4 client-libs/javax.swing JDK-8329978 Open source several Swing JSpinner related tests Amos SHI SAP Tejesh R Oracle
2024/04/09 18:18 P3 core-libs/java.lang JDK-8329977 NegativeArraySizeException decoding >1G UTF8 bytes with non-ascii characters Amos SHI SAP Jim Laskey Oracle
2024/04/09 18:15 P4 client-libs/java.awt JDK-8329973 System Tray icons get corrupted when Windows primary monitor changes Amos SHI SAP Harshitha Onkar Oracle
2024/04/09 09:14 P4 hotspot/compiler JDK-8329946 enhance assert message "relocation addr must be in this section" Matthias Baesken SAP (same) (same)
2024/04/09 08:40 P4 hotspot/runtime JDK-8329941 RISC-V: Features string uses wrong separator for jtreg Gui Cao Independent Robbin Ehn Rivos
2024/04/08 12:45 P4 core-libs/java.util:i18n JDK-8329860 Update IANA Language Subtag Registry to Version 2023-08-02 Goetz Lindenmaier SAP Justin Lu Oracle
2024/04/08 12:11 P4 core-libs/java.util:i18n JDK-8329852 Refactor more Locale tests to use JUnit Goetz Lindenmaier SAP Justin Lu Oracle
2024/04/08 08:17 P4 infrastructure/release_eng JDK-8330503 [17u] Remove designator DEFAULT_PROMOTED_VERSION_PRE=ea for release 17.0.11 Christoph Langer SAP (same) (same)
2024/04/05 18:51 P4 security-libs/javax.security JDK-8329799 Better validation for com.sun.security.ocsp.useget option Aleksey Shipilev Amazon (same) (same)
2024/04/05 18:51 P4 security-libs/javax.security JDK-8329798 Fallback option for POST-only OCSP requests Aleksey Shipilev Amazon (same) (same)
2024/04/05 11:32 P4 hotspot/svc JDK-8329770 sun/jvmstat/monitor/MonitoredVm/MonitorVmStartTerminate.java ignores VM flags Goetz Lindenmaier SAP Leonid Mesnik Oracle
2024/04/05 11:30 P4 core-libs/java.util:i18n JDK-8329768 Update IANA Language Subtag Registry to Version 2023-05-11 Goetz Lindenmaier SAP Justin Lu Oracle
2024/04/05 10:45 P4 core-libs/java.util:i18n JDK-8329763 Update IANA Language Subtag Registry to Version 2023-04-13 Goetz Lindenmaier SAP Justin Lu Oracle
2024/04/05 10:43 P5 client-libs/javax.swing JDK-8329762 Remove unused fields in StyleSheet Goetz Lindenmaier SAP Andrey Turbanov Independent
2024/04/05 07:03 P4 hotspot/test JDK-8329744 crashes in docker container tests on Linuxppc64le Power8 machines Matthias Baesken SAP (same) (same)
2024/04/05 07:01 P4 hotspot/runtime JDK-8329743 set -XX:+ErrorFileToStderr when executing java in containers for some container related jtreg tests Matthias Baesken SAP (same) (same)
2024/04/05 07:00 P4 client-libs/javax.accessibility JDK-8329742 src/jdk.accessibility/windows/native/libjavaaccessbridge/AccessBridgeJavaEntryPoints.cpp ReleaseStringChars might be missing in early returns Matthias Baesken SAP (same) (same)
2024/04/04 20:56 P4 core-libs/java.lang.foreign JDK-8329713 Test java/foreign/channels/TestAsyncSocketChannels.java failed: IllegalStateException: Already closed Goetz Lindenmaier SAP Maurizio Cimadamore Oracle
2024/04/04 20:54 P4 core-libs/java.net JDK-8329711 Introduce convenience test library APIs for creating test servers for tests in test/jdk/java/net/httpclient Goetz Lindenmaier SAP Jaikiran Pai Oracle
2024/04/04 20:53 P3 tools/javadoc(tool) JDK-8329708 Add a check in JavadocTester for "javadoc should not crash" Goetz Lindenmaier SAP Jonathan Gibbons Oracle
2024/04/03 11:57 P4 hotspot/svc JDK-8329601 Remove remaining usages of -Xdebug from test/hotspot/jtreg Goetz Lindenmaier SAP Jaikiran Pai Oracle
2024/04/03 11:43 P4 core-libs JDK-8329599 Clean up tests that reference deploy modules Goetz Lindenmaier SAP Mandy Chung Oracle
2024/04/03 11:36 P4 core-libs/java.util:i18n JDK-8329598 Update IANA Language Subtag Registry to Version 2023-03-22 Goetz Lindenmaier SAP Justin Lu Oracle
2024/04/03 09:08 P4 core-libs/java.math JDK-8329578 Review running times of java.math tests Goetz Lindenmaier SAP Brian Burkhalter Oracle
2024/04/03 09:07 P4 core-libs/java.rmi JDK-8329577 Refactor open/test/jdk/javax/rmi/ssl/SSLSocketParametersTest.sh to jtreg java test Goetz Lindenmaier SAP Matthew Donovan Oracle
2024/04/03 09:03 P4 core-libs/java.util:i18n JDK-8329576 Update IANA Language Subtag Registry to Version 2023-02-14 Goetz Lindenmaier SAP Justin Lu Oracle
2024/04/03 09:01 P4 security-libs JDK-8329575 TestMD5Intrinsics and TestMD5MultiBlockIntrinsics don't test the intrinsics Goetz Lindenmaier SAP Yi-Fan Tsai Amazon
2024/04/03 07:30 P4 hotspot/runtime JDK-8329566 Move class loading Events to a separate section in hs_err files Matthias Baesken SAP Stefan Karlsson Oracle
2024/04/02 09:15 P4 hotspot/jfr JDK-8329507 JFR: Test for CompilerCompile events fails due to time out Robert Toyonaga Red Hat (same) (same)
2024/04/02 09:14 P3 core-libs/java.net JDK-8329506 HttpResponseInputStream.available() returns 1 on empty stream Sonia Zaldana Calles Red Hat Vyom Tewari VMWare
2024/04/02 09:12 P4 hotspot/gc JDK-8329504 Enable parallelism in vmTestbase/vm/gc/concurrent tests Elif Aslan Amazon (same) (same)
2024/04/02 08:39 P4 core-libs/java.lang.invoke JDK-8329495 MethodHandleProxies does not correctly invoke default methods with varags ariasdereyna Red Hat Mandy Chung Oracle
2024/04/02 04:38 P4 client-libs/javax.swing JDK-8329476 Open source few Swing event and AbstractAction tests Andrew Lu SAP Prasanta Sadhukhan Oracle
2024/04/02 04:37 P4 client-libs/java.awt JDK-8329475 Open source several AWT Focus related tests Andrew Lu SAP Prasanta Sadhukhan Oracle
2024/04/02 04:37 P4 client-libs/java.awt JDK-8329473 Open source few AWT Focus related tests Andrew Lu SAP Prasanta Sadhukhan Oracle
2024/04/01 16:31 P3 core-libs/java.nio JDK-8329409 java/nio/channels/FileChannel/FileExtensionAndMap.java is too slow Goetz Lindenmaier SAP Brian Burkhalter Oracle
2024/04/01 16:28 P4 tools/javac JDK-8329408 several regression tests have a main method that is never executed Goetz Lindenmaier SAP Archie Cobbs Independent
2024/04/01 16:28 P3 core-libs/java.net JDK-8329407 java/net/HttpURLConnection/SetAuthenticator/HTTPSetAuthenticatorTest.java failed with "BindException: Address already in use: connect" Goetz Lindenmaier SAP Daniel Fuchs Oracle
2024/04/01 16:26 P4 core-libs/java.net JDK-8329404 Drop the test/jdk/java/net/httpclient/reactivestreams-tck-tests/TckDriver.java test Goetz Lindenmaier SAP Daniel Fuchs Oracle
2024/04/01 16:24 P4 tools/javac JDK-8329403 diags-examples.xml is broken Goetz Lindenmaier SAP Jonathan Gibbons Oracle
2024/04/01 16:23 P4 core-libs/java.net JDK-8329402 HttpURLConnection default Accept header is malformed according to HTTP/1.1 RFC Goetz Lindenmaier SAP Daniel Jelinski Oracle
2024/04/01 15:30 P4 hotspot/compiler JDK-8329399 improve assert(idx < _maxlrg) failed: oob Matthias Baesken SAP (same) (same)
2024/04/01 09:43 P4 hotspot/runtime JDK-8329388 Allow loading of shared objects with .a extension on AIX sroy Unknown (same) (same)
2024/04/01 01:56 P3 hotspot/runtime JDK-8329372 Update and move siphash license Andrew Lu SAP Jesper Wilhelmsson Oracle
2024/03/29 21:02 P3 hotspot/compiler JDK-8329349 ciReplay: SIGSEGV if classfile for replay compilation is not present after JDK-8275868 Goetz Lindenmaier SAP Christian Hagedorn Oracle
2024/03/29 16:50 P3 security-libs/java.security JDK-8329334 Use ForceGC for cleaner test cases Andrew Hughes Red Hat Xuelei Fan Tencent
2024/03/29 08:01 P4 hotspot/compiler JDK-8329306 ciReplay: Inlining fails with "unloaded signature classes" due to wrong protection domains Goetz Lindenmaier SAP Christian Hagedorn Oracle
2024/03/28 18:11 P4 core-libs/java.lang JDK-8329290 Enable java/lang/ProcessBuilder/JspawnhelperProtocol.java on Mac Elif Aslan Amazon (same) (same)
2024/03/28 10:28 P4 core-svc/debugger JDK-8329249 AttachingConnector/attach/attach001 failed due to "bind failed: Address already in use" Goetz Lindenmaier SAP Alex Menkov Oracle
2024/03/28 10:25 P4 core-libs/java.net JDK-8329247 Move the Http2TestServer and related classes into a package of its own Goetz Lindenmaier SAP Jaikiran Pai Oracle
2024/03/28 08:00 P3 client-libs/2d JDK-8329240 sun/java2d/cmm/ColorConvertOp/ColConvTest.java assumes profiles were generated by LCMS Andrew Lu SAP Dmitry Markov Oracle
2024/03/28 07:59 P4 hotspot/test JDK-8329236 gtest runner repeats test name for every single gtest assertion Andrew Lu SAP Sonia Zaldana Calles Red Hat
2024/03/27 10:02 P4 hotspot/runtime JDK-8329172 gtest/LargePageGtests.java#use-large-pages failed "os.release_one_mapping_multi_commits_vm" Goetz Lindenmaier SAP Afshin Zafari Oracle
2024/03/27 09:16 P3 security-libs/java.security JDK-8329170 Google CAInterop test failures Aleksey Shipilev Amazon Rajan Halade Oracle
2024/03/26 08:18 P1 infrastructure/build JDK-8329076 GHA: Restoring sysroot from cache skips the build after JDK-8326960 Aleksey Shipilev Amazon (same) (same)
2024/03/25 18:07 P4 infrastructure/build JDK-8328981 GHA: Cross-compilation jobs do not require build JDK Aleksey Shipilev Amazon (same) (same)
2024/03/25 17:54 P3 security-libs JDK-8328968 Remove hard-coded 127.0.0.1 loopback address Goetz Lindenmaier SAP Liam Miller-Cushon Google
2024/03/25 17:50 P4 core-svc/debugger JDK-8328967 serviceability/jdwp/AllModulesCommandTest.java failed with "Debuggee error: 'ERROR: transport error 202: bind failed: Address already in use'" Goetz Lindenmaier SAP Alex Menkov Oracle
2024/03/25 08:52 P4 infrastructure/build JDK-8328891 GHA: RISC-V sysroot cannot be debootstrapped due to ongoing Debian t64 transition Aleksey Shipilev Amazon (same) (same)
2024/03/25 08:24 P4 hotspot/runtime JDK-8328887 os::Linux::print_proc_sys_info add swappiness information Matthias Baesken SAP (same) (same)
2024/03/22 02:12 P4 security-libs/javax.net.ssl JDK-8328760 Log X509ExtendedKeyManager implementation class name in TLS/SSL connection Andrew Lu SAP Prajwal Kumaraswamy Oracle
2024/03/22 02:12 P4 client-libs/java.awt JDK-8328759 Open source misc awt tests Andrew Lu SAP Prasanta Sadhukhan Oracle
2024/03/21 12:32 P4 hotspot/runtime JDK-8328696 Few runtime/os tests ignore vm flags Goetz Lindenmaier SAP Mikhailo Seledtsov Oracle
2024/03/21 12:30 P4 core-libs JDK-8328694 Update the Zlib version in open/src/java.base/share/legal/zlib.md to 1.3.1 Goetz Lindenmaier SAP Lance Andersen Oracle
2024/03/21 12:30 P4 core-libs/java.util.jar JDK-8328693 Update Zlib Data Compression Library to Version 1.3 Goetz Lindenmaier SAP Lance Andersen Oracle
2024/03/21 12:30 P4 core-libs/java.util.jar JDK-8328692 Update Zlib Data Compression Library to Version 1.3.1 Goetz Lindenmaier SAP Lance Andersen Oracle
2024/03/21 12:28 P4 security-libs/java.security JDK-8328691 java/security/cert/CertPathValidator/OCSP/GetAndPostTests.java -- test server didn't start in timely manner Goetz Lindenmaier SAP Matthew Donovan Oracle
2024/03/21 12:26 P4 client-libs/javax.swing JDK-8328688 Update JInternalFrame Metal Border code Goetz Lindenmaier SAP Harshitha Onkar Oracle
2024/03/21 08:36 P4 hotspot/gc JDK-8328674 Shenandoah: Clarify gc state usage William Kemper Amazon (same) (same)
2024/03/20 20:41 P4 core-libs/java.util JDK-8328640 java/util/Formatter/Padding.java fails on some Locales Christoph Langer SAP Aleksey Shipilev Amazon
2024/03/20 09:00 P4 core-libs/java.lang JDK-8328586 [x86] StringRepeat.java failure on linux-x86: Could not reserve enough space for 2097152KB object heap Goetz Lindenmaier SAP (same) (same)
2024/03/20 08:58 P4 core-libs/java.util:collections JDK-8328583 WhiteBoxResizeTest failure on linux-x86: Could not reserve enough space for 2097152KB object heap Goetz Lindenmaier SAP Jaikiran Pai Oracle
2024/03/19 20:35 P4 hotspot/compiler JDK-8328554 Shenandoah: SIGSEGV crash in unnecessary_acquire due to LoadStore split through phi Dan Lutker Amazon Roland Westrelin Red Hat
2024/03/19 14:04 P4 hotspot/test JDK-8328519 Some ProcessTools.execute* functions are declared to throw Throwable Goetz Lindenmaier SAP Stefan Karlsson Oracle
2024/03/19 14:03 P4 core-libs JDK-8328517 Remove javax/rmi/ssl/SSLSocketParametersTest.sh from ProblemList Goetz Lindenmaier SAP Matthew Donovan Oracle
2024/03/19 14:00 P4 client-libs/javax.swing JDK-8328515 Background of JInternalFrame is located out of JInternalFrame Goetz Lindenmaier SAP Harshitha Onkar Oracle
2024/03/15 19:51 P3 hotspot/compiler JDK-8328296 [PPC64] Need to bailout cleanly if creation of stubs fails when code cache is out of space Martin Doerr SAP (same) (same)
2024/03/15 19:51 P3 hotspot/compiler JDK-8328295 [PPC64] Don't relocate in case of allocation failure Martin Doerr SAP (same) (same)
2024/03/15 08:58 P3 hotspot/runtime JDK-8328594 Add SipHash attribution file Goetz Lindenmaier SAP Jesper Wilhelmsson Oracle
2024/03/14 20:20 P3 client-libs/javax.swing JDK-8328209 [macos] a11y : java.lang.NullPointerException is thrown when focus is moved on the JTabbedPane Goetz Lindenmaier SAP Alexander Zuev Oracle
2024/03/14 20:18 P4 tools/javac JDK-8328208 Reduce use of -source in langtools tests Goetz Lindenmaier SAP Joe Darcy Oracle
2024/03/14 20:18 P3 client-libs/2d JDK-8328206 Update LCMS to 2.16 Goetz Lindenmaier SAP Alisen Chung Oracle
2024/03/14 20:16 P4 security-libs/java.security JDK-8328202 Add dump output to TestRawRSACipher.java Goetz Lindenmaier SAP Haimay Chao Oracle
2024/03/14 20:14 P3 other-libs JDK-8328201 Add a new test library API to replace a file content using FileUtils.java Goetz Lindenmaier SAP Sibabrata Sahoo Oracle
2024/03/14 11:04 P3 hotspot/jfr JDK-8328159 JFR: Active Setting event emitted incorrectly Richard Startin DataDog Erik Gahlin Oracle
2024/03/14 10:13 P4 tools/launcher JDK-8328155 GetJREPath() JLI function fails to locate libjava.so if not standard Java launcher is used Sergey Nazarkin Azul Alexey Semenyuk Oracle
2024/03/14 09:04 P4 client-libs/java.awt JDK-8328151 [macOS] java/awt/Frame/ShapeNotSetSometimes/ShapeNotSetSometimes.java fails with the shape has not been applied msg Andrew Lu SAP Harshitha Onkar Oracle
2024/03/14 08:04 P4 core-libs/java.nio JDK-8328147 Files/probeContentType/Basic.java fails on latest Windows 11 - content type mismatch Amos SHI SAP Brian Burkhalter Oracle
2024/03/13 08:59 P4 hotspot/runtime JDK-8328063 use mem_unit when working with sysinfo memory and swap related information Matthias Baesken SAP (same) (same)
2024/03/13 08:24 P3 security-libs/javax.crypto:pkcs11 JDK-8328056 Skip pkcs11 tests on linux-aarch64 Andrew Lu SAP Matthew Donovan Oracle
2024/03/13 08:24 P3 security-libs JDK-8328055 sun/security/pkcs11 tests fail on OL 7.9 aarch64 Andrew Lu SAP Matthew Donovan Oracle
2024/03/13 08:22 P5 hotspot/test JDK-8328052 "top" command during jtreg failure handler does not display CPU usage on OSX Andrew Lu SAP Leonid Mesnik Oracle
2024/03/12 18:54 P4 client-libs/javax.swing JDK-8328008 Open source swing JMenu tests Sonia Zaldana Calles Red Hat Abhishek Kumar Oracle
2024/03/12 12:50 P3 core-svc/java.lang.management JDK-8327981 [Metrics] Swap memory limit reported incorrectly when too large Matthias Baesken SAP Severin Gehwolf Red Hat
2024/03/12 09:25 P3 security-libs/java.security JDK-8327962 Support for NSS tests on aarch64 platforms Andrew Lu SAP Matthew Donovan Oracle
2024/03/12 09:24 P4 infrastructure/build JDK-8327961 Prefer RPATH over RUNPATH for $ORIGIN rpaths in internal JDK binaries Andrew Lu SAP Erik Joelsson Oracle
2024/03/12 09:23 P4 client-libs/java.awt JDK-8327958 [macos14] : ShapeNotSetSometimes.java fails intermittently on macOS 14 Andrew Lu SAP Harshitha Onkar Oracle
2024/03/12 02:17 P4 client-libs/java.awt JDK-8327862 Use PassFailJFrame for TruncatedPopupMenuTest.java Andrew Lu SAP Rajat Mahajan Oracle
2024/03/11 12:43 P2 hotspot/compiler JDK-8327813 C2 compilation fails with "Bad immediate dominator info" Goetz Lindenmaier SAP Roland Westrelin Red Hat
2024/03/11 12:42 P4 security-libs/javax.net.ssl JDK-8327809 Verify DTLS 1.0 cannot be negotiated Goetz Lindenmaier SAP Matthew Donovan Oracle
2024/03/11 12:41 P3 security-libs/javax.net.ssl JDK-8327808 Disable DTLS 1.0 Goetz Lindenmaier SAP Sean Mullan Oracle
2024/03/11 09:30 P3 hotspot/runtime JDK-8327777 [macosx-aarch64] SIGBUS in MarkActivationClosure::do_code_blob reached from Unsafe_CopySwapMemory0 Richard Reingruber SAP (same) (same)
2024/03/11 09:26 P4 client-libs/java.awt JDK-8327776 java/awt/GraphicsDevice/CheckDisplayModes.java failing on macOS 11 ARM Amos SHI SAP Alexander Zuev Oracle
2024/03/11 09:25 P3 client-libs/java.awt JDK-8327775 [macos14] InterJVMGetDropSuccessTest.java: Child VM: abnormal termination Amos SHI SAP songpv @imt-soft.com
2024/03/11 09:25 P4 client-libs/javax.swing JDK-8327774 Open source few swing JFileChooser and other tests Amos SHI SAP Abhishek Kumar Oracle
2024/03/11 09:24 P4 hotspot/compiler JDK-8327773 com/sun/management/ThreadMXBean/ThreadCpuTimeArray.java can fail in Xcomp with out of expected range Amos SHI SAP Douglas Simon Oracle
2024/03/11 09:05 P4 hotspot/gc JDK-8327768 Add JFR event for GC CPU Time Goetz Lindenmaier SAP Sangheon Kim Oracle
2024/03/07 15:00 P4 hotspot/gc JDK-8327578 Parallel: Implement better work distribution for large object arrays in old gen Richard Reingruber SAP (same) (same)
2024/03/07 10:47 P4 core-libs/javax.script JDK-8327564 Rewrite BadFactoryTest in pure Java Goetz Lindenmaier SAP Eirik Bjørsnøs Independent
2024/03/07 10:46 P4 tools/jpackage JDK-8327563 test tools/jpackage/linux/LinuxResourceTest.java fails on CentOS Linux release 8.5.2111 and Fedora 27 syan Unknown Sun Yaqi Loongson
2024/03/07 10:45 P4 core-libs/java.lang:class_loading JDK-8327562 Move tests in test/jdk/sun/misc/URLClassPath directory to test/jdk/jdk/internal/loader Goetz Lindenmaier SAP Jaikiran Pai Oracle
2024/03/07 09:05 P4 hotspot/gc JDK-8327542 [REDO] Parallel: Refactor PSCardTable::scavenge_contents_parallel Richard Reingruber SAP Albert Yang Oracle
2024/03/07 08:07 P3 hotspot/compiler JDK-8327533 Crash in PhaseIdealLoop::remix_address_expressions due to unexpected Region instead of Loop Andrew Lu SAP Tobias Hartmann Oracle
2024/03/07 08:07 P3 infrastructure/build JDK-8327532 Add -x to bash for building with LOG=debug Andrew Lu SAP Magnus Ihse Bursie Oracle
2024/03/07 08:06 P4 client-libs JDK-8327530 Allow PassFailJFrame to accept single window creator Andrew Lu SAP Alexey Ivanov Oracle
2024/03/07 08:04 P4 client-libs/javax.swing JDK-8327526 "javax/swing/MultiMonitor/MultimonVImage.java failing with Error. Can't find library: /open/test/jdk/java/awt/regtesthelpers" after JDK-8316053 Andrew Lu SAP Lawrence Andrews Oracle
2024/03/06 16:26 P4 hotspot/gc JDK-8327485 Parallel: Remove GCWorkerDelayMillis Richard Reingruber SAP Thomas Schatzl Oracle
2024/03/06 13:23 P4 hotspot/gc JDK-8327472 [REDO] Parallel: More precise boundary in ObjectStartArray::object_starts_in_range Richard Reingruber SAP Albert Yang Oracle
2024/03/05 11:43 P3 hotspot/gc JDK-8327366 G1 heap region info print order changed by JDK-8269914 Goetz Lindenmaier SAP Stefan Johansson Oracle
2024/03/05 09:06 P1 client-libs/java.awt JDK-8327448 Test "api/java_awt/interactive/SystemTrayTests.html" failed because A blue ball icon is added outside of the system tray Sergey Bylokhov Amazon Alexander Zvegintsev Oracle
2024/03/05 08:59 P4 core-libs/java.net JDK-8327447 Use loopback IP addresses in security policy files of httpclient tests Goetz Lindenmaier SAP Jaikiran Pai Oracle
2024/03/04 17:14 P4 hotspot/runtime JDK-8327241 AArch64: Detect Ampere-1B core and update default options for Ampere CPUs Patrick Zhang Ampere (same) (same)
2024/03/04 11:19 P4 hotspot/compiler JDK-8327215 Add applications/ctw/modules to Hotspot tiered testing Aleksey Shipilev Amazon (same) (same)
2024/03/04 06:46 P4 core-libs JDK-8326764 Missing license header in ArenaAllocator.java Amit Kumar IBM Maurizio Cimadamore Oracle
2024/03/02 04:41 P4 client-libs/2d JDK-8327160 Update the usage of cmsFLAGS_COPY_ALPHA Sergey Bylokhov Amazon (same) (same)
2024/03/01 10:01 P4 hotspot/gc JDK-8327118 Add scoped object for g1 young gc JFR notification Goetz Lindenmaier SAP Thomas Schatzl Oracle
2024/03/01 10:01 P4 hotspot/gc JDK-8327117 Factor out heap printing for G1 young and full gc Goetz Lindenmaier SAP Thomas Schatzl Oracle
2024/02/29 16:28 P4 tools/javadoc(tool) JDK-8327066 Interactive component with ARIA role 'tabpanel' does not have a programmatically associated name psoujany IBM (same) (same)
2024/02/29 12:35 P4 hotspot/runtime JDK-8327048 Make TrimNativeHeapInterval a product switch Matthias Baesken SAP Thomas Stuefe Red Hat
2024/02/29 10:46 P4 infrastructure/build JDK-8327034 Flags introduced by configure script are not passed to ADLC build Martin Doerr SAP (same) (same)
2024/02/29 10:24 P4 hotspot/test JDK-8327031 Introduce test keyword for tests that need external dependencies Aleksey Shipilev Amazon (same) (same)
2024/02/28 12:07 P4 security-libs JDK-8326942 [17u] Backout "8325254: CKA_TOKEN private and secret keys are not necessarily sensitive" Goetz Lindenmaier SAP (same) (same)
2024/02/28 07:41 P3 hotspot/compiler JDK-8326926 Issue store-store barrier after re-materializing objects during deoptimization Aleksey Shipilev Amazon Vladimir Kozlov Oracle
2024/02/28 07:39 P4 infrastructure/build JDK-8326923 GHA: Upgrade some actions to avoid deprecated Node 16 Aleksey Shipilev Amazon (same) (same)
2024/02/28 07:07 P4 client-libs JDK-8326914 Allow PassFailJFrame.Builder to create test UI Andrew Lu SAP Alexey Ivanov Oracle
2024/02/28 07:06 P4 client-libs/javax.swing JDK-8326913 Open some swing tests 3 Andrew Lu SAP Alisen Chung Oracle
2024/02/28 07:04 P4 client-libs/java.awt JDK-8326912 Open source several AWT applet tests Andrew Lu SAP Alexander Zvegintsev Oracle
2024/02/27 21:21 P4 security-libs/javax.crypto:pkcs11 JDK-8326880 CKA_TOKEN private and secret keys are not necessarily sensitive Martin Balao Red Hat (same) (same)
2024/02/27 19:46 P4 infrastructure JDK-8326794 Bump update version for OpenJDK: jdk-17.0.12 Goetz Lindenmaier SAP (same) (same)

No changesets log

Committer push log

acmoraru, Amazon

Bug Summary
JDK-8332069 Enable parallelism in vmTestbase/nsk/monitoring/stress/lowmem tests
JDK-8332135 TestStringDeduplicationInterned.java waits for the wrong condition

Amit Kumar, IBM

Bug Summary
JDK-8331933 [s390] CPUInfoTest fails due to uppercase feature string
JDK-8332147 [S390] Need to bailout cleanly if creation of stubs fails when code cache is out of space
JDK-8332152 [s390x] Represent Registers as values
JDK-8326764 Missing license header in ArenaAllocator.java

Andrew Hughes, Red Hat

Bug Summary
JDK-8329334 Use ForceGC for cleaner test cases

Andrew Lu, SAP

Bug Summary
JDK-8327526 "javax/swing/MultiMonitor/MultimonVImage.java failing with Error. Can't find library: /open/test/jdk/java/awt/regtesthelpers" after JDK-8316053
JDK-8328052 "top" command during jtreg failure handler does not display CPU usage on OSX
JDK-8327958 [macos14] : ShapeNotSetSometimes.java fails intermittently on macOS 14
JDK-8328151 [macOS] java/awt/Frame/ShapeNotSetSometimes/ShapeNotSetSometimes.java fails with the shape has not been applied msg
JDK-8332970 [macos] Test tools/jpackage/macosx/MacAppStoreJlinkOptionsTest.java timed out on macOS
JDK-8327532 Add -x to bash for building with LOG=debug
JDK-8330756 Add a security category to the java -XshowSettings option
JDK-8332798 Add more test cases for JDK-8319372
JDK-8327530 Allow PassFailJFrame to accept single window creator
JDK-8326914 Allow PassFailJFrame.Builder to create test UI
JDK-8327533 Crash in PhaseIdealLoop::remix_address_expressions due to unexpected Region instead of Loop
JDK-8329236 gtest runner repeats test name for every single gtest assertion
JDK-8330651 HttpURLConnection cache issues leading to crashes in JGSS w/ native GSS introduced by 8303809
JDK-8332183 jdk/javadoc/tool/CheckManPageOptions.java depends on source hierarchy
JDK-8328760 Log X509ExtendedKeyManager implementation class name in TLS/SSL connection
JDK-8326913 Open some swing tests 3
JDK-8329473 Open source few AWT Focus related tests
JDK-8329476 Open source few Swing event and AbstractAction tests
JDK-8328759 Open source misc awt tests
JDK-8326912 Open source several AWT applet tests
JDK-8329475 Open source several AWT Focus related tests
JDK-8330547 Opensource JMenuBar manual test
JDK-8327961 Prefer RPATH over RUNPATH for $ORIGIN rpaths in internal JDK binaries
JDK-8330550 Refactor timeout handler in PassFailJFrame
JDK-8328056 Skip pkcs11 tests on linux-aarch64
JDK-8329240 sun/java2d/cmm/ColorConvertOp/ColConvTest.java assumes profiles were generated by LCMS
JDK-8330649 sun/security/pkcs11 tests fail on Linux RHEL 8.6 and newer
JDK-8328055 sun/security/pkcs11 tests fail on OL 7.9 aarch64
JDK-8327962 Support for NSS tests on aarch64 platforms
JDK-8332027 Test javax/swing/JFileChooser/4524490/bug4524490.java fails with InvocationTargetException
JDK-8330300 test javax/swing/JSplitPane/4885629/bug4885629.java fails on windows hidpi
JDK-8332801 test/hotspot/jtreg/applications/ctw/modules/jdk_crypto_ec.java cannot handle empty modules
JDK-8332339 TestPLABResize.java and TestPLABPromotion.java are failing intermittently
JDK-8332799 tools/jpackage/share/RuntimeImageTest.java fails with -XX:+UseZGC
JDK-8329372 Update and move siphash license
JDK-8327862 Use PassFailJFrame for TruncatedPopupMenuTest.java
JDK-8332182 vmTestbase/nsk/jvmti/scenarios/hotswap/HS201/hs201t002/TestDescription.java fails with NoClassDefFoundError

ariasdereyna, Red Hat

Bug Summary
JDK-8332481 Add GlobalSign 2 TLS root certificates
JDK-8329495 MethodHandleProxies does not correctly invoke default methods with varags

Amos SHI, SAP

Bug Summary
JDK-8327775 [macos14] InterJVMGetDropSuccessTest.java: Child VM: abnormal termination
JDK-8331238 [macos14] Problem list tests which fail due to macOS bug described in JDK-8322653
JDK-8331136 [macos14] Running any AWT app prints Secure coding warning
JDK-8330876 Allow TEST_VM_FLAGLESS to set flagless mode
JDK-8330885 Background not refreshed when painting over a transparent JFrame
JDK-8327773 com/sun/management/ThreadMXBean/ThreadCpuTimeArray.java can fail in Xcomp with out of expected range
JDK-8328147 Files/probeContentType/Basic.java fails on latest Windows 11 - content type mismatch
JDK-8330867 GetGraphicsTest needs to be headful
JDK-8327776 java/awt/GraphicsDevice/CheckDisplayModes.java failing on macOS 11 ARM
JDK-8331239 java/net/httpclient/ManyRequest.java should not use "localhost" in URIs
JDK-8331240 java/util/concurrent/ConcurrentLinkedQueue/WhiteBox.java shows intermittent failures on linux ppc64le and aarch64
JDK-8331249 javax/management/remote/mandatory/notif/NotifReconnectDeadlockTest.java fails on libgraal
JDK-8330897 javax/management/remote/mandatory/notif/NotifReconnectDeadlockTest.java update
JDK-8330895 Modify TrayIconScalingTest.java, PrintLatinCJKTest.java to use new PassFailJFrame's builder pattern usage
JDK-8329977 NegativeArraySizeException decoding >1G UTF8 bytes with non-ascii characters
JDK-8331138 NPE when creating default file system when default file system provider is packaged as JAR file on class path
JDK-8330884 Open source AWT Event related tests
JDK-8330866 Open source AWT Graphics,GridBagLayout related tests
JDK-8330894 Open source AWT Key, Text Event related tests
JDK-8330896 Open source few more swing text/html tests
JDK-8327774 Open source few swing JFileChooser and other tests
JDK-8330883 Open source few swing JFormattedTextField and JPopupMenu tests
JDK-8331248 Open source several Swing HTMLDocument related tests
JDK-8329978 Open source several Swing JSpinner related tests
JDK-8330873 Open source several Swing Text/HTML related tests
JDK-8330874 Opensource JTextArea manual tests
JDK-8330882 Opensource SwingGraphics manual test
JDK-8330899 Robustness improvements to java/util/prefs/AddNodeChangeListener.jar
JDK-8331247 StackOverflowError when starting Apache Tomcat with signed jar
JDK-8329973 System Tray icons get corrupted when Windows primary monitor changes

Ben Taylor, Amazon

Bug Summary
JDK-8333102 Parallel: Parallel GC resizes heap even if -Xms = -Xmx

Christoph Langer, SAP

Bug Summary
JDK-8330503 [17u] Remove designator DEFAULT_PROMOTED_VERSION_PRE=ea for release 17.0.11
JDK-8331641 [17u]: Bump GHA bootstrap JDK to 17.0.11
JDK-8330082 AWT Assertion Failure in ::GetDIBits(hBMDC, hBM, 0, 1, 0, gpBitmapInfo, 0) 'awt_Win32GraphicsDevice.cpp', at line 185
JDK-8331685 Inconsistent behavior in com.sun.jndi.ldap.Connection::createSocket
JDK-8328640 java/util/Formatter/Padding.java fails on some Locales
JDK-8332379 Reduce runtime and improve efficiency of KeepAliveTest
JDK-8331990 Remove sun/tools/jhsdb/BasicLauncherTest.java from problem list
JDK-8332392 Use pattern matching for instanceof in KeepAliveCache

Dan Lutker, Amazon

Bug Summary
JDK-8328554 Shenandoah: SIGSEGV crash in unnecessary_acquire due to LoadStore split through phi

Elif Aslan, Amazon

Bug Summary
JDK-8332763 Consolidate file_exists into os:file_exists
JDK-8329290 Enable java/lang/ProcessBuilder/JspawnhelperProtocol.java on Mac
JDK-8329504 Enable parallelism in vmTestbase/vm/gc/concurrent tests

fitzsim, Red Hat

Bug Summary
JDK-8332848 Replace the deprecated/obsolete gethostbyname and inet_addr calls

Gui Cao, Independent

Bug Summary
JDK-8329941 RISC-V: Features string uses wrong separator for jtreg
JDK-8330102 RISC-V: Need to sync CPU features with related JVM flags
JDK-8330636 RISC-V: Remove PlatformCmpxchg<4>
JDK-8331690 RISC-V: Save and restore FRM in the call stub
JDK-8330635 RISC-V: Shenandoah GC crashes due to incorrect atomic memory operations
JDK-8330637 RISC-V: Simplify and remove CORRECT_COMPILER_ATOMIC_SUPPORT in atomic_linux_riscv.hpp

Goetz Lindenmaier, SAP

Bug Summary
JDK-8332045 (dc) DatagramSocket.receive does not always throw when the channel is closed
JDK-8330830 (zipfs) jdk/jdk/nio/zipfs/TestLocOffsetFromZip64EF.java failing with ZipException:R0 on OL9
JDK-8330827 (zipfs) Make test/jdk/jdk/nio/zipfs/TestLocOffsetFromZip64EF.java independent of the zip command line
JDK-8326942 [17u] Backout "8325254: CKA_TOKEN private and secret keys are not necessarily sensitive"
JDK-8330350 [macos14] Problem list LightweightEventTest.java which fails due to macOS bug described in JDK-8322653
JDK-8328209 [macos] a11y : java.lang.NullPointerException is thrown when focus is moved on the JTabbedPane
JDK-8328586 [x86] StringRepeat.java failure on linux-x86: Could not reserve enough space for 2097152KB object heap
JDK-8329708 Add a check in JavadocTester for "javadoc should not crash"
JDK-8328201 Add a new test library API to replace a file content using FileUtils.java
JDK-8328202 Add dump output to TestRawRSACipher.java
JDK-8327768 Add JFR event for GC CPU Time
JDK-8327118 Add scoped object for g1 young gc JFR notification
JDK-8328594 Add SipHash attribution file
JDK-8329249 AttachingConnector/attach/attach001 failed due to "bind failed: Address already in use"
JDK-8328515 Background of JInternalFrame is located out of JInternalFrame
JDK-8326794 Bump update version for OpenJDK: jdk-17.0.12
JDK-8327813 C2 compilation fails with "Bad immediate dominator info"
JDK-8329306 ciReplay: Inlining fails with "unloaded signature classes" due to wrong protection domains
JDK-8329349 ciReplay: SIGSEGV if classfile for replay compilation is not present after JDK-8275868
JDK-8329599 Clean up tests that reference deploy modules
JDK-8330826 compiler/c2/aarch64/TestFarJump.java fails on AArch64 due to unexpected PrintAssembly output
JDK-8329403 diags-examples.xml is broken
JDK-8327808 Disable DTLS 1.0
JDK-8329404 Drop the test/jdk/java/net/httpclient/reactivestreams-tck-tests/TckDriver.java test
JDK-8327117 Factor out heap printing for G1 young and full gc
JDK-8328696 Few runtime/os tests ignore vm flags
JDK-8330086 Fix typos in test/langtools files
JDK-8327366 G1 heap region info print order changed by JDK-8269914
JDK-8329172 gtest/LargePageGtests.java#use-large-pages failed "os.release_one_mapping_multi_commits_vm"
JDK-8329402 HttpURLConnection default Accept header is malformed according to HTTP/1.1 RFC
JDK-8330090 Improve test proxy performance
JDK-8329711 Introduce convenience test library APIs for creating test servers for tests in test/jdk/java/net/httpclient
JDK-8330347 java/net/httpclient/MaxStreams.java failed with didn't finish within the time-out
JDK-8329407 java/net/HttpURLConnection/SetAuthenticator/HTTPSetAuthenticatorTest.java failed with "BindException: Address already in use: connect"
JDK-8329409 java/nio/channels/FileChannel/FileExtensionAndMap.java is too slow
JDK-8328691 java/security/cert/CertPathValidator/OCSP/GetAndPostTests.java -- test server didn't start in timely manner
JDK-8330349 JDK server does not send a dummy change_cipher_spec record after HelloRetryRequest message
JDK-8327562 Move tests in test/jdk/sun/misc/URLClassPath directory to test/jdk/jdk/internal/loader
JDK-8329247 Move the Http2TestServer and related classes into a package of its own
JDK-8328208 Reduce use of -source in langtools tests
JDK-8329852 Refactor more Locale tests to use JUnit
JDK-8329577 Refactor open/test/jdk/javax/rmi/ssl/SSLSocketParametersTest.sh to jtreg java test
JDK-8330346 remove boilerplate from use of runTests
JDK-8328968 Remove hard-coded 127.0.0.1 loopback address
JDK-8328517 Remove javax/rmi/ssl/SSLSocketParametersTest.sh from ProblemList
JDK-8329601 Remove remaining usages of -Xdebug from test/hotspot/jtreg
JDK-8329762 Remove unused fields in StyleSheet
JDK-8329578 Review running times of java.math tests
JDK-8327564 Rewrite BadFactoryTest in pure Java
JDK-8328967 serviceability/jdwp/AllModulesCommandTest.java failed with "Debuggee error: 'ERROR: transport error 202: bind failed: Address already in use'"
JDK-8329408 several regression tests have a main method that is never executed
JDK-8328519 Some ProcessTools.execute* functions are declared to throw Throwable
JDK-8329770 sun/jvmstat/monitor/MonitoredVm/MonitorVmStartTerminate.java ignores VM flags
JDK-8329713 Test java/foreign/channels/TestAsyncSocketChannels.java failed: IllegalStateException: Already closed
JDK-8329575 TestMD5Intrinsics and TestMD5MultiBlockIntrinsics don't test the intrinsics
JDK-8330089 Update HttpInputStreamTest and BodyProcessorInputStreamTest to use hg.openjdk.org
JDK-8329576 Update IANA Language Subtag Registry to Version 2023-02-14
JDK-8329598 Update IANA Language Subtag Registry to Version 2023-03-22
JDK-8329763 Update IANA Language Subtag Registry to Version 2023-04-13
JDK-8329768 Update IANA Language Subtag Registry to Version 2023-05-11
JDK-8329860 Update IANA Language Subtag Registry to Version 2023-08-02
JDK-8330091 Update IANA Language Subtag Registry to Version 2023-10-16
JDK-8330348 Update IANA Language Subtag Registry to Version 2024-03-07
JDK-8330088 Update java/net/httpclient/BasicAuthTest.java to check basic auth over HTTP/2
JDK-8328688 Update JInternalFrame Metal Border code
JDK-8328206 Update LCMS to 2.16
JDK-8328694 Update the Zlib version in open/src/java.base/share/legal/zlib.md to 1.3.1
JDK-8328693 Update Zlib Data Compression Library to Version 1.3
JDK-8328692 Update Zlib Data Compression Library to Version 1.3.1
JDK-8327447 Use loopback IP addresses in security policy files of httpclient tests
JDK-8327809 Verify DTLS 1.0 cannot be negotiated
JDK-8328583 WhiteBoxResizeTest failure on linux-x86: Could not reserve enough space for 2097152KB object heap

Jan Kratochvil, Azul

Bug Summary
JDK-8332383 Build failure with GCC8.3.1 after 8313643
JDK-8332446 Compilation failures in java.desktop module with gcc 14
JDK-8332385 error: template-id not allowed for constructor/destructor in C++20
JDK-8332384 Remove unnecessary template parameter lists in GrowableArray

Liang Mao, Alibaba

Bug Summary
JDK-8332366 LogConfigurationTest intermittently fails on AArch64

Matthias Baesken, SAP

Bug Summary
JDK-8327981 [Metrics] Swap memory limit reported incorrectly when too large
JDK-8331386 CDSPluginTest should only expect classes_nocoops.jsa exists on supported 64-bit platforms
JDK-8331387 Copyright year was modified unintentionally in jlink.properties and ImagePluginStack.java
JDK-8329744 crashes in docker container tests on Linuxppc64le Power8 machines
JDK-8329946 enhance assert message "relocation addr must be in this section"
JDK-8330018 Generate CDS archive when creating custom JDK image
JDK-8329399 improve assert(idx < _maxlrg) failed: oob
JDK-8327048 Make TrimNativeHeapInterval a product switch
JDK-8329566 Move class loading Events to a separate section in hs_err files
JDK-8328887 os::Linux::print_proc_sys_info add swappiness information
JDK-8329743 set -XX:+ErrorFileToStderr when executing java in containers for some container related jtreg tests
JDK-8329742 src/jdk.accessibility/windows/native/libjavaaccessbridge/AccessBridgeJavaEntryPoints.cpp ReleaseStringChars might be missing in early returns
JDK-8328063 use mem_unit when working with sysinfo memory and swap related information

Martin Balao, Red Hat

Bug Summary
JDK-8326880 CKA_TOKEN private and secret keys are not necessarily sensitive

Martin Doerr, SAP

Bug Summary
JDK-8328295 [PPC64] Don't relocate in case of allocation failure
JDK-8328296 [PPC64] Need to bailout cleanly if creation of stubs fails when code cache is out of space
JDK-8332221 [PPC64] Use more constexpr in class Register
JDK-8327034 Flags introduced by configure script are not passed to ADLC build
JDK-8331938 Improve assert_different_registers
JDK-8333115 Launcher causes lingering busy cursor
JDK-8332137 PPC64: Represent Registers as values
JDK-8333143 System.exit(0) kills the launched 3rd party application

psoujany, IBM

Bug Summary
JDK-8327066 Interactive component with ARIA role 'tabpanel' does not have a programmatically associated name

Patrick Zhang, Ampere

Bug Summary
JDK-8327241 AArch64: Detect Ampere-1B core and update default options for Ampere CPUs

Robbin Ehn, Rivos

Bug Summary
JDK-8331289 RISC-V: Range check auipc + signed 12 imm instruction

Richard Startin, DataDog

Bug Summary
JDK-8328159 JFR: Active Setting event emitted incorrectly

rkmaurya, Amazon

Bug Summary
JDK-8333038 File descriptor leak with ProcessBuilder.startPipeline
JDK-8333039 java/lang/ProcessBuilder/PipelineLeaksFD.java fail: More or fewer pipes than expected

Roman Marchenko, Azul

Bug Summary
JDK-8331173 AppendFile/WriteFile has differences between make 3.81 and 4+
JDK-8332162 JvmtiEventControllerPrivate::set_event_callbacks CLEARING_MASK computation is incorrect

Roy Soumadipta, Amazon

Bug Summary
JDK-8330073 Enable parallelism in vmTestbase/gc/vector tests

Richard Reingruber, SAP

Bug Summary
JDK-8327777 [macosx-aarch64] SIGBUS in MarkActivationClosure::do_code_blob reached from Unsafe_CopySwapMemory0
JDK-8327472 [REDO] Parallel: More precise boundary in ObjectStartArray::object_starts_in_range
JDK-8327542 [REDO] Parallel: Refactor PSCardTable::scavenge_contents_parallel
JDK-8327578 Parallel: Implement better work distribution for large object arrays in old gen
JDK-8327485 Parallel: Remove GCWorkerDelayMillis

Robert Toyonaga, Red Hat

Bug Summary
JDK-8331172 jdk/jfr/jcmd/TestJcmdDumpPathToGCRoots.java failed with "Expected chains but found none"
JDK-8331430 JFR: CompilerPhase event test fails on windows 32 bit
JDK-8329507 JFR: Test for CompilerCompile events fails due to time out

Sergey Bylokhov, Amazon

Bug Summary
JDK-8331256 Add a test to check default rendering engine
JDK-8327448 Test "api/java_awt/interactive/SystemTrayTests.html" failed because A blue ball icon is added outside of the system tray
JDK-8327160 Update the usage of cmsFLAGS_COPY_ALPHA

Aleksey Shipilev, Amazon

Bug Summary
JDK-8327215 Add applications/ctw/modules to Hotspot tiered testing
JDK-8329799 Better validation for com.sun.security.ocsp.useget option
JDK-8331171 Epsilon: 'EpsilonHeap::allocate_work' misuses the parameter 'size' as size in bytes
JDK-8331308 Epsilon: Premature OOM when allocating object larger than uncommitted heap size
JDK-8329798 Fallback option for POST-only OCSP requests
JDK-8331110 G1: Excessive is_obj_dead_cond calls in verification
JDK-8328981 GHA: Cross-compilation jobs do not require build JDK
JDK-8329076 GHA: Restoring sysroot from cache skips the build after JDK-8326960
JDK-8328891 GHA: RISC-V sysroot cannot be debootstrapped due to ongoing Debian t64 transition
JDK-8326923 GHA: Upgrade some actions to avoid deprecated Node 16
JDK-8329170 Google CAInterop test failures
JDK-8327031 Introduce test keyword for tests that need external dependencies
JDK-8326926 Issue store-store barrier after re-materializing objects during deoptimization
JDK-8330692 Monitor deflation unlink phase prolongs time to safepoint
JDK-8332963 Reduce memory footprint of java.lang.reflect.Constructor/Method

Sergey Nazarkin, Azul

Bug Summary
JDK-8328155 GetJREPath() JLI function fails to locate libjava.so if not standard Java launcher is used

sroy, Unknown

Bug Summary
JDK-8329388 Allow loading of shared objects with .a extension on AIX

Thomas Stuefe, Red Hat

Bug Summary
JDK-8332355 On Linux aarch64, CDS archives should be using 64K alignment by default

syan, Unknown

Bug Summary
JDK-8331270 createJMHBundle.sh support configurable maven repo mirror
JDK-8333020 gtest wrappers should be marked as flagless
JDK-8332149 Some jtreg tests failing on x86 with error 'unrecognized VM options' (C2 flags)
JDK-8332150 sun/security/mscapi/KeytoolChangeAlias.java fails with "Alias <246810> does not exist"
JDK-8327563 test tools/jpackage/linux/LinuxResourceTest.java fails on CentOS Linux release 8.5.2111 and Fedora 27

Sonia Zaldana Calles, Red Hat

Bug Summary
JDK-8331234 Add a test to verify JMOD files created in the images do not have debug symbols
JDK-8329506 HttpResponseInputStream.available() returns 1 on empty stream
JDK-8332234 New test JmodExcludedFiles.java fails on Windows when --with-external-symbols-in-bundles=public is used
JDK-8328008 Open source swing JMenu tests

William Kemper, Amazon

Bug Summary
JDK-8328674 Shenandoah: Clarify gc state usage