PUSHES REPORT: 17.0.13

This report shows who pushed the backports to the given release. This usually shows who did the backporting, testing, and review work.

Report generated: Fri Jun 21 05:50:56 CEST 2024

Distribution by priority

Count Priority
4 P2
32 P3
64 P4
4 P5

Distribution by components

Count Component
104 100% Total
40 38.5% hotspot
14 13.5% hotspot/runtime
7 6.7% hotspot/compiler
7 6.7% hotspot/gc
6 5.8% hotspot/jfr
4 3.8% hotspot/test
2 1.9% hotspot/svc
35 33.7% client-libs
18 17.3% client-libs/javax.swing
13 12.5% client-libs/java.awt
3 2.9% client-libs/2d
1 1.0% client-libs
11 10.6% core-libs
3 2.9% core-libs/java.net
2 1.9% core-libs
2 1.9% core-libs/java.lang
2 1.9% core-libs/java.nio
1 1.0% core-libs/java.util.concurrent
1 1.0% core-libs/java.util.jar
10 9.6% security-libs
6 5.8% security-libs/java.security
3 2.9% security-libs/javax.net.ssl
1 1.0% security-libs/javax.crypto:pkcs11
4 3.8% tools
1 1.0% tools/jpackage
1 1.0% tools/javac
1 1.0% tools/javadoc(tool)
1 1.0% tools/launcher
3 2.9% infrastructure
2 1.9% infrastructure/build
1 1.0% infrastructure/release_eng
1 1.0% core-svc
1 1.0% core-svc/debugger

Distribution by affiliation

This Release Pushes

Original Pushes

Count Committer
103 100% Total
56 54.4% SAP
28 27.2% Martin Doerr
24 23.3% Andrew Lu
2 1.9% Matthias Baesken
1 1.0% Amos SHI
1 1.0% Christoph Langer
28 27.2% Amazon
8 7.8% Sergey Bylokhov
6 5.8% Elif Aslan
4 3.9% Oli Gillespie
3 2.9% Aleksey Shipilev
2 1.9% neethp
2 1.9% rkmaurya
1 1.0% ec2-user
1 1.0% xlpeng
1 1.0% Chad Rakoczy
7 6.8% Unknown
5 4.9% syan
1 1.0% lyang
1 1.0% xpeng
4 3.9% Independent
2 1.9% ier7928
1 1.0% Zhengyu Gu
1 1.0% xlpeng2018
3 2.9% Red Hat
1 1.0% ariasdereyna
1 1.0% Andrew Hughes
1 1.0% fitzsim
2 1.9% Azul
2 1.9% Dmitry Cherepanov
1 1.0% Canonical
1 1.0% Vladimir Petko
1 1.0% Fujitsu
1 1.0% Takuya Kiriyama
1 1.0% IBM
1 1.0% srutjay1
Count Committer
103 100% Total
64 62.1% Oracle
10 9.7% Alexey Ivanov
4 3.9% Jaikiran Pai
3 2.9% Markus Grönlund
3 2.9% Tejesh R
3 2.9% Leonid Mesnik
3 2.9% Alexander Zvegintsev
3 2.9% Alisen Chung
3 2.9% Philip Race
2 1.9% Harshitha Onkar
2 1.9% Daniel Jelinski
2 1.9% Prasanta Sadhukhan
2 1.9% Thomas Schatzl
2 1.9% Alexander Zuev
2 1.9% Vladimir Ivanov
1 1.0% Yudi Zheng
1 1.0% Mark Sheppard
1 1.0% Ludvig Janiuk
1 1.0% Sean Mullan
1 1.0% Calvin Cheung
1 1.0% Prajwal Kumaraswamy
1 1.0% Albert Yang
1 1.0% Jan Lahoda
1 1.0% Alexey Semenyuk
1 1.0% Roberto Castaneda Lozano
1 1.0% Mikhailo Seledtsov
1 1.0% Gerard Ziemski
1 1.0% Sean Coffey
1 1.0% Damon Nguyen
1 1.0% Claes Redestad
1 1.0% Harold Seigel
1 1.0% Johan Sjölen
1 1.0% Afshin Zafari
1 1.0% Erik Österlund
1 1.0% Viktor Klang
20 19.4% Amazon
7 6.8% Aleksey Shipilev
3 2.9% Oli Gillespie
3 2.9% Sergey Bylokhov
2 1.9% Yi-Fan Tsai
1 1.0% neethp
1 1.0% Elif Aslan
1 1.0% Roman Kennke
1 1.0% Volker Simonis
1 1.0% Chad Rakoczy
5 4.9% SAP
3 2.9% Matthias Baesken
1 1.0% Christoph Langer
1 1.0% Thomas Obermeier
3 2.9% Independent
1 1.0% Andrey Turbanov
1 1.0% ier7928
1 1.0% stanio
2 1.9% Google
1 1.0% Man Cao
1 1.0% Liam Miller-Cushon
2 1.9% Red Hat
1 1.0% Andrew Hughes
1 1.0% Thomas Stuefe
2 1.9% Unknown
2 1.9% syan
1 1.0% @users.sourceforge.net
1 1.0% rjolly
1 1.0% ARM
1 1.0% Fei Gao
1 1.0% Alibaba
1 1.0% yibo.yl
1 1.0% DataDog
1 1.0% Jaroslav Bachorík
1 1.0% Fujitsu
1 1.0% Takuya Kiriyama

Chronological push log:

UTC Time Priority Component Bug Summary This Release Push By Original Push By
Name Affiliation Name Affiliation
2024/06/21 02:39 P3 hotspot/runtime JDK-8334704 Make runtime/Thread/ThreadCountLimit.java more robust Elif Aslan Amazon Aleksey Shipilev Amazon
2024/06/21 02:15 P4 client-libs/2d JDK-8334703 The ArabicBox.java test has no control buttons Andrew Lu SAP Alexey Ivanov Oracle
2024/06/21 02:14 P4 client-libs/java.awt JDK-8334697 java/awt/event/MouseEvent/ClickDuringKeypress/ClickDuringKeypress.java imports Applet Andrew Lu SAP Philip Race Oracle
2024/06/21 02:13 P3 hotspot/gc JDK-8334696 Test vmTestbase/metaspace/gc/watermark_70_80/TestDescription.java fails with no GC's recorded Andrew Lu SAP Thomas Schatzl Oracle
2024/06/20 23:20 P4 core-libs/java.net JDK-8334685 Some HttpClient tests don't report leaks Amos SHI SAP Daniel Jelinski Oracle
2024/06/20 10:07 P4 security-libs/javax.net.ssl JDK-8334607 TLS 1.3 handshake fails if server_name doesn't match resuming session Martin Doerr SAP Jaikiran Pai Oracle
2024/06/19 02:04 P4 client-libs/java.awt JDK-8334501 Convert java/awt/Frame/GetBoundsResizeTest/GetBoundsResizeTest.java applet test to main Andrew Lu SAP Alexander Zvegintsev Oracle
2024/06/19 02:04 P4 core-libs/java.nio JDK-8334500 Test java/nio/channels/DatagramChannel/StressNativeSignal.java timed out Andrew Lu SAP Mark Sheppard Oracle
2024/06/19 02:04 P4 client-libs/java.awt JDK-8334499 Convert java/awt/font/TextLayout/TestJustification.html applet test to main Andrew Lu SAP Harshitha Onkar Oracle
2024/06/19 02:02 P4 client-libs/javax.swing JDK-8334498 Add test for ConcurrentModificationException in BasicDirectoryModel Andrew Lu SAP Alexey Ivanov Oracle
2024/06/18 13:46 P4 core-libs/java.util.jar JDK-8334480 avoid signed integer overflows in zip_util.c readCen / hashN Matthias Baesken SAP (same) (same)
2024/06/18 13:42 P4 hotspot/runtime JDK-8334479 Linux ppc64le compile warning with clang in os_linux_ppc.cpp Matthias Baesken SAP (same) (same)
2024/06/18 12:25 P4 security-libs/javax.net.ssl JDK-8334335 [TESTBUG] Backport of 8279164 to 11u & 17u includes elements of JDK-8163327 Andrew Hughes Red Hat (same) (same)
2024/06/18 07:58 P4 hotspot/runtime JDK-8334440 [REDO] - [IMPROVE] OPEN_MAX is no longer the max limit on macOS >= 10.6 for RLIMIT_NOFILE Dmitry Cherepanov Azul Gerard Ziemski Oracle
2024/06/17 17:20 P4 core-libs/java.lang JDK-8334407 Improve jspawnhelper version checks Chad Rakoczy Amazon (same) (same)
2024/06/17 10:15 P4 hotspot/compiler JDK-8334377 compiler/codecache/CheckLargePages.java fails on OL 8.8 with unexpected memory string Andrew Lu SAP Yi-Fan Tsai Amazon
2024/06/17 10:15 P4 core-libs/java.util.concurrent JDK-8334375 java/util/concurrent/ConcurrentHashMap/ToArray.java timed out Andrew Lu SAP Viktor Klang Oracle
2024/06/15 22:20 P4 client-libs/javax.swing JDK-8334337 Convert javax/swing/border/Test4129681.java applet test to main Sergey Bylokhov Amazon Tejesh R Oracle
2024/06/13 23:34 P4 client-libs/javax.swing JDK-8334267 Update ProblemList for JFileChooser/8194044/FileSystemRootTest.java Sergey Bylokhov Amazon Alexey Ivanov Oracle
2024/06/13 22:03 P4 hotspot/compiler JDK-8334266 C2: Sort spilling/unspilling sequence for better ld/st merging into ldp/stp on AArch64 xpeng Unknown Fei Gao ARM
2024/06/13 22:02 P4 hotspot/gc JDK-8334265 Shenandoah: Check for disarmed method before taking the nmethod lock neethp Amazon (same) (same)
2024/06/13 09:41 P4 client-libs/javax.swing JDK-8334203 Several Swing jtreg tests use class.forName on L&F classes Sergey Bylokhov Amazon Prasanta Sadhukhan Oracle
2024/06/13 07:33 P4 client-libs/java.awt JDK-8334190 Open source several add/remove MenuBar manual tests Andrew Lu SAP Alexander Zvegintsev Oracle
2024/06/13 07:33 P4 client-libs/java.awt JDK-8334188 java/awt/Focus/NonFocusableWindowTest/NonfocusableOwnerTest.java failed with "RuntimeException: Test failed." Andrew Lu SAP Alisen Chung Oracle
2024/06/12 11:10 P3 core-svc/debugger JDK-8334120 JDWP process management needs more efficient file descriptor handling Dmitry Cherepanov Azul Jaikiran Pai Oracle
2024/06/12 09:51 P4 core-libs/java.net JDK-8334116 Launching java with large number of jars in classpath with java.protocol.handler.pkgs system property set can lead to StackOverflowError srutjay1 IBM Jaikiran Pai Oracle
2024/06/12 08:08 P5 infrastructure/build JDK-8334102 Delete extra empty spaces in Makefiles syan Unknown (same) (same)
2024/06/12 07:22 P4 hotspot/svc JDK-8334093 Enable parallelism in vmTestbase/nsk/monitoring/stress/classload tests Andrew Lu SAP Aleksey Shipilev Amazon
2024/06/12 07:22 P4 hotspot/svc JDK-8334091 Enable parallelism in vmTestbase/nsk/monitoring/stress/thread tests Andrew Lu SAP Aleksey Shipilev Amazon
2024/06/11 14:42 P4 hotspot/jfr JDK-8334029 Array Elements in OldObjectSample event has the incorrect description Takuya Kiriyama Fujitsu (same) (same)
2024/06/11 09:02 P4 client-libs/javax.swing JDK-8334001 BasicDirectoryModel getDirectories and DoChangeContents.run can deadlock Martin Doerr SAP Alexey Ivanov Oracle
2024/06/11 09:02 P3 client-libs/javax.swing JDK-8334000 Race in BasicDirectoryModel.validateFileCache Martin Doerr SAP Alexey Ivanov Oracle
2024/06/11 09:02 P3 security-libs/javax.crypto:pkcs11 JDK-8333999 Better pkcs11 performance for libpkcs11:C_EncryptInit/libpkcs11:C_DecryptInit Martin Doerr SAP Prajwal Kumaraswamy Oracle
2024/06/11 09:01 P3 security-libs/javax.net.ssl JDK-8333998 Disable TLS_ECDH_* cipher suites Martin Doerr SAP Sean Mullan Oracle
2024/06/11 08:02 P4 client-libs/javax.swing JDK-8333961 [macosx] Swing Popups should overlap taskbar Sergey Bylokhov Amazon Prasanta Sadhukhan Oracle
2024/06/11 06:29 P3 hotspot/compiler JDK-8333952 C2: meet between unloaded and speculative types is not symmetric Martin Doerr SAP Vladimir Ivanov Oracle
2024/06/11 02:01 P4 client-libs JDK-8333936 Support JSplitPane for instructions and test UI Andrew Lu SAP Alexey Ivanov Oracle
2024/06/11 02:01 P4 client-libs/javax.swing JDK-8333935 Open source several Swing SplitPane and RadioButton related tests Andrew Lu SAP Tejesh R Oracle
2024/06/10 08:17 P4 client-libs/javax.swing JDK-8333874 A few client tests intermittently throw ConcurrentModificationException Martin Doerr SAP Tejesh R Oracle
2024/06/10 08:17 P4 client-libs/javax.swing JDK-8333873 HTMLReader uses ConvertAction instead of specified CharacterAction for , , Martin Doerr SAP Alexey Ivanov Oracle
2024/06/10 08:17 P3 client-libs/javax.swing JDK-8333872 text-decoration applied to lost when mixed with or Martin Doerr SAP Alexey Ivanov Oracle
2024/06/10 07:35 P3 tools/javadoc(tool) JDK-8281944 JavaDoc throws java.lang.IllegalStateException: ERRONEOUS Aleksey Shipilev Amazon (same) (same)
2024/06/07 19:19 P3 core-libs JDK-8333698 [17u] TestJstatdRmiPort fails after JDK-8333667 Aleksey Shipilev Amazon (same) (same)
2024/06/07 16:30 P4 hotspot/runtime JDK-8333818 read/write APIs in class os shall return ssize_t Elif Aslan Amazon Harold Seigel Oracle
2024/06/07 16:30 P2 hotspot/runtime JDK-8333817 os::write incorrectly handles partial write Elif Aslan Amazon Man Cao Google
2024/06/07 16:30 P4 hotspot/runtime JDK-8333816 os::write should write completely Elif Aslan Amazon Afshin Zafari Oracle
2024/06/07 15:20 P4 client-libs/javax.swing JDK-8333810 Win32ShellFolder2.compareTo is inconsistent Martin Doerr SAP Alexey Ivanov Oracle
2024/06/07 15:20 P3 client-libs/javax.swing JDK-8333809 JEditorPane ignores font-size styles in external linked css-file Martin Doerr SAP stanio Independent
2024/06/07 15:20 P2 hotspot/compiler JDK-8333808 C2: Unloaded signature class kills argument value Martin Doerr SAP Vladimir Ivanov Oracle
2024/06/07 15:19 P2 client-libs/javax.swing JDK-8333807 A few client tests intermittently throw ConcurrentModificationException Martin Doerr SAP Tejesh R Oracle
2024/06/07 10:08 P4 security-libs/java.security JDK-8333785 Problem list security/infra/java/security/cert/CertPathValidator/certification/CAInterop.java#teliasonerarootcav1 syan Unknown Matthias Baesken SAP
2024/06/06 18:07 P4 core-libs/java.lang JDK-8333747 jspawnhelper without args fails with segfault ec2-user Amazon Elif Aslan Amazon
2024/06/06 13:57 P4 hotspot/jfr JDK-8333726 Restricted access to `/proc` can cause JFR initialization to crash neethp Amazon Jaroslav Bachorík DataDog
2024/06/06 10:11 P3 hotspot/gc JDK-8333707 Test jdk/jfr/event/oldobject/TestSanityDefault.java times out for some heap sizes Sergey Bylokhov Amazon (same) (same)
2024/06/06 09:48 P5 client-libs/java.awt JDK-8333705 The MToolkit is still referenced in a few places Martin Doerr SAP Sergey Bylokhov Amazon
2024/06/06 09:46 P3 client-libs/javax.swing JDK-8333703 tag doesn't strikethrough the text Martin Doerr SAP Alexey Ivanov Oracle
2024/06/06 09:45 P4 hotspot/compiler JDK-8333702 enhance PrintCodeCache to print more data Martin Doerr SAP Yi-Fan Tsai Amazon
2024/06/06 09:45 P3 client-libs/java.awt JDK-8333701 Default icon is not painted properly Martin Doerr SAP Alexander Zuev Oracle
2024/06/06 08:16 P4 hotspot/compiler JDK-8333692 IGV: Update to work with JDK 16 and 17 fitzsim Red Hat Roberto Castaneda Lozano Oracle
2024/06/05 16:59 P3 hotspot/test JDK-8333668 jdk/test/lib/process/ProcessToolsStartProcessTest.java fails with "wrong number of lines in OutputAnalyzer output" Elif Aslan Amazon Leonid Mesnik Oracle
2024/06/05 16:59 P4 hotspot/test JDK-8333667 ProcessTools.startProcess() has output issues when using an OutputAnalyzer at the same time Elif Aslan Amazon Leonid Mesnik Oracle
2024/06/05 08:39 P3 client-libs/java.awt JDK-8333637 getBounds API returns wrong value resulting in multiple Regression Test Failures on Ubuntu 23.04 Martin Doerr SAP Alexander Zvegintsev Oracle
2024/06/05 08:39 P4 hotspot/runtime JDK-8333636 ConcurrentHashTable::statistics_calculate synchronization is expensive Martin Doerr SAP Erik Österlund Oracle
2024/06/05 08:39 P3 hotspot/jfr JDK-8333635 Write and clear stack trace table outside of safepoint Martin Doerr SAP Markus Grönlund Oracle
2024/06/05 08:38 P3 client-libs/java.awt JDK-8333634 Update Libpng to 1.6.43 Martin Doerr SAP Harshitha Onkar Oracle
2024/06/05 08:38 P3 tools/javac JDK-8333632 Crash involving yield, switch and anonymous classes Martin Doerr SAP Jan Lahoda Oracle
2024/06/05 08:38 P3 client-libs/javax.swing JDK-8333631 Null icon returned for .exe without custom icon Martin Doerr SAP Alexander Zuev Oracle
2024/06/05 08:37 P3 client-libs/javax.swing JDK-8333630 JEditorPane.read throws ChangedCharSetException Martin Doerr SAP rjolly @users.sourceforge.net
2024/06/05 08:37 P4 hotspot/test JDK-8333629 failure_handler: log directory of commands Martin Doerr SAP Ludvig Janiuk Oracle
2024/06/05 08:37 P3 client-libs/java.awt JDK-8333628 Update GIFlib to 5.2.2 Martin Doerr SAP Alisen Chung Oracle
2024/06/05 08:36 P3 hotspot/compiler JDK-8333627 No native wrappers generated anymore with -XX:-TieredCompilation after JDK-8251462 Martin Doerr SAP Volker Simonis Amazon
2024/06/05 07:30 P4 client-libs/java.awt JDK-8333611 Delete test java/awt/Window/FindOwner/FindOwner.html Andrew Lu SAP Philip Race Oracle
2024/06/05 07:30 P5 hotspot/test JDK-8333610 Remove unused nativeUtils files Andrew Lu SAP Leonid Mesnik Oracle
2024/06/05 07:30 P4 client-libs/java.awt JDK-8333606 test java/awt/Robot/ManualInstructions/ManualInstructions.java isn't used Andrew Lu SAP Philip Race Oracle
2024/06/04 10:41 P4 hotspot/gc JDK-8333523 JavadocHelperTest.java OOMEs with Parallel GC and ZGC Sergey Bylokhov Amazon Thomas Schatzl Oracle
2024/06/04 08:54 P4 security-libs/java.security JDK-8333502 Avoid NoSuchMethodError when instantiating NativePRNG Oli Gillespie Amazon (same) (same)
2024/06/04 07:55 P4 client-libs/javax.swing JDK-8333484 Open source several Swing JTabbedPane JTextArea JTextField tests Andrew Lu SAP Damon Nguyen Oracle
2024/06/04 07:54 P3 tools/launcher JDK-8333480 Reduce verbose locale output in -XshowSettings launcher option Andrew Lu SAP Sean Coffey Oracle
2024/06/04 07:54 P4 hotspot/runtime JDK-8333479 Exclude some CDS tests from running with -Xshare:off Andrew Lu SAP Calvin Cheung Oracle
2024/06/04 07:53 P4 core-libs JDK-8333478 problemlist tests failing on latest Windows 11 update Andrew Lu SAP Mikhailo Seledtsov Oracle
2024/06/03 18:37 P4 hotspot/gc JDK-8333450 Reconsider TLAB zapping xlpeng2018 Independent Aleksey Shipilev Amazon
2024/06/03 17:12 P3 client-libs/2d JDK-8333448 Disabled tests in test/jdk/sun/java2d/marlin Sergey Bylokhov Amazon Liam Miller-Cushon Google
2024/06/03 14:30 P3 hotspot/runtime JDK-8333441 Delay TempSymbol cleanup to avoid symbol table churn Oli Gillespie Amazon (same) (same)
2024/06/03 14:28 P5 security-libs/java.security JDK-8333440 Cleanup dead code in java.security.Provider Oli Gillespie Amazon Andrey Turbanov Independent
2024/06/03 14:28 P4 security-libs/java.security JDK-8333439 Avoid Class.forName in SecureRandom constructor Oli Gillespie Amazon (same) (same)
2024/06/03 00:19 P4 client-libs/2d JDK-8333395 Create a test to verify that the cmm id is not ignored Sergey Bylokhov Amazon (same) (same)
2024/05/31 17:03 P4 hotspot/gc JDK-8333368 Shenandoah: Avoid forwarding when objects don't move in full-GC xlpeng Amazon Roman Kennke Amazon
2024/05/31 10:14 P4 hotspot/runtime JDK-8333345 Fix memory reporter for thread_count ier7928 Independent Johan Sjölen Oracle
2024/05/31 09:31 P4 hotspot/runtime JDK-8333342 NMT: summary diff reports threads count incorrectly ier7928 Independent (same) (same)
2024/05/31 09:07 P4 infrastructure/build JDK-8333341 createJMHBundle.sh download jars fail when url needed to be redirected syan Unknown (same) (same)
2024/05/31 09:06 P4 security-libs/java.security JDK-8333340 [jmh] the test security.CacheBench failed for multiple threads run syan Unknown Daniel Jelinski Oracle
2024/05/31 08:41 P3 hotspot/jfr JDK-8333332 RunThese30M fails "assert(_class_unload ? true : ((((JfrTraceIdBits::load(class_loader_klass)) & ((1 << 4) << 8)) != 0))) failed: invariant" rkmaurya Amazon Markus Grönlund Oracle
2024/05/31 08:15 P3 client-libs/java.awt JDK-8333328 [macos] java/awt/Window/Grab/GrabTest.java: Press on the outside area didn't cause ungrab Andrew Lu SAP Alisen Chung Oracle
2024/05/31 08:14 P4 hotspot/runtime JDK-8333327 Skip ReplaceCriticalClassesForSubgraphs when EnableJVMCI is specified Andrew Lu SAP Yudi Zheng Oracle
2024/05/31 00:37 P4 hotspot/gc JDK-8333314 Parallel: Remove PSAdaptiveSizePolicy::should_full_GC Zhengyu Gu Independent Albert Yang Oracle
2024/05/30 07:35 P3 hotspot/runtime JDK-8333244 Improve GenericWaitBarrier performance Aleksey Shipilev Amazon (same) (same)
2024/05/30 07:35 P2 tools/jpackage JDK-8333243 dpkg appears to have problems resolving symbolically linked native libraries Vladimir Petko Canonical Alexey Semenyuk Oracle
2024/05/29 13:55 P4 hotspot/runtime JDK-8333185 NMT: MemTracker::baseline should return void ariasdereyna Red Hat Thomas Stuefe Red Hat
2024/05/29 12:46 P4 security-libs/java.security JDK-8333179 Reduce runtime of java.security microbenchmarks syan Unknown Claes Redestad Oracle
2024/05/29 12:46 P3 hotspot/jfr JDK-8327660 The User and System of jdk.CPULoad on Apple M1 are inaccurate lyang Unknown yibo.yl Alibaba
2024/05/29 10:28 P3 hotspot/jfr JDK-8333166 RunThese30M fails "assert((!(((((JfrTraceIdBits::load(value)) & ((1 << 4) << 8)) != 0))))) failed: invariant" rkmaurya Amazon Markus Grönlund Oracle
2024/05/29 10:27 P3 core-libs/java.nio JDK-8333163 java/nio/channels/DatagramChannel/SendReceiveMaxSize.java fails on AIX due to small default RCVBUF size and different IPv6 Header interpretation Martin Doerr SAP Thomas Obermeier SAP
2024/05/29 10:25 P4 core-libs/java.net JDK-8333162 Uncontrolled memory consumption in SSLFlowDelegate.Reader Martin Doerr SAP Jaikiran Pai Oracle
2024/05/29 08:41 P4 infrastructure/release_eng JDK-8331265 Bump update version for OpenJDK: jdk-17.0.13 Christoph Langer SAP (same) (same)

No changesets log

Committer push log

Andrew Hughes, Red Hat

Bug Summary
JDK-8334335 [TESTBUG] Backport of 8279164 to 11u & 17u includes elements of JDK-8163327

Andrew Lu, SAP

Bug Summary
JDK-8333328 [macos] java/awt/Window/Grab/GrabTest.java: Press on the outside area didn't cause ungrab
JDK-8334498 Add test for ConcurrentModificationException in BasicDirectoryModel
JDK-8334377 compiler/codecache/CheckLargePages.java fails on OL 8.8 with unexpected memory string
JDK-8334499 Convert java/awt/font/TextLayout/TestJustification.html applet test to main
JDK-8334501 Convert java/awt/Frame/GetBoundsResizeTest/GetBoundsResizeTest.java applet test to main
JDK-8333611 Delete test java/awt/Window/FindOwner/FindOwner.html
JDK-8334093 Enable parallelism in vmTestbase/nsk/monitoring/stress/classload tests
JDK-8334091 Enable parallelism in vmTestbase/nsk/monitoring/stress/thread tests
JDK-8333479 Exclude some CDS tests from running with -Xshare:off
JDK-8334697 java/awt/event/MouseEvent/ClickDuringKeypress/ClickDuringKeypress.java imports Applet
JDK-8334188 java/awt/Focus/NonFocusableWindowTest/NonfocusableOwnerTest.java failed with "RuntimeException: Test failed."
JDK-8334375 java/util/concurrent/ConcurrentHashMap/ToArray.java timed out
JDK-8334190 Open source several add/remove MenuBar manual tests
JDK-8333484 Open source several Swing JTabbedPane JTextArea JTextField tests
JDK-8333935 Open source several Swing SplitPane and RadioButton related tests
JDK-8333478 problemlist tests failing on latest Windows 11 update
JDK-8333480 Reduce verbose locale output in -XshowSettings launcher option
JDK-8333610 Remove unused nativeUtils files
JDK-8333327 Skip ReplaceCriticalClassesForSubgraphs when EnableJVMCI is specified
JDK-8333936 Support JSplitPane for instructions and test UI
JDK-8333606 test java/awt/Robot/ManualInstructions/ManualInstructions.java isn't used
JDK-8334500 Test java/nio/channels/DatagramChannel/StressNativeSignal.java timed out
JDK-8334696 Test vmTestbase/metaspace/gc/watermark_70_80/TestDescription.java fails with no GC's recorded
JDK-8334703 The ArabicBox.java test has no control buttons

ariasdereyna, Red Hat

Bug Summary
JDK-8333185 NMT: MemTracker::baseline should return void

Amos SHI, SAP

Bug Summary
JDK-8334685 Some HttpClient tests don't report leaks

Chad Rakoczy, Amazon

Bug Summary
JDK-8334407 Improve jspawnhelper version checks

Christoph Langer, SAP

Bug Summary
JDK-8331265 Bump update version for OpenJDK: jdk-17.0.13

Dmitry Cherepanov, Azul

Bug Summary
JDK-8334440 [REDO] - [IMPROVE] OPEN_MAX is no longer the max limit on macOS >= 10.6 for RLIMIT_NOFILE
JDK-8334120 JDWP process management needs more efficient file descriptor handling

ec2-user, Amazon

Bug Summary
JDK-8333747 jspawnhelper without args fails with segfault

Elif Aslan, Amazon

Bug Summary
JDK-8333668 jdk/test/lib/process/ProcessToolsStartProcessTest.java fails with "wrong number of lines in OutputAnalyzer output"
JDK-8334704 Make runtime/Thread/ThreadCountLimit.java more robust
JDK-8333817 os::write incorrectly handles partial write
JDK-8333816 os::write should write completely
JDK-8333667 ProcessTools.startProcess() has output issues when using an OutputAnalyzer at the same time
JDK-8333818 read/write APIs in class os shall return ssize_t

fitzsim, Red Hat

Bug Summary
JDK-8333692 IGV: Update to work with JDK 16 and 17

ier7928, Independent

Bug Summary
JDK-8333345 Fix memory reporter for thread_count
JDK-8333342 NMT: summary diff reports threads count incorrectly

Takuya Kiriyama, Fujitsu

Bug Summary
JDK-8334029 Array Elements in OldObjectSample event has the incorrect description

lyang, Unknown

Bug Summary
JDK-8327660 The User and System of jdk.CPULoad on Apple M1 are inaccurate

Matthias Baesken, SAP

Bug Summary
JDK-8334480 avoid signed integer overflows in zip_util.c readCen / hashN
JDK-8334479 Linux ppc64le compile warning with clang in os_linux_ppc.cpp

Martin Doerr, SAP

Bug Summary
JDK-8333703 tag doesn't strikethrough the text
JDK-8333874 A few client tests intermittently throw ConcurrentModificationException
JDK-8334001 BasicDirectoryModel getDirectories and DoChangeContents.run can deadlock
JDK-8333999 Better pkcs11 performance for libpkcs11:C_EncryptInit/libpkcs11:C_DecryptInit
JDK-8333952 C2: meet between unloaded and speculative types is not symmetric
JDK-8333808 C2: Unloaded signature class kills argument value
JDK-8333636 ConcurrentHashTable::statistics_calculate synchronization is expensive
JDK-8333632 Crash involving yield, switch and anonymous classes
JDK-8333701 Default icon is not painted properly
JDK-8333998 Disable TLS_ECDH_* cipher suites
JDK-8333702 enhance PrintCodeCache to print more data
JDK-8333629 failure_handler: log directory of commands
JDK-8333637 getBounds API returns wrong value resulting in multiple Regression Test Failures on Ubuntu 23.04
JDK-8333873 HTMLReader uses ConvertAction instead of specified CharacterAction for , ,
JDK-8333163 java/nio/channels/DatagramChannel/SendReceiveMaxSize.java fails on AIX due to small default RCVBUF size and different IPv6 Header interpretation
JDK-8333809 JEditorPane ignores font-size styles in external linked css-file
JDK-8333630 JEditorPane.read throws ChangedCharSetException
JDK-8333627 No native wrappers generated anymore with -XX:-TieredCompilation after JDK-8251462
JDK-8333631 Null icon returned for .exe without custom icon
JDK-8334000 Race in BasicDirectoryModel.validateFileCache
JDK-8333872 text-decoration applied to lost when mixed with or
JDK-8333705 The MToolkit is still referenced in a few places
JDK-8334607 TLS 1.3 handshake fails if server_name doesn't match resuming session
JDK-8333162 Uncontrolled memory consumption in SSLFlowDelegate.Reader
JDK-8333628 Update GIFlib to 5.2.2
JDK-8333634 Update Libpng to 1.6.43
JDK-8333810 Win32ShellFolder2.compareTo is inconsistent
JDK-8333635 Write and clear stack trace table outside of safepoint

neethp, Amazon

Bug Summary
JDK-8333726 Restricted access to `/proc` can cause JFR initialization to crash
JDK-8334265 Shenandoah: Check for disarmed method before taking the nmethod lock

Oli Gillespie, Amazon

Bug Summary
JDK-8333439 Avoid Class.forName in SecureRandom constructor
JDK-8333502 Avoid NoSuchMethodError when instantiating NativePRNG
JDK-8333440 Cleanup dead code in java.security.Provider
JDK-8333441 Delay TempSymbol cleanup to avoid symbol table churn

rkmaurya, Amazon

Bug Summary
JDK-8333166 RunThese30M fails "assert((!(((((JfrTraceIdBits::load(value)) & ((1 << 4) << 8)) != 0))))) failed: invariant"
JDK-8333332 RunThese30M fails "assert(_class_unload ? true : ((((JfrTraceIdBits::load(class_loader_klass)) & ((1 << 4) << 8)) != 0))) failed: invariant"

Sergey Bylokhov, Amazon

Bug Summary
JDK-8333961 [macosx] Swing Popups should overlap taskbar
JDK-8334337 Convert javax/swing/border/Test4129681.java applet test to main
JDK-8333395 Create a test to verify that the cmm id is not ignored
JDK-8333448 Disabled tests in test/jdk/sun/java2d/marlin
JDK-8333523 JavadocHelperTest.java OOMEs with Parallel GC and ZGC
JDK-8334203 Several Swing jtreg tests use class.forName on L&F classes
JDK-8333707 Test jdk/jfr/event/oldobject/TestSanityDefault.java times out for some heap sizes
JDK-8334267 Update ProblemList for JFileChooser/8194044/FileSystemRootTest.java

Aleksey Shipilev, Amazon

Bug Summary
JDK-8333698 [17u] TestJstatdRmiPort fails after JDK-8333667
JDK-8333244 Improve GenericWaitBarrier performance
JDK-8281944 JavaDoc throws java.lang.IllegalStateException: ERRONEOUS

srutjay1, IBM

Bug Summary
JDK-8334116 Launching java with large number of jars in classpath with java.protocol.handler.pkgs system property set can lead to StackOverflowError

syan, Unknown

Bug Summary
JDK-8333340 [jmh] the test security.CacheBench failed for multiple threads run
JDK-8333341 createJMHBundle.sh download jars fail when url needed to be redirected
JDK-8334102 Delete extra empty spaces in Makefiles
JDK-8333785 Problem list security/infra/java/security/cert/CertPathValidator/certification/CAInterop.java#teliasonerarootcav1
JDK-8333179 Reduce runtime of java.security microbenchmarks

Vladimir Petko, Canonical

Bug Summary
JDK-8333243 dpkg appears to have problems resolving symbolically linked native libraries

xlpeng2018, Independent

Bug Summary
JDK-8333450 Reconsider TLAB zapping

xlpeng, Amazon

Bug Summary
JDK-8333368 Shenandoah: Avoid forwarding when objects don't move in full-GC

xpeng, Unknown

Bug Summary
JDK-8334266 C2: Sort spilling/unspilling sequence for better ld/st merging into ldp/stp on AArch64

Zhengyu Gu, Independent

Bug Summary
JDK-8333314 Parallel: Remove PSAdaptiveSizePolicy::should_full_GC