PUSHES REPORT: 17.0.16

This report shows who pushed the backports to the given release. This usually shows who did the backporting, testing, and review work.

Report generated: Thu Apr 03 05:53:24 CEST 2025

Distribution by priority

Count Priority
3 P2
18 P3
99 P4
2 P5

Distribution by components

Count Component
122 100% Total
72 59.0% client-libs
34 27.9% client-libs/java.awt
19 15.6% client-libs/javax.swing
9 7.4% client-libs
6 4.9% client-libs/2d
2 1.6% client-libs/javax.accessibility
1 0.8% client-libs/javax.sound
1 0.8% client-libs/javax.imageio
24 19.7% hotspot
8 6.6% hotspot/compiler
8 6.6% hotspot/runtime
3 2.5% hotspot/svc-agent
3 2.5% hotspot/gc
1 0.8% hotspot/jvmti
1 0.8% hotspot/jfr
10 8.2% core-libs
6 4.9% core-libs/java.net
2 1.6% core-libs/java.util:i18n
1 0.8% core-libs/java.time
1 0.8% core-libs/java.nio
6 4.9% security-libs
5 4.1% security-libs/java.security
1 0.8% security-libs/javax.crypto
4 3.3% core-svc
2 1.6% core-svc/java.lang.management
1 0.8% core-svc/javax.management
1 0.8% core-svc/debugger
3 2.5% tools
1 0.8% tools/jar
1 0.8% tools/jshell
1 0.8% tools
2 1.6% infrastructure
1 0.8% infrastructure/release_eng
1 0.8% infrastructure/build
1 0.8% xml
1 0.8% xml/jaxp

Distribution by affiliation

This Release Pushes

Original Pushes

Count Committer
122 100% Total
104 85.2% SAP
99 81.1% Goetz Lindenmaier
3 2.5% Matthias Baesken
1 0.8% Martin Doerr
1 0.8% Richard Reingruber
6 4.9% Unknown
6 4.9% ssubramaniam
4 3.3% Alibaba
4 3.3% Sendao Yan
3 2.5% BellSoft
3 2.5% Dmitry Chuyko
2 1.6% Amazon
2 1.6% costmuch
2 1.6% Red Hat
1 0.8% Martin Balao
1 0.8% Andrew Hughes
1 0.8% Azul
1 0.8% Roman Marchenko
Count Committer
122 100% Total
95 77.9% Oracle
13 10.7% Prasanta Sadhukhan
9 7.4% Abhishek Kumar
8 6.6% Alexander Zvegintsev
6 4.9% Alexey Ivanov
5 4.1% Harshitha Onkar
5 4.1% Tejesh R
5 4.1% Alexander Zuev
4 3.3% Weijun Wang
4 3.3% Damon Nguyen
4 3.3% Daniel Fuchs
3 2.5% Chris Plummer
3 2.5% Jayathirth D V
3 2.5% Alisen Chung
3 2.5% Philip Race
2 1.6% Emanuel Peter
2 1.6% Renjith Kannath Pariyangad
1 0.8% Markus Grönlund
1 0.8% Brian Burkhalter
1 0.8% mikhail.yankelevich
1 0.8% Jan Lahoda
1 0.8% David Holmes
1 0.8% Leonid Mesnik
1 0.8% Rajan Halade
1 0.8% Coleen Phillimore
1 0.8% Mahendra Chhipa
1 0.8% Jaikiran Pai
1 0.8% Kevin Walls
1 0.8% anass.baya
1 0.8% Matthew Donovan
1 0.8% Alex Menkov
1 0.8% Mikael Vidstedt
1 0.8% Thomas Schatzl
7 5.7% SAP
3 2.5% Matthias Baesken
2 1.6% Goetz Lindenmaier
1 0.8% Martin Doerr
1 0.8% Richard Reingruber
5 4.1% Amazon
3 2.5% Aleksey Shipilev
1 0.8% Yi-Fan Tsai
1 0.8% Chad Rakoczy
5 4.1% Red Hat
2 1.6% Thomas Stuefe
1 0.8% Robert Toyonaga
1 0.8% Andrew Hughes
1 0.8% Severin Gehwolf
3 2.5% Independent
1 0.8% projectd8
1 0.8% Sergey Tsypanov
1 0.8% tianshuang.me
3 2.5% JetBrains
3 2.5% Maxim Kartashev
1 0.8% Alibaba
1 0.8% Sendao Yan
1 0.8% BellSoft
1 0.8% Dmitry Chuyko
1 0.8% Canonical
1 0.8% Vladimir Petko
1 0.8% CloudBees
1 0.8% jglick

Chronological push log:

UTC Time Priority Component Bug Summary This Release Push By Original Push By
Name Affiliation Name Affiliation
2025/04/02 14:50 P4 hotspot/compiler JDK-8353563 [21u] AArch64: Ambiguous frame layout leads to incorrect traces in JFR Dmitry Chuyko BellSoft (same) (same)
2025/04/02 11:27 P3 client-libs/java.awt JDK-8353547 Update Libpng to 1.6.47 Goetz Lindenmaier SAP Harshitha Onkar Oracle
2025/04/02 11:24 P3 client-libs/2d JDK-8353546 Update HarfBuzz to 10.4.0 Goetz Lindenmaier SAP Harshitha Onkar Oracle
2025/04/02 10:14 P4 hotspot/runtime JDK-8353541 More reliable OOM handling in ExceptionDuringDumpAtObjectsInitPhase test Goetz Lindenmaier SAP Aleksey Shipilev Amazon
2025/04/02 10:09 P4 client-libs/java.awt JDK-8353539 Open source several AWT PopupMenu tests Goetz Lindenmaier SAP Abhishek Kumar Oracle
2025/04/02 10:04 P4 client-libs/2d JDK-8353537 Open source several Java2D rendering loop tests. Goetz Lindenmaier SAP Philip Race Oracle
2025/04/02 10:01 P4 client-libs/java.awt JDK-8353533 Opensource few AWT image tests Goetz Lindenmaier SAP Prasanta Sadhukhan Oracle
2025/04/02 09:58 P4 client-libs/java.awt JDK-8353532 Open source several AWT focus tests - series 3 Goetz Lindenmaier SAP Prasanta Sadhukhan Oracle
2025/04/02 09:55 P4 client-libs/java.awt JDK-8353527 Opensource few AWT PopupMenu tests Goetz Lindenmaier SAP Prasanta Sadhukhan Oracle
2025/04/02 09:51 P4 client-libs/javax.swing JDK-8353523 Convert and Opensource few JFileChooser applet test to main Goetz Lindenmaier SAP Abhishek Kumar Oracle
2025/04/02 09:50 P4 client-libs/javax.swing JDK-8353521 Open source several Swing HTMLEditorKit related tests Goetz Lindenmaier SAP Harshitha Onkar Oracle
2025/04/02 06:03 P4 hotspot/compiler JDK-8353501 Fix test-bugs related to stress flags Sendao Yan Alibaba Emanuel Peter Oracle
2025/03/31 18:43 P4 hotspot/compiler JDK-8353300 CTW: Attempt to preload all classes in constant pool ssubramaniam Unknown Aleksey Shipilev Amazon
2025/03/31 18:35 P4 core-libs/java.net JDK-8353297 URLConnection.getLastModified() leaks file handles for jar:file and file: URLs costmuch Amazon jglick CloudBees
2025/03/31 15:35 P3 hotspot/runtime JDK-8353280 vmTestbase/nsk/sysdict/vm/stress/btree/btree012/btree012.java failed with "fatal error: refcount has gone to zero" Dmitry Chuyko BellSoft Coleen Phillimore Oracle
2025/03/30 15:50 P4 hotspot/svc-agent JDK-8353229 Adjust exception No type named in database Matthias Baesken SAP (same) (same)
2025/03/30 15:48 P4 core-svc/java.lang.management JDK-8353228 [macOS]: UnixOperatingSystem.c:67:40: runtime error: division by zero Matthias Baesken SAP (same) (same)
2025/03/28 08:49 P4 client-libs/javax.sound JDK-8353164 Error output in libjsound has non matching format strings Matthias Baesken SAP (same) (same)
2025/03/27 16:31 P4 core-libs/java.net JDK-8353097 Remove unused fields from sun.net.www.protocol.jar.JarURLConnection costmuch Amazon Sergey Tsypanov Independent
2025/03/27 16:20 P4 core-libs/java.net JDK-8353095 test/jdk/java/net/httpclient/HttpsTunnelAuthTest.java fails intermittently Goetz Lindenmaier SAP Daniel Fuchs Oracle
2025/03/27 16:15 P4 security-libs/java.security JDK-8353094 Test sun/security/tools/jarsigner/ConciseJarsigner.java failed: unable to find valid certification path to requested target Goetz Lindenmaier SAP mikhail.yankelevich Oracle
2025/03/27 16:11 P3 hotspot/svc-agent JDK-8353092 Test serviceability/sa/ClhsdbCDSJstackPrintAll.java failed: ArrayIndexOutOfBoundsException Goetz Lindenmaier SAP Chris Plummer Oracle
2025/03/27 16:11 P4 hotspot/svc-agent JDK-8353091 serviceability/sa/ClhsdbWhere.java fails AssertionFailure: Corrupted constant pool Goetz Lindenmaier SAP Chris Plummer Oracle
2025/03/27 16:09 P4 client-libs/java.awt JDK-8353089 Open source closed frame tests # 4 Goetz Lindenmaier SAP Alexander Zvegintsev Oracle
2025/03/27 16:07 P4 client-libs/java.awt JDK-8353088 Open source some of the AWT Window tests Goetz Lindenmaier SAP Jayathirth D V Oracle
2025/03/27 16:06 P4 client-libs/java.awt JDK-8353087 Open source couple more miscellaneous AWT tests Goetz Lindenmaier SAP Alexander Zuev Oracle
2025/03/27 16:04 P4 client-libs/java.awt JDK-8353084 Open source several AWT focus tests - series 4 Goetz Lindenmaier SAP Prasanta Sadhukhan Oracle
2025/03/27 16:02 P4 client-libs/java.awt JDK-8353083 Open source closed choice tests #1 Goetz Lindenmaier SAP Alexander Zvegintsev Oracle
2025/03/27 16:00 P5 core-svc/debugger JDK-8353080 vmTestbase/nsk/jdb/stop_at/stop_at002/stop_at002.java failure goes undetected Goetz Lindenmaier SAP Chris Plummer Oracle
2025/03/27 15:58 P4 client-libs/javax.swing JDK-8353079 Opensource five Swing component related regression tests Goetz Lindenmaier SAP Alexander Zuev Oracle
2025/03/27 15:55 P4 client-libs/javax.swing JDK-8353075 Opensource five more random Swing tests Goetz Lindenmaier SAP Alexander Zuev Oracle
2025/03/27 15:53 P4 hotspot/runtime JDK-8353074 Limit sscanf output width in cgroup file parsers Goetz Lindenmaier SAP Thomas Stuefe Red Hat
2025/03/25 11:55 P4 core-libs/java.time JDK-8352998 (tz) zone.tab update missed in 2025a backport Andrew Hughes Red Hat (same) (same)
2025/03/25 00:04 P4 hotspot/jfr JDK-8352770 Crash: assert(h_array_list.not_null()) failed: invariant ssubramaniam Unknown Markus Grönlund Oracle
2025/03/25 00:04 P4 hotspot/runtime JDK-8352769 OpenJDK fails to configure on linux aarch64 when CDS is disabled after JDK-8331942 ssubramaniam Unknown Vladimir Petko Canonical
2025/03/24 18:36 P4 tools/jar JDK-8352749 Clean up the code in sun.tools.jar.Main to properly close resources and use ZipFile during extract Martin Balao Red Hat Jaikiran Pai Oracle
2025/03/24 15:18 P3 hotspot/compiler JDK-8352736 [AArch64] C1: guarantee(val < (1ULL << nbits)) failed: Field too big for insn Dmitry Chuyko BellSoft Chad Rakoczy Amazon
2025/03/20 19:40 P4 security-libs/java.security JDK-8352561 Test sun/security/tools/jarsigner/TimestampCheck.java is failing Goetz Lindenmaier SAP Weijun Wang Oracle
2025/03/20 19:39 P3 security-libs/java.security JDK-8352560 Remove Baltimore root certificate expiring in May 2025 Goetz Lindenmaier SAP Rajan Halade Oracle
2025/03/20 19:38 P3 client-libs/2d JDK-8352559 Update LCMS to 2.17 Goetz Lindenmaier SAP Alisen Chung Oracle
2025/03/20 19:37 P3 client-libs/java.awt JDK-8352558 [XWayland] No displayChanged event after setDisplayMode call Goetz Lindenmaier SAP Alexander Zvegintsev Oracle
2025/03/20 19:36 P4 security-libs/javax.crypto JDK-8352557 Upgrade NSS binaries for interop tests Goetz Lindenmaier SAP Matthew Donovan Oracle
2025/03/20 19:34 P4 client-libs JDK-8352556 Improve HTML instruction formatting in PassFailJFrame Goetz Lindenmaier SAP Alexey Ivanov Oracle
2025/03/20 19:33 P4 client-libs JDK-8352555 Exception thrown before awaitAndCheck hangs PassFailJFrame Goetz Lindenmaier SAP Alexey Ivanov Oracle
2025/03/20 19:32 P5 client-libs/javax.swing JDK-8352554 Use latch in AbstractButton/bug6298940.java instead of delay Goetz Lindenmaier SAP Alexey Ivanov Oracle
2025/03/20 19:30 P4 core-svc/javax.management JDK-8352553 Adjust timeout in test javax/management/monitor/DerivedGaugeMonitorTest.java Goetz Lindenmaier SAP Kevin Walls Oracle
2025/03/20 19:29 P4 hotspot/jvmti JDK-8352552 Enable debug logging for vmTestbase/nsk/jvmti/scenarios/sampling/SP05/sp05t003/TestDescription.java Goetz Lindenmaier SAP Alex Menkov Oracle
2025/03/20 19:27 P4 hotspot/compiler JDK-8352551 CompileFramework: test library to conveniently compile java and jasm sources for fuzzing Goetz Lindenmaier SAP Emanuel Peter Oracle
2025/03/20 19:26 P4 client-libs/java.awt JDK-8352550 Open source few more AWT PopupMenu tests Goetz Lindenmaier SAP Abhishek Kumar Oracle
2025/03/20 19:25 P4 client-libs/java.awt JDK-8352549 Open source more AWT window tests Goetz Lindenmaier SAP Jayathirth D V Oracle
2025/03/20 19:23 P4 client-libs/java.awt JDK-8352547 Open source AWT FileDialog related tests Goetz Lindenmaier SAP Abhishek Kumar Oracle
2025/03/20 19:22 P4 client-libs/java.awt JDK-8352546 Open source closed choice tests #3 Goetz Lindenmaier SAP Alexander Zvegintsev Oracle
2025/03/20 19:21 P4 hotspot/runtime JDK-8352545 Update runtime/condy tests to be executed with VM flags Goetz Lindenmaier SAP Leonid Mesnik Oracle
2025/03/20 19:19 P4 client-libs/javax.swing JDK-8352542 Open source several Swing PopupMenu related tests Goetz Lindenmaier SAP Tejesh R Oracle
2025/03/20 19:18 P4 core-libs/java.net JDK-8352541 java/net/httpclient/CancelRequestTest.java failing intermittently Goetz Lindenmaier SAP Daniel Fuchs Oracle
2025/03/18 08:48 P4 core-libs/java.util:i18n JDK-8352241 [21u] Problem list tests that fail in 21 and would be fixed by 8309622 Goetz Lindenmaier SAP (same) (same)
2025/03/18 08:42 P4 client-libs JDK-8352239 Remove PassFailJFrame constructor with screenshots Goetz Lindenmaier SAP anass.baya Oracle
2025/03/18 08:41 P4 core-libs/java.nio JDK-8352237 (fs) Remove some extensions from java/nio/file/Files/probeContentType/Basic.java Goetz Lindenmaier SAP Brian Burkhalter Oracle
2025/03/18 08:40 P4 client-libs/javax.swing JDK-8352236 JRadioButton/ButtonGroupFocusTest.java fails in CI on Linux Goetz Lindenmaier SAP Alexey Ivanov Oracle
2025/03/18 08:38 P4 client-libs/java.awt JDK-8352235 Automate javax/print/attribute/PageRangesException.java Goetz Lindenmaier SAP Renjith Kannath Pariyangad Oracle
2025/03/18 08:37 P4 core-libs/java.net JDK-8352231 java/net/Socket/UdpSocket.java fails with "java.net.BindException: Address already in use" (macos-aarch64) Goetz Lindenmaier SAP Daniel Fuchs Oracle
2025/03/18 08:35 P4 client-libs JDK-8352229 Open source some Desktop related tests Goetz Lindenmaier SAP Alexander Zuev Oracle
2025/03/18 08:34 P4 client-libs/java.awt JDK-8352228 Open source few Component tests - Set1 Goetz Lindenmaier SAP Damon Nguyen Oracle
2025/03/18 08:32 P4 core-libs/java.net JDK-8352226 assert fired in java/net/httpclient/DependentPromiseActionsTest (infrequent) Goetz Lindenmaier SAP Daniel Fuchs Oracle
2025/03/18 08:31 P2 hotspot/gc JDK-8352224 gc/metaspace/TestMetaspacePerfCounters.java#Epsilon-64 failed assertGreaterThanOrEqual: expected MMM >= NNN Goetz Lindenmaier SAP Thomas Schatzl Oracle
2025/03/15 20:21 P4 client-libs/java.awt JDK-8352106 Open source several AWT Dialog tests - Batch 4 Goetz Lindenmaier SAP Tejesh R Oracle
2025/03/15 20:20 P4 client-libs/java.awt JDK-8352105 Open source some Component/Panel/EventQueue tests - Set2 Goetz Lindenmaier SAP Damon Nguyen Oracle
2025/03/15 03:21 P4 hotspot/gc JDK-8352099 Bug in jdk.jfr.event.gc.collection.TestSystemGC Sendao Yan Alibaba Robert Toyonaga Red Hat
2025/03/14 12:59 P4 client-libs/java.awt JDK-8352063 Open source DnD tests - Set5 Goetz Lindenmaier SAP Harshitha Onkar Oracle
2025/03/14 12:58 P4 client-libs/java.awt JDK-8352062 Open source few Checkbox and Cursor tests - Set1 Goetz Lindenmaier SAP Damon Nguyen Oracle
2025/03/14 12:51 P4 client-libs/java.awt JDK-8352061 Open source closed frame tests # 2 Goetz Lindenmaier SAP Alexander Zvegintsev Oracle
2025/03/14 12:50 P4 client-libs/java.awt JDK-8352060 Open source several AWT focus tests - series 5 Goetz Lindenmaier SAP Prasanta Sadhukhan Oracle
2025/03/14 12:49 P4 client-libs/java.awt JDK-8352059 Open source closed choice tests #2 Goetz Lindenmaier SAP Alexander Zvegintsev Oracle
2025/03/14 12:48 P4 client-libs/java.awt JDK-8352058 Open source AWT MenuItem related tests Goetz Lindenmaier SAP Abhishek Kumar Oracle
2025/03/14 12:46 P4 client-libs/java.awt JDK-8352057 Open source several AWT focus tests - series 2 Goetz Lindenmaier SAP Prasanta Sadhukhan Oracle
2025/03/14 12:45 P4 client-libs/java.awt JDK-8352056 Open source several AWT focus tests - series 1 Goetz Lindenmaier SAP Prasanta Sadhukhan Oracle
2025/03/14 12:44 P4 client-libs/java.awt JDK-8352055 Convert and Open source few manual applet test to main based Goetz Lindenmaier SAP Tejesh R Oracle
2025/03/14 12:44 P4 client-libs/javax.swing JDK-8352054 Remove applet usage from JFileChooser tests bug4150029 Goetz Lindenmaier SAP Alisen Chung Oracle
2025/03/14 12:43 P4 client-libs/javax.swing JDK-8352053 Automate and open source few closed manual applet test Goetz Lindenmaier SAP Abhishek Kumar Oracle
2025/03/14 12:42 P4 client-libs/javax.swing JDK-8352052 Open source several Swing Scroll related tests Goetz Lindenmaier SAP Tejesh R Oracle
2025/03/14 12:40 P4 client-libs/javax.swing JDK-8352049 Open source several Swing RootPane and Slider related tests Goetz Lindenmaier SAP Tejesh R Oracle
2025/03/14 12:36 P2 client-libs/java.awt JDK-8352048 java/awt/Toolkit/GetScreenInsetsCustomGC/GetScreenInsetsCustomGC.java failed with 'Cannot invoke "sun.awt.X11GraphicsDevice.getInsets()" because "device" is null' Goetz Lindenmaier SAP Maxim Kartashev JetBrains
2025/03/14 10:46 P4 client-libs JDK-8352040 X11GraphicsDevice.pGetBounds() is slow in remote X11 sessions Goetz Lindenmaier SAP Maxim Kartashev JetBrains
2025/03/14 10:45 P3 hotspot/runtime JDK-8352039 Handle julong values in logging of GET_CONTAINER_INFO macros Goetz Lindenmaier SAP Severin Gehwolf Red Hat
2025/03/14 10:44 P3 client-libs/java.awt JDK-8352038 Crashes in getConfigColormap, getConfigVisualId, XVisualIDFromVisual on Linux Goetz Lindenmaier SAP Maxim Kartashev JetBrains
2025/03/14 10:42 P4 client-libs/javax.swing JDK-8352037 Clean up bug8033699 and bug8075609.java tests: regtesthelpers aren't used Goetz Lindenmaier SAP Alexey Ivanov Oracle
2025/03/13 19:10 P4 hotspot/compiler JDK-8351973 Use of types in compiler shared code should be consistent. ssubramaniam Unknown Yi-Fan Tsai Amazon
2025/03/13 16:23 P3 security-libs/java.security JDK-8351963 Jarsigner should print a warning if an entry is removed Roman Marchenko Azul Weijun Wang Oracle
2025/03/12 16:18 P4 hotspot/runtime JDK-8351873 Skip ValidateHazardPtrsClosure in non-debug builds ssubramaniam Unknown David Holmes Oracle
2025/03/11 14:22 P3 client-libs/2d JDK-8351664 Update FreeType to 2.13.3 Goetz Lindenmaier SAP Alisen Chung Oracle
2025/03/10 17:24 P4 hotspot/gc JDK-8351562 gc/stress/TestStressG1Uncommit.java gets OOM-killed ssubramaniam Unknown Aleksey Shipilev Amazon
2025/03/10 14:49 P3 client-libs/javax.accessibility JDK-8351544 [Accessibility,macOS,Screen Magnifier]: JCheckbox unchecked state does not magnify but works for checked state Goetz Lindenmaier SAP Abhishek Kumar Oracle
2025/03/10 14:49 P3 client-libs/javax.accessibility JDK-8351543 [Accessibility,macOS,VoiceOver] VoiceOver doesn't announce untick on toggling the checkbox with "space" key on macOS Goetz Lindenmaier SAP Abhishek Kumar Oracle
2025/03/10 14:48 P4 client-libs/java.awt JDK-8351541 AIX build failure after upgrade pipewire to 1.3.81 Goetz Lindenmaier SAP Alexander Zvegintsev Oracle
2025/03/10 14:43 P3 client-libs/java.awt JDK-8351540 Update PipeWire to 1.3.81 Goetz Lindenmaier SAP Alexander Zvegintsev Oracle
2025/03/10 14:39 P4 client-libs/java.awt JDK-8351539 Update List/ItemEventTest/ItemEventTest.java Goetz Lindenmaier SAP Alexey Ivanov Oracle
2025/03/10 14:38 P3 client-libs/javax.imageio JDK-8351537 Limit the length of inflated text chunks Goetz Lindenmaier SAP Jayathirth D V Oracle
2025/03/10 14:34 P4 client-libs/2d JDK-8351536 sun/awt/font/TestDevTransform.java fails with RuntimeException: Different rendering Goetz Lindenmaier SAP Philip Race Oracle
2025/03/10 14:31 P4 client-libs JDK-8351535 Open source several Choice related tests (part 2) Goetz Lindenmaier SAP Alexander Zuev Oracle
2025/03/10 14:27 P4 client-libs JDK-8351534 Open Source several AWT/2D font and rendering tests Goetz Lindenmaier SAP Philip Race Oracle
2025/03/10 14:26 P4 client-libs/javax.swing JDK-8351530 [macos] Menu or JPopupMenu not closed when main window is resized Goetz Lindenmaier SAP Prasanta Sadhukhan Oracle
2025/03/10 14:22 P4 client-libs/2d JDK-8351529 ColorConvertOp - typo for non-ICC conversions needs one-line fix Goetz Lindenmaier SAP Renjith Kannath Pariyangad Oracle
2025/03/10 14:21 P4 xml/jaxp JDK-8351525 Binary files in JAXP test should be removed Goetz Lindenmaier SAP Mahendra Chhipa Oracle
2025/03/10 14:19 P4 client-libs/javax.swing JDK-8351524 Open source several Swing CSS related tests Goetz Lindenmaier SAP Harshitha Onkar Oracle
2025/03/10 14:18 P3 client-libs/javax.swing JDK-8351523 JComboBox display issue with GTKLookAndFeel Goetz Lindenmaier SAP Abhishek Kumar Oracle
2025/03/10 14:16 P4 hotspot/runtime JDK-8351519 Clang warns about pointless comparisons Goetz Lindenmaier SAP Thomas Stuefe Red Hat
2025/03/10 14:15 P4 core-svc/java.lang.management JDK-8351518 usageTicks and totalTicks should be volatile to ensure that different threads get the latest ticks Goetz Lindenmaier SAP tianshuang.me Independent
2025/03/10 14:09 P2 tools JDK-8351517 test/langtools/tools/jdeps/jdkinternals/ShowReplacement.java failing after JDK-8296072 Goetz Lindenmaier SAP Weijun Wang Oracle
2025/03/10 14:09 P4 security-libs/java.security JDK-8351516 CertAttrSet::encode and DerEncoder::derEncode should write into DerOutputStream Goetz Lindenmaier SAP Weijun Wang Oracle
2025/03/10 14:05 P4 client-libs/javax.swing JDK-8351514 JOptionPane bungles HTML messages Goetz Lindenmaier SAP Prasanta Sadhukhan Oracle
2025/03/10 14:05 P4 client-libs/javax.swing JDK-8351513 Swing JOptionPane shows tag as a string after newline Goetz Lindenmaier SAP Prasanta Sadhukhan Oracle
2025/03/10 14:02 P4 client-libs/java.awt JDK-8351509 java/awt/FullScreen/FullscreenWindowProps/FullscreenWindowProps.java fails on Windows 10 with HiDPI screen Goetz Lindenmaier SAP projectd8 Independent
2025/03/10 08:58 P4 hotspot/compiler JDK-8351467 [PPC64]: postalloc_expand_java_dynamic_call_sched does not copy all fields Richard Reingruber SAP (same) (same)
2025/03/04 15:36 P4 core-libs/java.util:i18n JDK-8351189 [JMH] time.format.ZonedDateTimeFormatterBenchmark fails Sendao Yan Alibaba (same) (same)
2025/03/04 15:24 P4 client-libs JDK-8351186 Reset recursion counter missed in fix of JDK-8224267 Goetz Lindenmaier SAP Prasanta Sadhukhan Oracle
2025/03/04 15:14 P3 client-libs/javax.swing JDK-8351185 JOptionPane message string with 5000+ newlines produces StackOverflowError Goetz Lindenmaier SAP Prasanta Sadhukhan Oracle
2025/03/04 15:09 P4 client-libs/javax.swing JDK-8351184 [TEST_BUG] [macosx] CTRL+RIGHT(LEFT) doesn't move selection on next cell in JTable on Aqua L&F Goetz Lindenmaier SAP Damon Nguyen Oracle
2025/03/04 15:08 P4 client-libs JDK-8351183 javax/swing/JInternalFrame/8020708/bug8020708.java timeouts on Windows 11 Goetz Lindenmaier SAP Prasanta Sadhukhan Oracle
2025/03/04 15:07 P4 infrastructure/build JDK-8351182 Use better file for cygwin source permission check Goetz Lindenmaier SAP Mikael Vidstedt Oracle
2025/03/03 09:22 P4 hotspot/compiler JDK-8351024 CompileBroker::possibly_add_compiler_threads excessively polls available memory Martin Doerr SAP (same) (same)
2025/03/03 08:53 P4 tools/jshell JDK-8351021 Test FailOverDirectExecutionControlTest.java fails with -Xcomp Sendao Yan Alibaba Jan Lahoda Oracle
2025/02/26 08:29 P4 infrastructure/release_eng JDK-8350651 Bump update version for OpenJDK: jdk-17.0.16 Goetz Lindenmaier SAP (same) (same)

No changesets log

Committer push log

Andrew Hughes, Red Hat

Bug Summary
JDK-8352998 (tz) zone.tab update missed in 2025a backport

costmuch, Amazon

Bug Summary
JDK-8353097 Remove unused fields from sun.net.www.protocol.jar.JarURLConnection
JDK-8353297 URLConnection.getLastModified() leaks file handles for jar:file and file: URLs

Dmitry Chuyko, BellSoft

Bug Summary
JDK-8353563 [21u] AArch64: Ambiguous frame layout leads to incorrect traces in JFR
JDK-8352736 [AArch64] C1: guarantee(val < (1ULL << nbits)) failed: Field too big for insn
JDK-8353280 vmTestbase/nsk/sysdict/vm/stress/btree/btree012/btree012.java failed with "fatal error: refcount has gone to zero"

Goetz Lindenmaier, SAP

Bug Summary
JDK-8352237 (fs) Remove some extensions from java/nio/file/Files/probeContentType/Basic.java
JDK-8352241 [21u] Problem list tests that fail in 21 and would be fixed by 8309622
JDK-8351544 [Accessibility,macOS,Screen Magnifier]: JCheckbox unchecked state does not magnify but works for checked state
JDK-8351543 [Accessibility,macOS,VoiceOver] VoiceOver doesn't announce untick on toggling the checkbox with "space" key on macOS
JDK-8351530 [macos] Menu or JPopupMenu not closed when main window is resized
JDK-8351184 [TEST_BUG] [macosx] CTRL+RIGHT(LEFT) doesn't move selection on next cell in JTable on Aqua L&F
JDK-8352558 [XWayland] No displayChanged event after setDisplayMode call
JDK-8352553 Adjust timeout in test javax/management/monitor/DerivedGaugeMonitorTest.java
JDK-8351541 AIX build failure after upgrade pipewire to 1.3.81
JDK-8352226 assert fired in java/net/httpclient/DependentPromiseActionsTest (infrequent)
JDK-8352053 Automate and open source few closed manual applet test
JDK-8352235 Automate javax/print/attribute/PageRangesException.java
JDK-8351525 Binary files in JAXP test should be removed
JDK-8350651 Bump update version for OpenJDK: jdk-17.0.16
JDK-8351516 CertAttrSet::encode and DerEncoder::derEncode should write into DerOutputStream
JDK-8351519 Clang warns about pointless comparisons
JDK-8352037 Clean up bug8033699 and bug8075609.java tests: regtesthelpers aren't used
JDK-8351529 ColorConvertOp - typo for non-ICC conversions needs one-line fix
JDK-8352551 CompileFramework: test library to conveniently compile java and jasm sources for fuzzing
JDK-8352055 Convert and Open source few manual applet test to main based
JDK-8353523 Convert and Opensource few JFileChooser applet test to main
JDK-8352038 Crashes in getConfigColormap, getConfigVisualId, XVisualIDFromVisual on Linux
JDK-8352552 Enable debug logging for vmTestbase/nsk/jvmti/scenarios/sampling/SP05/sp05t003/TestDescription.java
JDK-8352555 Exception thrown before awaitAndCheck hangs PassFailJFrame
JDK-8352224 gc/metaspace/TestMetaspacePerfCounters.java#Epsilon-64 failed assertGreaterThanOrEqual: expected MMM >= NNN
JDK-8352039 Handle julong values in logging of GET_CONTAINER_INFO macros
JDK-8352556 Improve HTML instruction formatting in PassFailJFrame
JDK-8351509 java/awt/FullScreen/FullscreenWindowProps/FullscreenWindowProps.java fails on Windows 10 with HiDPI screen
JDK-8352048 java/awt/Toolkit/GetScreenInsetsCustomGC/GetScreenInsetsCustomGC.java failed with 'Cannot invoke "sun.awt.X11GraphicsDevice.getInsets()" because "device" is null'
JDK-8352541 java/net/httpclient/CancelRequestTest.java failing intermittently
JDK-8352231 java/net/Socket/UdpSocket.java fails with "java.net.BindException: Address already in use" (macos-aarch64)
JDK-8351183 javax/swing/JInternalFrame/8020708/bug8020708.java timeouts on Windows 11
JDK-8351523 JComboBox display issue with GTKLookAndFeel
JDK-8351514 JOptionPane bungles HTML messages
JDK-8351185 JOptionPane message string with 5000+ newlines produces StackOverflowError
JDK-8352236 JRadioButton/ButtonGroupFocusTest.java fails in CI on Linux
JDK-8353074 Limit sscanf output width in cgroup file parsers
JDK-8351537 Limit the length of inflated text chunks
JDK-8353541 More reliable OOM handling in ExceptionDuringDumpAtObjectsInitPhase test
JDK-8352547 Open source AWT FileDialog related tests
JDK-8352058 Open source AWT MenuItem related tests
JDK-8353083 Open source closed choice tests #1
JDK-8352059 Open source closed choice tests #2
JDK-8352546 Open source closed choice tests #3
JDK-8352061 Open source closed frame tests # 2
JDK-8353089 Open source closed frame tests # 4
JDK-8353087 Open source couple more miscellaneous AWT tests
JDK-8352063 Open source DnD tests - Set5
JDK-8352062 Open source few Checkbox and Cursor tests - Set1
JDK-8352228 Open source few Component tests - Set1
JDK-8352550 Open source few more AWT PopupMenu tests
JDK-8352549 Open source more AWT window tests
JDK-8352106 Open source several AWT Dialog tests - Batch 4
JDK-8352056 Open source several AWT focus tests - series 1
JDK-8352057 Open source several AWT focus tests - series 2
JDK-8353532 Open source several AWT focus tests - series 3
JDK-8353084 Open source several AWT focus tests - series 4
JDK-8352060 Open source several AWT focus tests - series 5
JDK-8353539 Open source several AWT PopupMenu tests
JDK-8351534 Open Source several AWT/2D font and rendering tests
JDK-8351535 Open source several Choice related tests (part 2)
JDK-8353537 Open source several Java2D rendering loop tests.
JDK-8351524 Open source several Swing CSS related tests
JDK-8353521 Open source several Swing HTMLEditorKit related tests
JDK-8352542 Open source several Swing PopupMenu related tests
JDK-8352049 Open source several Swing RootPane and Slider related tests
JDK-8352052 Open source several Swing Scroll related tests
JDK-8352105 Open source some Component/Panel/EventQueue tests - Set2
JDK-8352229 Open source some Desktop related tests
JDK-8353088 Open source some of the AWT Window tests
JDK-8353533 Opensource few AWT image tests
JDK-8353527 Opensource few AWT PopupMenu tests
JDK-8353075 Opensource five more random Swing tests
JDK-8353079 Opensource five Swing component related regression tests
JDK-8352054 Remove applet usage from JFileChooser tests bug4150029
JDK-8352560 Remove Baltimore root certificate expiring in May 2025
JDK-8352239 Remove PassFailJFrame constructor with screenshots
JDK-8351186 Reset recursion counter missed in fix of JDK-8224267
JDK-8353091 serviceability/sa/ClhsdbWhere.java fails AssertionFailure: Corrupted constant pool
JDK-8351536 sun/awt/font/TestDevTransform.java fails with RuntimeException: Different rendering
JDK-8351513 Swing JOptionPane shows tag as a string after newline
JDK-8353092 Test serviceability/sa/ClhsdbCDSJstackPrintAll.java failed: ArrayIndexOutOfBoundsException
JDK-8353094 Test sun/security/tools/jarsigner/ConciseJarsigner.java failed: unable to find valid certification path to requested target
JDK-8352561 Test sun/security/tools/jarsigner/TimestampCheck.java is failing
JDK-8353095 test/jdk/java/net/httpclient/HttpsTunnelAuthTest.java fails intermittently
JDK-8351517 test/langtools/tools/jdeps/jdkinternals/ShowReplacement.java failing after JDK-8296072
JDK-8351664 Update FreeType to 2.13.3
JDK-8353546 Update HarfBuzz to 10.4.0
JDK-8352559 Update LCMS to 2.17
JDK-8353547 Update Libpng to 1.6.47
JDK-8351539 Update List/ItemEventTest/ItemEventTest.java
JDK-8351540 Update PipeWire to 1.3.81
JDK-8352545 Update runtime/condy tests to be executed with VM flags
JDK-8352557 Upgrade NSS binaries for interop tests
JDK-8351518 usageTicks and totalTicks should be volatile to ensure that different threads get the latest ticks
JDK-8351182 Use better file for cygwin source permission check
JDK-8352554 Use latch in AbstractButton/bug6298940.java instead of delay
JDK-8353080 vmTestbase/nsk/jdb/stop_at/stop_at002/stop_at002.java failure goes undetected
JDK-8352040 X11GraphicsDevice.pGetBounds() is slow in remote X11 sessions

Matthias Baesken, SAP

Bug Summary
JDK-8353228 [macOS]: UnixOperatingSystem.c:67:40: runtime error: division by zero
JDK-8353229 Adjust exception No type named in database
JDK-8353164 Error output in libjsound has non matching format strings

Martin Balao, Red Hat

Bug Summary
JDK-8352749 Clean up the code in sun.tools.jar.Main to properly close resources and use ZipFile during extract

Martin Doerr, SAP

Bug Summary
JDK-8351024 CompileBroker::possibly_add_compiler_threads excessively polls available memory

Roman Marchenko, Azul

Bug Summary
JDK-8351963 Jarsigner should print a warning if an entry is removed

Richard Reingruber, SAP

Bug Summary
JDK-8351467 [PPC64]: postalloc_expand_java_dynamic_call_sched does not copy all fields

ssubramaniam, Unknown

Bug Summary
JDK-8352770 Crash: assert(h_array_list.not_null()) failed: invariant
JDK-8353300 CTW: Attempt to preload all classes in constant pool
JDK-8351562 gc/stress/TestStressG1Uncommit.java gets OOM-killed
JDK-8352769 OpenJDK fails to configure on linux aarch64 when CDS is disabled after JDK-8331942
JDK-8351873 Skip ValidateHazardPtrsClosure in non-debug builds
JDK-8351973 Use of types in compiler shared code should be consistent.

Sendao Yan, Alibaba

Bug Summary
JDK-8351189 [JMH] time.format.ZonedDateTimeFormatterBenchmark fails
JDK-8352099 Bug in jdk.jfr.event.gc.collection.TestSystemGC
JDK-8353501 Fix test-bugs related to stress flags
JDK-8351021 Test FailOverDirectExecutionControlTest.java fails with -Xcomp