PUSHES REPORT: 17.0.2

This report shows who pushed the backports to the given release. This usually shows who did the backporting, testing, and review work.

Report generated: Sat Feb 03 04:03:53 CET 2024

Distribution by priority

Count Priority
4 P1
51 P2
120 P3
186 P4
4 P5

Distribution by components

Count Component
365 100% Total
174 47.7% hotspot
62 17.0% hotspot/compiler
58 15.9% hotspot/runtime
34 9.3% hotspot/gc
6 1.6% hotspot/jfr
5 1.4% hotspot/test
4 1.1% hotspot/svc-agent
2 0.5% hotspot/jvmti
2 0.5% hotspot
1 0.3% hotspot/svc
57 15.6% client-libs
22 6.0% client-libs/javax.swing
13 3.6% client-libs/javax.accessibility
8 2.2% client-libs/2d
7 1.9% client-libs/java.awt
6 1.6% client-libs
1 0.3% client-libs/javax.sound
49 13.4% core-libs
12 3.3% core-libs/java.nio
9 2.5% core-libs/java.net
7 1.9% core-libs/java.time
4 1.1% core-libs
3 0.8% core-libs/java.io
3 0.8% core-libs/java.util:i18n
2 0.5% core-libs/java.io:serialization
2 0.5% core-libs/java.util
2 0.5% core-libs/java.lang.invoke
1 0.3% core-libs/java.util.concurrent
1 0.3% core-libs/java.nio.charsets
1 0.3% core-libs/java.util.stream
1 0.3% core-libs/java.lang:reflect
1 0.3% core-libs/java.lang
29 7.9% tools
15 4.1% tools/javac
9 2.5% tools/jpackage
3 0.8% tools/jshell
1 0.3% tools/javadoc(tool)
1 0.3% tools/launcher
27 7.4% security-libs
17 4.7% security-libs/java.security
4 1.1% security-libs/javax.net.ssl
3 0.8% security-libs/org.ietf.jgss:krb5
1 0.3% security-libs/javax.security
1 0.3% security-libs/javax.crypto
1 0.3% security-libs
18 4.9% infrastructure
15 4.1% infrastructure/build
3 0.8% infrastructure/release_eng
8 2.2% core-svc
3 0.8% core-svc/java.lang.management
2 0.5% core-svc/tools
1 0.3% core-svc
1 0.3% core-svc/java.lang.instrument
1 0.3% core-svc/debugger
2 0.5% xml
2 0.5% xml
1 0.3% globalization
1 0.3% globalization

Distribution by affiliation

This Release Pushes

Original Pushes

Count Committer
363 100% Total
141 38.8% Oracle
25 6.9% Tobias Hartmann
17 4.7% Igor Ignatyev
8 2.2% Daniel Daugherty
7 1.9% Yoshiki Sato
7 1.9% Andy Herrick
7 1.9% Alexander Zuev
6 1.7% Philip Race
5 1.4% Sean Coffey
5 1.4% Joe Darcy
4 1.1% Rajan Halade
4 1.1% Harold Seigel
3 0.8% David Holmes
3 0.8% Evan Whelan
3 0.8% Saravana Vijayasekaran
2 0.6% Patricio Chilano Mateo
2 0.6% Markus Grönlund
2 0.6% Chris Plummer
2 0.6% Claes Redestad
2 0.6% Roger Riggs
2 0.6% Vladimir Kozlov
2 0.6% Alexander Zvegintsev
2 0.6% Mandy Chung
2 0.6% Abdul Kolarkunnu
1 0.3% Prajwal Kumaraswamy
1 0.3% Hannes Wallnoefer
1 0.3% Alexey Semenyuk
1 0.3% pavel.kharskii
1 0.3% Ravi Reddy
1 0.3% Jayathirth D V
1 0.3% Jim Laskey
1 0.3% Naoto Sato
1 0.3% Stefan Karlsson
1 0.3% Ramkumar Sunderbabu
1 0.3% Jonathan Gibbons
1 0.3% Kim Barrett
1 0.3% Erik Österlund
1 0.3% Jorn Vernee
1 0.3% Fairoz Matte
1 0.3% Jesper Wilhelmsson
1 0.3% Erik Joelsson
1 0.3% Rajat Mahajan
1 0.3% Thomas Schatzl
72 19.8% Amazon
65 17.9% Aleksey Shipilev
4 1.1% Sergey Bylokhov
1 0.3% Clive Verghese
1 0.3% eastig
1 0.3% Volker Simonis
39 10.7% Red Hat
27 7.4% Alex Kasko
3 0.8% Severin Gehwolf
3 0.8% Thomas Stuefe
2 0.6% Andrew Hughes
1 0.3% Andrew Haley
1 0.3% Jonathan Dowland
1 0.3% Adam Farley
1 0.3% Roland Westrelin
37 10.2% Independent
14 3.9% Artem Semenov
9 2.5% Thejasvi Voniadka
6 1.7% Zhengyu Gu
5 1.4% Guoxiong Li
1 0.3% Chris Hegarty
1 0.3% Per Liden
1 0.3% jovan.stevanovic1
28 7.7% SAP
10 2.8% Martin Doerr
7 1.9% Christoph Langer
5 1.4% Matthias Baesken
3 0.8% Richard Reingruber
2 0.6% Goetz Lindenmaier
1 0.3% Lucy Schmidt
22 6.1% Azul
7 1.9% Ekaterina Vergizova
6 1.7% Ilarion Nakonechnyy
3 0.8% Olga Mikhaltcova
2 0.6% Alexey Bakhtin
2 0.6% Sergey Nazarkin
2 0.6% Alexey Pavlyutkin
7 1.9% Tencent
6 1.7% Jie Fu
1 0.3% Peng Xie
4 1.1% Alibaba
4 1.1% Yi Yang
4 1.1% JetBrains
3 0.8% Anton Tarasov
1 0.3% Artem.Semenov
4 1.1% Loongson
4 1.1% Qi Ao
2 0.6% Intel
2 0.6% Sandhya Viswanathan
1 0.3% Microdoc
1 0.3% Christoph Göttschkes
1 0.3% Microsoft
1 0.3% Mat Carter
1 0.3% Rivos
1 0.3% Robbin Ehn
Count Committer
365 100% Total
184 50.4% Oracle
23 6.3% Igor Ignatyev
11 3.0% Alexander Zuev
8 2.2% Daniel Daugherty
8 2.2% Rajan Halade
8 2.2% Christian Hagedorn
6 1.6% Tobias Hartmann
6 1.6% Naoto Sato
6 1.6% Vladimir Ivanov
5 1.4% Brian Burkhalter
5 1.4% David Holmes
5 1.4% Jaikiran Pai
5 1.4% Andy Herrick
4 1.1% Vicente Arturo Romero Zaldivar
4 1.1% Philip Race
3 0.8% Yoshiki Sato
3 0.8% Sean Coffey
3 0.8% Roger Riggs
3 0.8% Kim Barrett
3 0.8% Jan Lahoda
3 0.8% Alexey Semenyuk
3 0.8% Prasanta Sadhukhan
2 0.5% Patricio Chilano Mateo
2 0.5% Markus Grönlund
2 0.5% Jim Laskey
2 0.5% Alexander Zvegintsev
2 0.5% Erik Österlund
2 0.5% Rajat Mahajan
2 0.5% Magnus Ihse Bursie
2 0.5% Chris Plummer
2 0.5% Leonid Mesnik
2 0.5% Lance Andersen
2 0.5% Claes Redestad
2 0.5% Ian Graves
2 0.5% Harold Seigel
2 0.5% Mandy Chung
2 0.5% Jesper Wilhelmsson
2 0.5% Abdul Kolarkunnu
1 0.3% Sean Mullan
1 0.3% Calvin Cheung
1 0.3% Michael McMahon
1 0.3% Jayathirth D V
1 0.3% Mahendra Chhipa
1 0.3% Tejpal Rebari
1 0.3% Tobias Holenstein
1 0.3% Daniel Fuchs
1 0.3% Stefan Karlsson
1 0.3% Rickard Backman
1 0.3% Kevin Walls
1 0.3% Ivan Sipka
1 0.3% Jorn Vernee
1 0.3% Erik Joelsson
1 0.3% Thomas Schatzl
1 0.3% Saravana Vijayasekaran
1 0.3% Hannes Wallnoefer
1 0.3% Fernando Guallini
1 0.3% Christian Stein
1 0.3% pavel.kharskii
1 0.3% Coleen Phillimore
1 0.3% Vladimir Kozlov
1 0.3% Jamil Nimeh
1 0.3% Jonathan Gibbons
1 0.3% Joe Darcy
1 0.3% Evan Whelan
1 0.3% Serguei Spitsyn
54 14.8% Amazon
48 13.2% Aleksey Shipilev
4 1.1% Sergey Bylokhov
1 0.3% Clive Verghese
1 0.3% Roman Kennke
28 7.7% Independent
8 2.2% Zhengyu Gu
5 1.4% Guoxiong Li
4 1.1% Thejasvi Voniadka
3 0.8% Artem Semenov
2 0.5% Per Liden
1 0.3% Andrey Turbanov
1 0.3% Anirvan Sarkar
1 0.3% djelinski1
1 0.3% ganjianxuan
1 0.3% Jesper Møller
1 0.3% jovan.stevanovic1
21 5.8% SAP
6 1.6% Martin Doerr
6 1.6% Matthias Baesken
3 0.8% Richard Reingruber
2 0.5% Christoph Langer
2 0.5% Niklas Radomski
1 0.3% Ralf Schmelter
1 0.3% Lucy Schmidt
19 5.2% Red Hat
6 1.6% Roland Westrelin
3 0.8% Andrew Haley
3 0.8% Thomas Stuefe
3 0.8% Alex Kasko
1 0.3% Martin Balao
1 0.3% Andrew Hughes
1 0.3% Severin Gehwolf
1 0.3% Jiří Vaněk
17 4.7% JetBrains
13 3.6% Artem.Semenov
3 0.8% Anton Tarasov
1 0.3% Dmitry Batrak
12 3.3% Tencent
6 1.6% Jie Fu
2 0.5% Peng Xie
2 0.5% casparcwang
1 0.3% Xuelei Fan
1 0.3% Hui Shi
5 1.4% Alibaba
5 1.4% Yi Yang
4 1.1% ARM
3 0.8% Nick Gasson
1 0.3% Alan Hayward
4 1.1% Loongson
3 0.8% Qi Ao
1 0.3% sunxu01
3 0.8% Azul
1 0.3% Alexey Bakhtin
1 0.3% Ilarion Nakonechnyy
1 0.3% Ekaterina Vergizova
3 0.8% Intel
2 0.5% Sandhya Viswanathan
1 0.3% Jatin Bhateja
3 0.8% Unknown
3 0.8% N/A
2 0.5% Huawei
1 0.3% Dongbo He
1 0.3% Wang Huang
1 0.3% Fujitsu
1 0.3% Masanori Yano
1 0.3% Google
1 0.3% Liam Miller-Cushon
1 0.3% Microdoc
1 0.3% Christoph Göttschkes
1 0.3% Microsoft
1 0.3% Mat Carter
1 0.3% NTT DATA
1 0.3% Yasumasa Suenaga
1 0.3% Rivos
1 0.3% Robbin Ehn

Chronological push log:

UTC Time This Release Push By Original Push By Bug Summary
Name Affiliation Name Affiliation
2021/12/07 12:18 Fairoz Matte Oracle Christian Hagedorn Oracle JDK-8278340 SIGSEGV in C2 CompilerThread Node::rematerialize() compiling Packet::readUnsignedTrint
2021/12/06 13:31 Evan Whelan Oracle Ivan Sipka Oracle JDK-8278295 sun/net/www/http/KeepAliveStream/KeepAliveStreamCloseWithWrongContentLength.java wedged in getInputStream
2021/12/01 21:40 Aleksey Shipilev Amazon (same) (same) JDK-8278100 String Deduplication table is never cleaned up due to bad dead_factor_for_cleanup
2021/11/29 13:54 Alex Kasko Red Hat (same) (same) JDK-8277938 Fix java/nio/file/FileStore/Basic.java test by ignoring /run/user/* mount points
2021/11/29 13:08 Matthias Baesken SAP Jesper Møller Independent JDK-8277933 Suspicious string concatenation in logTestUtils.inline.hpp
2021/11/26 09:05 Richard Reingruber SAP (same) (same) JDK-8277859 JDWP Spec: the description for the Dispose command confuses suspend with resume.
2021/11/26 08:44 Anton Tarasov JetBrains (same) (same) JDK-8277858 CommonComponentAccessibility.createWithParent isWrapped causes mem leak
2021/11/24 21:05 Claes Redestad Oracle (same) (same) JDK-8277809 Use encodeASCII for ASCII-compatible DoubleByte encodings
2021/11/24 20:55 Claes Redestad Oracle (same) (same) JDK-8277642 Implement fast-path for ASCII-compatible CharsetEncoders on x86
2021/11/24 12:18 Evan Whelan Oracle Daniel Fuchs Oracle JDK-8277779 Cookie stored in CookieHandler not sent if user headers contain cookie
2021/11/24 08:31 Alexander Zuev Oracle (same) (same) JDK-8277751 [macos] A11y cursor gets stuck when combobox is closed
2021/11/24 08:30 Alexander Zuev Oracle (same) (same) JDK-8277750 Create implementation for NSAccessibilityProgressIndicator protocol peer
2021/11/24 08:07 Sean Coffey Oracle Magnus Ihse Bursie Oracle JDK-8277694 Javadoc external links should only have feature version number in URL
2021/11/24 06:16 Ramkumar Sunderbabu Oracle Nick Gasson ARM JDK-8277739 [TESTBUG] serviceability/sa/ClhsdbCDSCore.java fails with -XX:TieredStopAtLevel=1
2021/11/24 04:29 Artem Semenov Independent (same) (same) JDK-8277737 TableAccessibility and TableRowAccessibility miss autorelease
2021/11/23 22:39 Alex Kasko Red Hat Brian Burkhalter Oracle JDK-8277719 java/nio/channels/FileChannel/Transfer2GPlus.java failed with Unexpected transfer size: 2147418112
2021/11/23 22:17 Anton Tarasov JetBrains (same) (same) JDK-8277717 crash in [CommonComponentAccessibility getCAccessible:withEnv:]
2021/11/23 21:28 Anton Tarasov JetBrains (same) (same) JDK-8277716 [TableRowAccessibility accessibilityChildren] method is ineffective
2021/11/23 17:35 Alexander Zuev Oracle (same) (same) JDK-8277663 Create implementation for NSAccessibilityMenuBar protocol peer
2021/11/23 17:35 Alexander Zuev Oracle (same) (same) JDK-8277662 Create implementation for NSAccessibilityMenuItem protocol peer
2021/11/23 17:35 Alexander Zuev Oracle (same) (same) JDK-8277661 Create implementation for NSAccessibilityPopUpButton protocol peer
2021/11/23 17:35 Alexander Zuev Oracle (same) (same) JDK-8277660 Create implementation for NSAccessibilityMenu protocol peer
2021/11/23 15:24 Roger Riggs Oracle (same) (same) JDK-8277093 Vector should throw ClassNotFoundException for a missing class of an element
2021/11/23 12:36 Stefan Karlsson Oracle (same) (same) JDK-8277641 GC accidentally cleans valid megamorphic vtable inline caches
2021/11/23 12:10 Alex Kasko Red Hat Brian Burkhalter Oracle JDK-8277640 (fc) Data transfer from FileChannel to itself causes hang in case of overlap
2021/11/23 12:05 Alex Kasko Red Hat Daniel Daugherty Oracle JDK-8277639 ProblemList java/nio/channels/FileChannel/Transfer2GPlus.java on linux-aarch64
2021/11/23 10:40 Martin Doerr SAP Niklas Radomski SAP JDK-8277637 [ppc64] Port shenandoahgc to linux on ppc64le
2021/11/23 10:10 Sean Coffey Oracle djelinski1 Independent JDK-8275814 Incorrect instance to dispose
2021/11/23 10:09 Prajwal Kumaraswamy Oracle Jamil Nimeh Oracle JDK-8277633 Concurrent read/close of SSLSockets causes SSLSessions to be invalidated unnecessarily
2021/11/23 09:20 Jie Fu Tencent Kevin Walls Oracle JDK-8277632 TestJpsHostName.java not reliable, better to expand HostIdentifierCreate.java test
2021/11/23 08:20 Artem Semenov Independent (same) (same) JDK-8277195 missing CAccessibility definition in [CommonComponentAccessibility accessibilityHitTest]
2021/11/23 07:00 Adam Farley Red Hat Christian Stein Oracle JDK-8277629 tools/launcher/HelpFlagsTest.java Fails on Windows 32bit
2021/11/23 02:17 Guoxiong Li Independent (same) (same) JDK-8277618 AssertionError at jdk.compiler/com.sun.tools.javac.util.Assert.error(Assert.java:155)
2021/11/22 07:43 Aleksey Shipilev Amazon Zhengyu Gu Independent JDK-8277528 Shenandoah: Relax memory constraint for worker claiming tasks/ranges
2021/11/22 07:04 Aleksey Shipilev Amazon (same) (same) JDK-8277527 Update boot JDKs to 17.0.1 in GHA
2021/11/22 07:03 Aleksey Shipilev Amazon Kim Barrett Oracle JDK-8277526 PretouchTask num_chunks calculation can overflow
2021/11/19 18:14 Sean Coffey Oracle (same) (same) JDK-8277490 sun.security.pkcs.PKCS9Attributes.toString() throws NPE
2021/11/19 17:57 Mandy Chung Oracle (same) (same) JDK-8276035 System.loadLibrary fails on Big Sur for libraries hidden from filesystem
2021/11/19 17:42 Thomas Schatzl Oracle (same) (same) JDK-8277487 Missing memory barrier when checking active state for regions
2021/11/19 15:03 Zhengyu Gu Independent (same) (same) JDK-8277483 gc/stress/CriticalNativeStress.java fails intermittently with Shenandoah
2021/11/19 14:46 Jayathirth D V Oracle (same) (same) JDK-8277480 Use appropriate macosx_version_minimum value while compiling metal shaders
2021/11/19 14:25 Alex Kasko Red Hat Brian Burkhalter Oracle JDK-8277478 (fc) FileChannel.transferTo() transfers no more than Integer.MAX_VALUE bytes in one call
2021/11/19 14:16 Alex Kasko Red Hat Jaikiran Pai Oracle JDK-8277477 (fs) UnixFileSystemProvider should use StaticProperty.userDir().
2021/11/19 14:14 Thomas Stuefe Red Hat (same) (same) JDK-8277476 JMM GetDiagnosticXXXInfo APIs should verify output array sizes
2021/11/19 13:39 Aleksey Shipilev Amazon Igor Ignatyev Oracle JDK-8277473 split runtime/CommandLine/PrintTouchedMethods.java test
2021/11/19 13:38 Aleksey Shipilev Amazon (same) (same) JDK-8277472 Zero: Reformat opclabels_data
2021/11/19 13:38 Aleksey Shipilev Amazon (same) (same) JDK-8277471 (fs) java/nio/file/spi/SetDefaultProvider.java fails on x86_32
2021/11/19 13:37 Aleksey Shipilev Amazon (same) (same) JDK-8277470 java/awt/print/PrinterJob/CheckPrivilege.java fails due to disabled SecurityManager
2021/11/19 13:36 Aleksey Shipilev Amazon (same) (same) JDK-8277469 jdk/jshell/CustomInputToolBuilder.java fails intermittently on storage acquisition
2021/11/19 12:48 Artem Semenov Independent Artem.Semenov JetBrains JDK-8277464 JNI call of getAccessibleSelection on a wrong thread
2021/11/19 07:46 Artem Semenov Independent (same) (same) JDK-8277443 accessibility of a table on macOS lacks cell navigation
2021/11/18 11:15 Andrew Haley Red Hat (same) (same) JDK-8277384 AArch64: AES Galois CounterMode (GCM) interleaved implementation using vector instructions
2021/11/17 14:30 Zhengyu Gu Independent (same) (same) JDK-8277339 Shenandoah: CodeCache_lock should always be held for initializing code cache iteration
2021/11/17 11:46 Martin Doerr SAP Rickard Backman Oracle JDK-8277332 C2: assert(n->outcnt() != 0 || C->top() == n || n->is_Proj()) failed: No dead instructions after post-alloc
2021/11/16 15:50 Yoshiki Sato Oracle (same) (same) JDK-8277222 Update TimeZoneNames files to follow the changes made by JDK-8275766
2021/11/16 15:50 Yoshiki Sato Oracle (same) (same) JDK-8277220 TestZoneInfo310.java fails with tzdata2021e
2021/11/16 15:50 Yoshiki Sato Oracle (same) (same) JDK-8275768 (tz) Update Timezone Data to 2021e
2021/11/16 15:32 Aleksey Shipilev Amazon Rajan Halade Oracle JDK-8277217 security/infra/java/security/cert/CertPathValidator/certification/ComodoCA.java fails due to revoked cert
2021/11/16 14:24 Aleksey Shipilev Amazon Anirvan Sarkar Independent JDK-8277214 Windows GHA builds fail due to broken Cygwin
2021/11/16 12:53 Qi Ao Loongson (same) (same) JDK-8277208 tools/jpackage tests do not work on apt-based Linux distros like Debian
2021/11/16 12:05 Alex Kasko Red Hat Prasanta Sadhukhan Oracle JDK-8277206 Redo: Nimbus JTree renderer properties persist across L&F changes
2021/11/16 12:00 Alex Kasko Red Hat Brian Burkhalter Oracle JDK-8277205 java/io/File/GetXSpace.java failed with "RuntimeException: java.nio.file.NoSuchFileException: /run/user/0"
2021/11/16 10:52 Aleksey Shipilev Amazon (same) (same) JDK-8277199 Zero: Handle DiagnoseSyncOnValueBasedClasses VM option
2021/11/16 10:51 Aleksey Shipilev Amazon (same) (same) JDK-8277197 C2: Conv(D|F)2(I|L)Nodes::Ideal should handle rounding correctly
2021/11/16 10:49 Aleksey Shipilev Amazon (same) (same) JDK-8277196 JDK-8273416 is incomplete for UseSSE=1
2021/11/16 09:18 Artem Semenov Independent Artem.Semenov JetBrains JDK-8277191 Create implementation for NSAccessibilityCell protocol peer
2021/11/16 09:18 Artem Semenov Independent Artem.Semenov JetBrains JDK-8277190 Create implementation for NSAccessibilityRow protocol peer
2021/11/16 09:18 Artem Semenov Independent Artem.Semenov JetBrains JDK-8277189 Create implementation for NSAccessibilityColumn protocol peer
2021/11/16 09:18 Artem Semenov Independent Artem.Semenov JetBrains JDK-8277188 Create implementation for NSAccessibilityTable protocol
2021/11/16 09:18 Artem Semenov Independent Artem.Semenov JetBrains JDK-8277187 Create implementation for NSAccessibilityOutline protocol
2021/11/16 09:18 Artem Semenov Independent Artem.Semenov JetBrains JDK-8277186 Create implementation for NSAccessibilityList protocol peer
2021/11/16 09:18 Artem Semenov Independent Artem.Semenov JetBrains JDK-8277185 Create implementation for NSAccessibilityTabGroup protocol peer
2021/11/16 09:18 Artem Semenov Independent Artem.Semenov JetBrains JDK-8277184 Create implementation for NSAccessibilityComboBox protocol peer
2021/11/16 09:18 Artem Semenov Independent Artem.Semenov JetBrains JDK-8277183 Create implementation for NSAccessibilityNavigableStaticText protocol
2021/11/16 09:18 Artem Semenov Independent Artem.Semenov JetBrains JDK-8277182 Create NSAccessibilityElement implementation for JavaComponentAccessibility
2021/11/16 08:10 Aleksey Shipilev Amazon (same) (same) JDK-8277179 jdk/jfr/event/gc/detailed/TestGCLockerEvent.java fails when other GC is selected
2021/11/16 08:05 Aleksey Shipilev Amazon Magnus Ihse Bursie Oracle JDK-8277177 Windows-Aarch64 build is failing in GitHub actions
2021/11/16 08:04 Aleksey Shipilev Amazon (same) (same) JDK-8277176 C2: Compiler stack overflow during escape analysis on Linux x86_32
2021/11/16 07:19 Tobias Hartmann Oracle (same) (same) JDK-8277173 Inconsistent scalar replacement debug info at safepoints
2021/11/15 20:06 Alex Kasko Red Hat Michael McMahon Oracle JDK-8277154 Reusing HttpClient in a WebSocket.Listener hangs.
2021/11/15 20:00 Alex Kasko Red Hat Brian Burkhalter Oracle JDK-8277152 SctpMultiChannel never releases own file descriptor
2021/11/15 08:50 Aleksey Shipilev Amazon (same) (same) JDK-8277104 C2: assert(false) failed: bad AD file after JDK-8252372 with UseSSE={0,1}
2021/11/15 08:49 Aleksey Shipilev Amazon (same) (same) JDK-8277103 JFR: Add test for OldObjectSample event when using Shenandoah
2021/11/12 15:27 Alex Kasko Red Hat David Holmes Oracle JDK-8277064 Windows: link error: unresolved external symbol "int __cdecl convert_to_unicode(char const *,wchar_t * *)"
2021/11/12 15:25 Alex Kasko Red Hat (same) (same) JDK-8277063 Fix jaxp/javax/xml/jaxp/unittest/transform/SurrogateTest.java test
2021/11/12 07:19 Sergey Nazarkin Azul Erik Österlund Oracle JDK-8277039 c2i entry barriers read int as long on AArch64
2021/11/11 01:13 Sandhya Viswanathan Intel (same) (same) JDK-8276980 Hotspot's libsvml.so may conflict with user dependency
2021/11/10 18:30 Andrew Hughes Red Hat Jiří Vaněk Red Hat JDK-8276967 Sync J2DBench run and analyze Makefile targets with build.xml
2021/11/10 10:56 Alex Kasko Red Hat David Holmes Oracle JDK-8276936 Call new Win32 API SetThreadDescription in os::set_native_thread_name
2021/11/10 09:56 Aleksey Shipilev Amazon Andrew Haley Red Hat JDK-8276933 AArch64: Support for weaker memory ordering in Atomic
2021/11/10 01:59 Sandhya Viswanathan Intel (same) (same) JDK-8276910 Fix the copyright header of SVML files
2021/11/10 01:55 Andrew Hughes Red Hat (same) (same) JDK-8276909 Fake libsyslookup.so library causes tooling issues
2021/11/09 15:55 Aleksey Shipilev Amazon Igor Ignatyev Oracle JDK-8276884 serviceability/jvmti/GetObjectSizeClass.java shouldn't have vm.flagless
2021/11/09 15:54 Aleksey Shipilev Amazon (same) (same) JDK-8276883 java/lang/management/MemoryMXBean/MemoryTest.java test should handle Shenandoah
2021/11/09 15:53 Aleksey Shipilev Amazon (same) (same) JDK-8276882 java/lang/management/ManagementFactory/MXBeanException.java test fails with Shenandoah
2021/11/09 15:52 Aleksey Shipilev Amazon (same) (same) JDK-8276881 Use SHA256 hash in build.tools.depend.Depend
2021/11/09 14:17 Alex Kasko Red Hat Alexander Zuev Oracle JDK-8276861 javax/swing/JComponent/7154030/bug7154030.java fails with "Exception: Failed to hide opaque button"
2021/11/09 14:05 Ilarion Nakonechnyy Azul (same) (same) JDK-8276860 Slow LoginContext.login() on multi threading application
2021/11/09 14:00 Alex Kasko Red Hat Jesper Wilhelmsson Oracle JDK-8276858 UnProblemList javax/swing/JComponent/7154030/bug7154030.java in JDK18
2021/11/09 13:21 Alexey Pavlyutkin Azul Andrew Haley Red Hat JDK-8276855 AArch64: size_fits_all_mem_uses should return false if its output is a CAS
2021/11/09 13:00 Zhengyu Gu Independent (same) (same) JDK-8276853 Shenandoah: Race results degenerated GC to enter wrong entry point
2021/11/05 16:28 Yi Yang Alibaba (same) (same) JDK-8276747 C2: Improve Add and Xor ideal optimizations
2021/11/05 16:14 Yi Yang Alibaba (same) (same) JDK-8276744 Typo PHASE_CPP in CompilerPhaseType
2021/11/05 14:06 Zhengyu Gu Independent Coleen Phillimore Oracle JDK-8276729 com/sun/jdi/RedefineCrossEvent.java failed "assert(m != __null) failed: NULL mirror"
2021/11/05 12:31 Alex Kasko Red Hat Igor Ignatyev Oracle JDK-8276725 macos doesn't check `os::set_boot_path()` result
2021/11/05 12:04 Alex Kasko Red Hat Yi Yang Alibaba JDK-8276723 Unused _last_state in osThread_windows
2021/11/05 11:50 Alex Kasko Red Hat Leonid Mesnik Oracle JDK-8276722 Remove native pre-jdk9 support for jtreg failure handler
2021/11/05 11:40 Alex Kasko Red Hat Prasanta Sadhukhan Oracle JDK-8276720 SwingSet2 JTable Demo throws NullPointerException
2021/11/05 11:37 Alex Kasko Red Hat Masanori Yano Fujitsu JDK-8276719 XML Transformer outputs Unicode supplementary character incorrectly to HTML
2021/11/05 11:32 Alex Kasko Red Hat Alexander Zuev Oracle JDK-8276718 [macos11] SystemIconTest fails with ClassCastException
2021/11/05 11:28 Alex Kasko Red Hat Tejpal Rebari Oracle JDK-8276717 Nimbus JTree default tree cell renderer does not use selected text color
2021/11/05 11:21 Alex Kasko Red Hat Alexander Zuev Oracle JDK-8276716 javax/swing/JFileChooser/FileSystemView/SystemIconTest.java fails on windows
2021/11/05 11:19 Alex Kasko Red Hat ganjianxuan Independent JDK-8276715 Fix the infinite loop in next_line
2021/11/05 11:12 Alex Kasko Red Hat Mahendra Chhipa Oracle JDK-8276714 Remove dependancy of TestHttpsServer, HttpTransaction, HttpCallback from open/test/jdk/sun/net/www/protocol/https/ tests
2021/11/05 11:09 Alex Kasko Red Hat Aleksey Shipilev Amazon JDK-8276712 Useless initialization in com/sun/crypto/provider/PBES2Parameters.java
2021/11/05 11:01 Alex Kasko Red Hat (same) (same) JDK-8276710 NTLM authentication fails if HEAD request is used
2021/11/05 03:10 Jie Fu Tencent (same) (same) JDK-8276675 Reset LoopPercentProfileLimit for x86 due to suboptimal performance
2021/11/01 23:07 Mandy Chung Oracle (same) (same) JDK-8276261 LambdaMetaFactory::metafactory on REF_invokeSpecial impl method has incorrect behavior
2021/11/01 14:20 Ekaterina Vergizova Azul Vicente Arturo Romero Zaldivar Oracle JDK-8276233 unexpected compiler error: cast, intersection types and sealed
2021/10/29 16:13 Erik Joelsson Oracle (same) (same) JDK-8276122 Change openjdk project in jcheck to jdk-updates
2021/10/29 07:28 Christoph Langer SAP (same) (same) JDK-8276130 Fix Github Actions of JDK17u to account for update version scheme
2021/10/28 20:40 Olga Mikhaltcova Azul Serguei Spitsyn Oracle JDK-8276134 memory leak in appendBootClassPath(), paths must be deallocated
2021/10/28 20:39 Qi Ao Loongson (same) (same) JDK-8276133 some testlibrary_tests/ir_framework tests fail when c1 disabled
2021/10/28 20:38 Thejasvi Voniadka Independent Jaikiran Pai Oracle JDK-8276132 java/nio/file/WatchService/LotsOfEvents.java fails intermittently
2021/10/28 20:37 Qi Ao Loongson Christian Hagedorn Oracle JDK-8276131 IR framework does not handle client VM builds correctly
2021/10/26 15:12 Alexey Pavlyutkin Azul Jaikiran Pai Oracle JDK-8275965 (zipfs): Accessing a large entry (> 2^31 bytes) leads to a negative initial size for ByteArrayOutputStream
2021/10/26 13:26 Evan Whelan Oracle (same) (same) JDK-8275922 HttpURLConnection: HttpClient and HttpsClient incorrectly check request method when set to POST
2021/10/25 15:27 Ilarion Nakonechnyy Azul Igor Ignatyev Oracle JDK-8275880 several hotspot runtime/modules don't check exit codes
2021/10/25 15:26 Ilarion Nakonechnyy Azul Xuelei Fan Tencent JDK-8275879 Undeleted debug information
2021/10/25 15:26 Ilarion Nakonechnyy Azul Igor Ignatyev Oracle JDK-8275878 runtime/cds/appcds/MoveJDKTest.java doesn't check exit codes
2021/10/25 15:24 Ilarion Nakonechnyy Azul Kim Barrett Oracle JDK-8275877 Fix data races in G1PeriodicGCTask
2021/10/23 00:47 Naoto Sato Oracle (same) (same) JDK-8275379 file.encoding system property has an incorrect value on Windows
2021/10/21 08:21 Ravi Reddy Oracle Lance Andersen Oracle JDK-8274695 (zipfs) Files.walkFileTree walks infinitely if zip has dir named "." inside
2021/10/21 07:40 Alexey Bakhtin Azul (same) (same) JDK-8275701 Handle KDC_ERR_SVC_UNAVAILABLE error code from KDC
2021/10/21 07:37 Alexey Bakhtin Azul Sean Mullan Oracle JDK-8275700 X509CertImpl.getFingerprint should not return the empty String
2021/10/20 15:26 Matthias Baesken SAP (same) (same) JDK-8275649 Cleanup AddFontsToX11FontPath
2021/10/19 15:01 Martin Doerr SAP Niklas Radomski SAP JDK-8275516 [ppc64] Port zgc to linux on ppc64le
2021/10/18 10:06 Ekaterina Vergizova Azul Jan Lahoda Oracle JDK-8275402 Passing a *nested* switch expression as a parameter causes an NPE during compile
2021/10/18 09:57 Ekaterina Vergizova Azul Vicente Arturo Romero Zaldivar Oracle JDK-8275401 extended 'for' with expression of type tvar causes the compiler to crash
2021/10/18 09:35 Martin Doerr SAP (same) (same) JDK-8275399 [ZGC] missing null check in ZNMethod::log_register
2021/10/18 09:35 Martin Doerr SAP (same) (same) JDK-8275398 C2: GraphKit::load_array_element bypasses Access API
2021/10/18 09:34 Martin Doerr SAP (same) (same) JDK-8275397 [PPC64] resolve_jobject needs a generic implementation to support load barriers
2021/10/18 09:33 Martin Doerr SAP (same) (same) JDK-8275396 [TESTBUG] Wrong weakCompareAndSet assumption in UnsafeIntrinsicsTest
2021/10/18 09:32 Martin Doerr SAP (same) (same) JDK-8275395 c2i entry barriers read int as long on PPC
2021/10/18 09:31 Martin Doerr SAP (same) (same) JDK-8275394 [TESTBUG] UnsafeIntrinsicsTest intermittently fails on weak memory model platform
2021/10/18 09:18 Ilarion Nakonechnyy Azul Jie Fu Tencent JDK-8275393 Fix the implementation of loop unrolling heuristic with LoopPercentProfileLimit
2021/10/17 15:47 Philip Race Oracle Dmitry Batrak JetBrains JDK-8275365 Exceptions after a touchpad gesture on macOS
2021/10/17 13:16 Zhengyu Gu Independent (same) (same) JDK-8275363 Shenandoah: Correct ordering of requested gc cause and gc request flag
2021/10/17 13:15 Zhengyu Gu Independent (same) (same) JDK-8275362 Shenandoah: intermittent timeout with ConcurrentGCBreakpoint tests
2021/10/14 12:39 Harold Seigel Oracle Calvin Cheung Oracle JDK-8275285 runtime/cds/appcds/loaderConstraints/DynamicLoaderConstraintsTest.java#default-cl crashed with SIGSEGV in MetaspaceShared::link_shared_classes
2021/10/14 12:35 Harold Seigel Oracle Matthias Baesken SAP JDK-8275284 Update OS detection code to recognize Windows 11
2021/10/13 10:28 Yoshiki Sato Oracle Naoto Sato Oracle JDK-8275214 TimeZoneTest.java fails with tzdata2021b
2021/10/13 10:28 Yoshiki Sato Oracle Naoto Sato Oracle JDK-8275213 TestZoneInfo310.java fails with tzdata2021b
2021/10/13 10:28 Yoshiki Sato Oracle Naoto Sato Oracle JDK-8275017 (tz) Update Timezone Data to 2021c
2021/10/13 05:03 Goetz Lindenmaier SAP Thejasvi Voniadka Independent JDK-8275189 The test test/langtools/tools/javac/versions/Versions.java has duplicate test cycles
2021/10/13 05:01 Goetz Lindenmaier SAP Prasanta Sadhukhan Oracle JDK-8275188 [TEST_BUG] javax/swing/plaf/basic/BasicHTML/4251579/bug4251579.java failure due to timing
2021/10/12 15:38 pavel.kharskii Oracle (same) (same) JDK-8275141 recover corrupted line endings for the version-numbers.conf
2021/10/12 11:32 Peng Xie Tencent (same) (same) JDK-8275129 Build failure on macOS with Xcode 13.0 as vfork is deprecated
2021/10/12 09:26 Qi Ao Loongson (same) (same) JDK-8275108 Add Zero support for LoongArch
2021/10/12 07:56 Matthias Baesken SAP (same) (same) JDK-8275105 handle latest VS2019 in abstract_vm_version
2021/10/12 06:02 Tobias Hartmann Oracle Roland Westrelin Red Hat JDK-8275094 C2: condition incorrectly made redundant with dominating main loop exit condition
2021/10/12 06:02 Tobias Hartmann Oracle Christian Hagedorn Oracle JDK-8275093 C2: Missing NegativeArraySizeException when creating StringBuilder with negative capacity
2021/10/12 05:59 Tobias Hartmann Oracle Roland Westrelin Red Hat JDK-8275092 C2: assert(false) failed: Bad graph detected in build_loop_late
2021/10/12 05:17 Mat Carter Microsoft (same) (same) JDK-8267256 Extend minimal retry for loopback connections on Windows to PlainSocketImpl
2021/10/12 02:29 Jie Fu Tencent (same) (same) JDK-8275088 gtest build failure due to stringop-overflow warning with gcc11
2021/10/11 11:51 Tobias Hartmann Oracle Christian Hagedorn Oracle JDK-8275043 RunThese30M.java failed "assert(!LCA_orig->dominates(pred_block) || early->dominates(pred_block)) failed: early is high enough"
2021/10/11 09:10 Yi Yang Alibaba Jaikiran Pai Oracle JDK-8275036 Potential cyclic dependencies between Gregorian and CalendarSystem
2021/10/11 08:16 Tobias Hartmann Oracle Christian Hagedorn Oracle JDK-8275029 SIGFPE with C2 compiled code with -XX:+StressGCM
2021/10/11 06:49 Matthias Baesken SAP (same) (same) JDK-8275026 package help is not displayed for missing X11/extensions/Xrandr.h
2021/10/09 11:49 Jie Fu Tencent (same) (same) JDK-8274997 Fix non-portable HotSpot code in MethodMatcher::parse_method_pattern
2021/10/09 11:45 Jie Fu Tencent (same) (same) JDK-8274996 C4819 warning at vm_version_x86.cpp on Windows after JDK-8234160
2021/10/08 09:51 Martin Doerr SAP Christoph Langer SAP JDK-8274959 jdk/jshell/CommandCompletionTest.java fails with NoSuchElementException after JDK-8271287
2021/10/08 09:50 Sean Coffey Oracle (same) (same) JDK-8274958 Correct Manifest file name and NPE checks
2021/10/07 12:53 Ekaterina Vergizova Azul Jan Lahoda Oracle JDK-8274906 Javac throws when compiling switch (null)
2021/10/07 12:48 Ekaterina Vergizova Azul Vicente Arturo Romero Zaldivar Oracle JDK-8274905 duplicate checkcast when destination type is not first type of intersection type
2021/10/07 12:46 Ekaterina Vergizova Azul Vicente Arturo Romero Zaldivar Oracle JDK-8274904 NPE in Flow$FlowAnalyzer.visitApply: Cannot invoke getThrownTypes because tree.meth.type is null
2021/10/07 11:22 Christoph Langer SAP Matthias Baesken SAP JDK-8274897 Update OS detection code to recognize Windows Server 2022
2021/10/07 10:51 Robbin Ehn Rivos (same) (same) JDK-8274896 Safepoint deadlock on VMOperation_lock
2021/10/07 06:58 Aleksey Shipilev Amazon Igor Ignatyev Oracle JDK-8274877 DoubleFlagWithIntegerValue uses G1GC-only flag
2021/10/07 06:56 Aleksey Shipilev Amazon (same) (same) JDK-8274876 Zero: Handle UseHeavyMonitors on all monitorenter paths
2021/10/07 04:19 Thomas Stuefe Red Hat (same) (same) JDK-8274866 gtest/MetaspaceGtests executes unnecessary tests in debug builds
2021/10/06 13:46 Harold Seigel Oracle (same) (same) JDK-8274842 Null pointer dereference in classFileParser.cpp:2817
2021/10/05 10:32 Aleksey Shipilev Amazon (same) (same) JDK-8274772 Move some runtime/Metaspace/elastic/ tests out of tier1
2021/10/05 08:27 Aleksey Shipilev Amazon Tobias Holenstein Oracle JDK-8274765 StressSeed should be set via FLAG_SET_ERGO
2021/10/05 07:30 Aleksey Shipilev Amazon (same) (same) JDK-8274760 Zero: Disable vtable/itableStub gtests
2021/10/05 07:28 Aleksey Shipilev Amazon (same) (same) JDK-8274759 Zero: Handle "zero" variant in runtime tests
2021/10/05 07:06 David Holmes Oracle (same) (same) JDK-8274756 ForkJoinPool.commonPool() does not work with 1 CPU
2021/10/04 14:54 Aleksey Shipilev Amazon (same) (same) JDK-8274725 Update testing docs to mention tiered testing
2021/10/04 14:53 Aleksey Shipilev Amazon (same) (same) JDK-8274724 Add tier4 test groups
2021/10/04 12:36 Aleksey Shipilev Amazon (same) (same) JDK-8274712 Some containers/docker/TestJFREvents.java configs are running out of memory
2021/10/04 12:36 Aleksey Shipilev Amazon (same) (same) JDK-8274711 Parallelize and increase timeouts for java/foreign/TestMatrix.java test
2021/10/04 12:35 Aleksey Shipilev Amazon (same) (same) JDK-8274710 Limit run time for java/lang/invoke/LFCaching tests
2021/10/04 12:34 Aleksey Shipilev Amazon Jaikiran Pai Oracle JDK-8274709 ConcurrentModificationException raised every time ReferralsCache drops referral
2021/10/04 12:33 Aleksey Shipilev Amazon (same) (same) JDK-8274708 compiler/cpuflags/TestSSE4Disabled.java should test for CPU feature explicitly
2021/10/04 12:33 Aleksey Shipilev Amazon (same) (same) JDK-8274707 Zero: Drop incorrect test block from compiler/startup/NumCompilerThreadsCheck.java
2021/10/04 12:32 Aleksey Shipilev Amazon (same) (same) JDK-8274706 compiler/blackhole tests should not run with interpreter-only VMs
2021/10/04 12:31 Aleksey Shipilev Amazon (same) (same) JDK-8274705 Zero: Clear pending JNI exception check in native method handler
2021/10/04 12:30 Aleksey Shipilev Amazon (same) (same) JDK-8274704 Zero: Disable runtime/Unsafe/InternalErrorTest.java
2021/10/04 12:30 Aleksey Shipilev Amazon (same) (same) JDK-8274703 Zero should warn about unimplemented -XX:+LogTouchedMethods
2021/10/04 12:24 Aleksey Shipilev Amazon (same) (same) JDK-8274702 Zero: SPARC64 build fails with si_band type mismatch
2021/10/04 11:55 Aleksey Shipilev Amazon (same) (same) JDK-8274700 Zero: Cannot invoke JVM in primordial threads on Zero
2021/10/04 11:38 Ekaterina Vergizova Azul (same) (same) JDK-8274697 EXCEPTION_ACCESS_VIOLATION in BFSClosure::closure_impl
2021/10/04 10:41 Aleksey Shipilev Amazon (same) (same) JDK-8274693 Create hotspot:tier2 and hotspot:tier3 test groups
2021/10/04 10:13 Aleksey Shipilev Amazon (same) (same) JDK-8274691 InfoOptsTest is failing in tier1
2021/10/01 12:12 Thejasvi Voniadka Independent Jan Lahoda Oracle JDK-8274641 jdk/jshell/CommandCompletionTest.java fails with "lists don't have the same size expected"
2021/10/01 06:25 Aleksey Shipilev Amazon (same) (same) JDK-8274623 Shenandoah: Remove the remaining uses of os::is_MP
2021/09/30 19:37 Sergey Bylokhov Amazon (same) (same) JDK-8274608 [macos] java/awt/color/ICC_ColorSpace/MTTransformReplacedProfile.java timed out
2021/09/30 18:25 Severin Gehwolf Red Hat Lance Andersen Oracle JDK-8274607 (zipfs) Files.getFileAttributeView() throws UOE instead of returning null when view not supported
2021/09/30 17:08 Guoxiong Li Independent (same) (same) JDK-8274478 Some duplicated javac command-line options have repeated effect
2021/09/30 16:50 Philip Race Oracle (same) (same) JDK-8274604 [macos] Ensure initialisation of sun/lwawt/macosx/CAccessibility in JavaComponentAccessibility.m
2021/09/30 10:36 Artem.Semenov JetBrains (same) (same) JDK-8274557 missing CAccessibility definitions in JNI code
2021/09/30 04:58 jovan.stevanovic1 Independent (same) (same) JDK-8274535 Support XSLT on GraalVM Native Image--deterministic bytecode generation in XSLT
2021/09/29 22:28 Sergey Bylokhov Amazon (same) (same) JDK-8274526 java/awt/color/ICC_ColorSpace/MTTransformReplacedProfile.java crashes in liblcms.dylib with NULLSeek+0x7
2021/09/29 21:34 Andy Herrick Oracle (same) (same) JDK-8274290 Windows DLL path not set correctly.
2021/09/29 21:31 Andy Herrick Oracle Alexey Semenyuk Oracle JDK-8274443 Add unit test for what jpackage app launcher puts in the environment
2021/09/29 17:35 Rajat Mahajan Oracle (same) (same) JDK-8274389 Expand ButtonGroupLayoutTraversalTest.java to run in all LaFs, including Aqua on macOS
2021/09/29 13:08 Tobias Hartmann Oracle (same) (same) JDK-8274514 compiler/c2/Test7179138_1.java timed out
2021/09/29 13:04 Yoshiki Sato Oracle Naoto Sato Oracle JDK-8274246 ArrayIndexOutOfBoundsException thrown in java.util.JapaneseImperialCalendar.add()
2021/09/29 06:26 Tobias Hartmann Oracle Roland Westrelin Red Hat JDK-8274493 Opcode() != Op_If && Opcode() != Op_RangeCheck) || outcnt() == 2 assert failure with Test7179138_1.java
2021/09/29 06:25 Tobias Hartmann Oracle Vladimir Ivanov Oracle JDK-8274492 CI: ciInstanceKlass::get_canonical_holder() doesn't respect instance size
2021/09/29 06:23 Tobias Hartmann Oracle Vladimir Ivanov Oracle JDK-8274489 assert(IncrementalInline || (_late_inlines.length() == 0 && !has_mh_late_inlines()))
2021/09/29 06:21 Tobias Hartmann Oracle Vladimir Ivanov Oracle JDK-8274488 C2: Missing interference with mismatched unsafe accesses
2021/09/29 06:19 Tobias Hartmann Oracle Vladimir Ivanov Oracle JDK-8274487 C2: CheckCastPP which should closely follow Allocate is sunk of a loop
2021/09/29 06:18 Tobias Hartmann Oracle Roland Westrelin Red Hat JDK-8274486 Crash in PhaseIdealLoop::verify_strip_mined_scheduling
2021/09/29 06:16 Tobias Hartmann Oracle Roland Westrelin Red Hat JDK-8274485 Crash PhaseIdealLoop::clone_outer_loop
2021/09/29 06:14 Tobias Hartmann Oracle Wang Huang Huawei JDK-8274484 Incorrect num of element count calculation for vector cast
2021/09/29 06:12 Tobias Hartmann Oracle casparcwang Tencent JDK-8274483 C2: assert(false) failed: Bad graph detected in build_loop_late
2021/09/29 06:10 Tobias Hartmann Oracle Christian Hagedorn Oracle JDK-8274482 C2: assert(false) failed: Bad graph detected in build_loop_late
2021/09/29 06:08 Tobias Hartmann Oracle Vladimir Ivanov Oracle JDK-8274481 GraphKit::combine_exception_states fails with "matching stack sizes" assert
2021/09/29 06:04 Tobias Hartmann Oracle casparcwang Tencent JDK-8274480 C2: crash in PhaseCFG::global_code_motion
2021/09/29 05:21 Guoxiong Li Independent (same) (same) JDK-8274477 javac generates unreachable code when using empty semicolon statement
2021/09/29 05:20 Guoxiong Li Independent (same) (same) JDK-8274476 java.lang.AssertionError: typeSig ERROR on generated class property of record
2021/09/29 04:56 Thejasvi Voniadka Independent sunxu01 Loongson JDK-8274474 jdk/nio/zipfs/ZipFSTester.java fails if file path contains '+' character
2021/09/28 21:31 Andy Herrick Oracle Alexey Semenyuk Oracle JDK-8274441 java.library.path is not set properly by Windows jpackage app launcher
2021/09/28 21:04 Sergey Bylokhov Amazon (same) (same) JDK-8274463 Crash when during color transformation the color profile is replaced
2021/09/28 11:37 Guoxiong Li Independent (same) (same) JDK-8274439 forged ASTs can provoke an AIOOBE at com.sun.tools.javac.jvm.ClassWriter::writePosition
2021/09/28 08:52 Thomas Stuefe Red Hat (same) (same) JDK-8273601 jcmd to trim the glibc heap
2021/09/28 01:59 Sergey Bylokhov Amazon (same) (same) JDK-8274409 javax/swing/JTable/4235420/bug4235420.java fails in GTK L&F
2021/09/27 16:45 Philip Race Oracle Artem.Semenov JetBrains JDK-8274382 JavaAccessibilityUtilities leaks JNI objects
2021/09/27 14:34 Christoph Langer SAP Roger Riggs Oracle JDK-8274377 Most JDK releases report macOS version 12 as 10.16 instead of 12.0
2021/09/27 14:16 Olga Mikhaltcova Azul Leonid Mesnik Oracle JDK-8274376 Remove unreachable return in mutexLocker::wait
2021/09/27 14:12 Olga Mikhaltcova Azul Andrey Turbanov Independent JDK-8274375 Remove redundant 'new String' calls after concatenation in java.desktop
2021/09/24 15:22 Sergey Nazarkin Azul Nick Gasson ARM JDK-8274292 C2: ClhsdbJstackXcompStress test fails when StressGCM is enabled
2021/09/23 19:36 Rajan Halade Oracle (same) (same) JDK-8274215 Remove globalsignr2ca root from 17.0.2
2021/09/23 05:24 Thejasvi Voniadka Independent (same) (same) JDK-8274184 Add openssl from path variable also in to Default System Openssl Path in OpensslArtifactFetcher
2021/09/20 18:00 Jonathan Dowland Red Hat Rajat Mahajan Oracle JDK-8274021 [TEST_BUG] java/awt/print/PrinterJob/PageDialogMarginTest.java catches all exceptions
2021/09/20 17:41 Joe Darcy Oracle Ian Graves Oracle JDK-8274017 java/util/DoubleStreamSums/CompensatedSums.java failure
2021/09/20 17:08 Joe Darcy Oracle Ian Graves Oracle JDK-8274015 Bug in parallel Kahan summation implementation
2021/09/20 17:06 Aleksey Shipilev Amazon Ralf Schmelter SAP JDK-8274014 Improve performance of HeapDumpAllTest
2021/09/20 17:03 Aleksey Shipilev Amazon (same) (same) JDK-8274013 Update JMH devkit to 1.32
2021/09/20 17:02 Aleksey Shipilev Amazon Per Liden Independent JDK-8274012 C2 intrinsic for Reference.refersTo() is often not used
2021/09/20 17:01 Aleksey Shipilev Amazon (same) (same) JDK-8274011 Parallelize runtime/InvocationTests/
2021/09/20 16:58 Aleksey Shipilev Amazon (same) (same) JDK-8274010 Drop zapping values in the Zap* option descriptions
2021/09/20 16:55 Aleksey Shipilev Amazon (same) (same) JDK-8274009 Support stack watermarks in Zero VM
2021/09/20 16:54 Aleksey Shipilev Amazon (same) (same) JDK-8274008 Move CriticalJNI tests out of tier1
2021/09/17 17:59 Andy Herrick Oracle (same) (same) JDK-8273241 jpackaged applications using microphone on mac
2021/09/16 19:56 Volker Simonis Amazon N/A Unknown JDK-8273908 Memory leak in OopStorage due to bug in OopHandle::release()
2021/09/15 12:50 Richard Reingruber SAP (same) (same) JDK-8273813 [TESTBUG] gc/g1/TestMixedGCLiveThreshold.java can fail if G1 Full GC uses >1 workers
2021/09/14 21:18 Christoph Langer SAP Alexander Zuev Oracle JDK-8273767 [macos] Focus not painted in JButton when setBorderPainted(false) is invoked
2021/09/14 19:55 Philip Race Oracle (same) (same) JDK-8273755 macOS Monterey does not have the font Times needed by Serif
2021/09/14 18:11 Andy Herrick Oracle (same) (same) JDK-8273593 [REDO] Warn user when using mac-sign option with unsigned app-image.
2021/09/14 07:51 Aleksey Shipilev Amazon Alan Hayward ARM JDK-8273706 pauth_aarch64.hpp include name is incorrect
2021/09/11 20:23 Lucy Schmidt SAP (same) (same) JDK-8273637 [ppc] [s390]: Crash in JavaThread::pd_get_top_frame_for_profiling
2021/09/10 14:17 Andy Herrick Oracle (same) (same) JDK-8273604 Backout JDK-8271868
2021/09/09 19:31 Andy Herrick Oracle (same) (same) JDK-8273282 Warn user when using mac-sign option with unsigned app-image.
2021/09/09 19:21 Clive Verghese Amazon (same) (same) JDK-8273567 Large Allocation in CipherSuite
2021/09/09 18:24 Saravana Vijayasekaran Oracle N/A Unknown JDK-8273565 Reenable German localization for builds at Oracle
2021/09/09 13:45 Aleksey Shipilev Amazon Tobias Hartmann Oracle JDK-8273556 Incorrect compile command used by TestIllegalArrayCopyBeforeInfiniteLoop
2021/09/09 09:04 Per Liden Independent (same) (same) JDK-8273537 ZGC: stack overflow (segv) when -Xlog:gc+start=debug
2021/09/09 07:57 Aleksey Shipilev Amazon Zhengyu Gu Independent JDK-8273535 Shenandoah: Add test for JDK-8269661
2021/09/09 07:56 Aleksey Shipilev Amazon Zhengyu Gu Independent JDK-8273534 Shenandoah: Cleanup TestStringDedup and TestStringDedupStress tests
2021/09/09 07:54 Aleksey Shipilev Amazon (same) (same) JDK-8273533 Epsilon: Refactor tests to improve performance
2021/09/09 07:06 Chris Hegarty Independent Naoto Sato Oracle JDK-8273530 Parsing epoch seconds at a DST transition with a non-UTC parser is wrong
2021/09/09 05:48 Thejasvi Voniadka Independent Fernando Guallini Oracle JDK-8273525 sun/security/ssl/DHKeyExchange/LegacyDHEKeyExchange.java still fails due to "An established connection was aborted by the software in your host machine"
2021/09/09 05:39 Matthias Baesken SAP (same) (same) JDK-8273524 linux x86_64 check for binutils 2.25 or higher after 8265783
2021/09/08 15:36 Aleksey Shipilev Amazon (same) (same) JDK-8273504 (bf) Replace StringBuffer in *Buffer.toString()
2021/09/08 14:57 Aleksey Shipilev Amazon (same) (same) JDK-8273501 Shenandoah: Introduce weak/strong marking asserts
2021/09/02 15:41 Rajan Halade Oracle (same) (same) JDK-8273150 Revert "8225083: Remove Google certificate that is expiring in December 2021"
2021/08/29 07:26 Christoph Langer SAP Thejasvi Voniadka Independent JDK-8273105 [Test]: java/net/httpclient/DigestEchoClientSSL.java contains redundant @run tags
2021/08/26 04:05 Abdul Kolarkunnu Oracle (same) (same) JDK-8273007 sun/security/pkcs11/Provider/MultipleLogins.sh fails after JDK-8266182
2021/08/26 03:47 Abdul Kolarkunnu Oracle (same) (same) JDK-8273006 Automate manual steps listed in the test jdk/sun/security/pkcs12/ParamsTest.java
2021/08/26 01:45 David Holmes Oracle (same) (same) JDK-8273003 RunThese24H.java failed with EXCEPTION_ACCESS_VIOLATION in java_lang_Thread::get_thread_status
2021/08/25 23:21 Philip Race Oracle (same) (same) JDK-8273002 [macOS] "Apple AWT Internal Exception" when input method is changed
2021/08/25 11:33 Sean Coffey Oracle (same) (same) JDK-8272845 Session resumption errors
2021/08/24 21:08 Aleksey Shipilev Amazon Roman Kennke Amazon JDK-8272942 Shenandoah: Resolve UNKNOWN access strength, where possible
2021/08/24 09:03 Jie Fu Tencent (same) (same) JDK-8272891 [macos] Build failure with Xcode 13.0 after JDK-8264848
2021/08/24 07:26 Christoph Langer SAP Martin Balao Red Hat JDK-8272883 Kerberos Credential Retrieval from Cache not Working in Cross-Realm Setup
2021/08/24 02:33 David Holmes Oracle (same) (same) JDK-8272871 StackGuardPages test doesn't build with glibc 2.34
2021/08/23 07:46 Thejasvi Voniadka Independent (same) (same) JDK-8272825 [Test]: Cleanup: test/jdk/security/infra/java/security/cert/CertPathValidator/certification/BuypassCA.java no longer needs ocspEnabled
2021/08/23 07:41 Aleksey Shipilev Amazon (same) (same) JDK-8272824 Shenandoah: Optimize gc/shenandoah/TestRefprocSanity.java for interpreter mode
2021/08/23 07:40 Aleksey Shipilev Amazon (same) (same) JDK-8272823 Shenandoah: Provide human-readable labels for test configurations
2021/08/23 07:39 Aleksey Shipilev Amazon (same) (same) JDK-8272822 Shenandoah: gc/shenandoah/mxbeans tests should be more resilient
2021/08/20 20:29 Philip Race Oracle (same) (same) JDK-8272794 [macOS] not all KEY_PRESSED events sent when control modifier is used
2021/08/20 16:43 Joe Darcy Oracle Jim Laskey Oracle JDK-8272789 java/util/Random/RandomTestMoments.java had two Gaussian fails
2021/08/19 05:11 Thejasvi Voniadka Independent Rajan Halade Oracle JDK-8272692 security/infra/java/security/cert/CertPathValidator/certification/QuoVadisCA.java fails, Certificate has been revoked
2021/08/19 04:29 Thejasvi Voniadka Independent Rajan Halade Oracle JDK-8272690 security/infra/java/security/cert/CertPathValidator/certification/LetsEncryptCA.java OCSP response error
2021/08/19 04:15 Thejasvi Voniadka Independent Rajan Halade Oracle JDK-8272689 jtreg test security/infra/java/security/cert/CertPathValidator/certification/BuypassCA.java fails
2021/08/18 20:27 Rajan Halade Oracle (same) (same) JDK-8272665 Remove Google certificate that is expiring in December 2021
2021/08/18 18:52 Harold Seigel Oracle (same) (same) JDK-8272663 Cgroup v1 initialization causes NullPointerException when cgroup path contains colon
2021/08/18 15:19 Tobias Hartmann Oracle Hui Shi Tencent JDK-8272657 PhaseMacroExpand::generate_slow_arraycopy crash when clone null CallProjections.fallthrough_ioproj
2021/08/18 14:09 Tobias Hartmann Oracle Yi Yang Alibaba JDK-8272650 C2: assert(iff->Opcode() == Op_If || iff->Opcode() == Op_CountedLoopEnd || iff->Opcode() == Op_RangeCheck) failed: Check this code when new subtype is added
2021/08/18 14:08 Tobias Hartmann Oracle Vladimir Ivanov Oracle JDK-8272649 C2: Wrong JVM state used for receiver null check
2021/08/18 13:23 Tobias Hartmann Oracle Christian Hagedorn Oracle JDK-8272647 [IR Framework] Some default regexes matching on PrintOptoAssembly in IRNode.java do not work on all platforms
2021/08/18 13:22 Tobias Hartmann Oracle (same) (same) JDK-8272646 ZGC: Arraycopy stub passes invalid oop to load barrier
2021/08/18 13:21 Tobias Hartmann Oracle Christian Hagedorn Oracle JDK-8272645 C2: assert(no_dead_loop) failed: dead loop detected
2021/08/18 13:20 Tobias Hartmann Oracle (same) (same) JDK-8272644 ZGC: ZBarrierSetC2::clone_at_expansion fails with "Guard against surprises" assert
2021/08/17 22:49 Joe Darcy Oracle Liam Miller-Cushon Google JDK-8272605 Repeatable annotations without @Target cannot have containers that target module declarations
2021/08/16 09:57 Severin Gehwolf Red Hat (same) (same) JDK-8272518 --with-harfbuzz=system doesn't add -lharfbuzz after JDK-8255790
2021/08/13 00:06 Vladimir Kozlov Oracle Jatin Bhateja Intel JDK-8272399 Fatal error with variable shift count integer rotate operation.
2021/08/06 23:33 eastig Amazon Dongbo He Huawei JDK-8272109 Improve AlgorithmConstraints:checkAlgorithm performance
2021/08/05 22:12 Jonathan Gibbons Oracle (same) (same) JDK-8272179 Final nroff manpage update for JDK 17
2021/08/05 14:54 Severin Gehwolf Red Hat Peng Xie Tencent JDK-8271955 OperatingSystemMXBean getProcessCpuLoad reports incorrect process cpu usage in containers
2021/08/05 09:13 Markus Grönlund Oracle (same) (same) JDK-8272178 JFR Recorder Thread crashed with SIGSEGV in write_klass
2021/08/05 01:00 Daniel Daugherty Oracle Yasumasa Suenaga NTT DATA JDK-8272177 ProblemList serviceability/sa/TestJmapCore.java on linux-x64 with ZGC
2021/08/04 20:49 Christoph Langer SAP Nick Gasson ARM JDK-8271900 AARCH64: typo in LIR_Assembler::emit_profile_type
2021/08/04 19:23 Daniel Daugherty Oracle (same) (same) JDK-8272176 ProblemList javax/swing/JComponent/7154030/bug7154030.java in JDK17
2021/08/04 16:43 Daniel Daugherty Oracle (same) (same) JDK-8272175 ProblemList jdk/jfr/event/gc/detailed/TestEvacuationFailedEvent.java in JDK17
2021/08/04 10:28 Erik Österlund Oracle (same) (same) JDK-8272174 ZGC several jvm08 perf regressions after JDK-8268372
2021/08/03 06:57 Richard Reingruber SAP (same) (same) JDK-8271720 C2: Avoid redundant uncommon traps in GraphKit::builtin_throw() for JVMTI exception events
2021/08/02 21:05 Vladimir Kozlov Oracle (same) (same) JDK-8271697 C2: assert(n != __null) failed: Bad immediate dominator info.
2021/08/02 20:44 Igor Ignatyev Oracle (same) (same) JDK-8272171 [TESTBUG] Rename Whitebox API package
2021/08/02 18:42 Saravana Vijayasekaran Oracle (same) (same) JDK-8271681 Remove EA from JDK 17 version string starting with Initial RC promotion on Aug 5, 2021(B34)
2021/07/30 07:28 Roland Westrelin Red Hat (same) (same) JDK-8271680 C2: assert(!had_error) failed: bad dominance
2021/07/30 01:01 Chris Plummer Oracle (same) (same) JDK-8271679 ProblemList serviceability/sa/sadebugd/DebugdConnectTest.java due to 8270326
2021/07/30 00:56 Chris Plummer Oracle (same) (same) JDK-8271678 ProblemList SA tests that are failing with ZGC due to JDK-8248912
2021/07/29 20:22 Roger Riggs Oracle (same) (same) JDK-8271677 (doc) Clarify Filter Factory example
2021/07/29 00:50 Rajan Halade Oracle (same) (same) JDK-8271435 Remove IdenTrust certificate that is expiring in September 2021
2021/07/28 23:12 Igor Ignatyev Oracle (same) (same) JDK-8271676 mark hotspot runtime/memory tests which ignore external VM flags
2021/07/28 23:11 Igor Ignatyev Oracle (same) (same) JDK-8271675 mark hotspot runtime/os tests which ignore external VM flags
2021/07/28 18:52 Daniel Daugherty Oracle (same) (same) JDK-8271673 ProblemList 2 locale tests on macOS-x64
2021/07/28 18:52 Daniel Daugherty Oracle (same) (same) JDK-8271672 ProblemList javax/sound/midi/Sequencer/Looping.java
2021/07/28 16:59 Patricio Chilano Mateo Oracle (same) (same) JDK-8271671 JavaThread::java_suspend() fails with "fatal error: Illegal threadstate encountered: 6"
2021/07/28 15:38 Igor Ignatyev Oracle (same) (same) JDK-8271670 runtime/ClassFile/UnsupportedClassFileVersion.java can be run in driver mode
2021/07/28 15:31 Kim Barrett Oracle (same) (same) JDK-8271669 Extend jcc erratum mitigation to additional processors
2021/07/28 14:49 Christoph Göttschkes Microdoc (same) (same) JDK-8271668 TestParallelRefProc fails on single core machines
2021/07/28 14:42 Saravana Vijayasekaran Oracle N/A Unknown JDK-8275532 Updating RE Configs for BUILD REQUEST 17.0.1+4
2021/07/27 23:20 Igor Ignatyev Oracle (same) (same) JDK-8271666 runtime/Safepoint tests use OutputAnalyzer::shouldMatch instead of shouldContaint
2021/07/27 19:28 Hannes Wallnoefer Oracle (same) (same) JDK-8271665 NPE in DocTreePath.getTreePath()
2021/07/27 17:14 Markus Grönlund Oracle (same) (same) JDK-8271664 SEGV at read_string_field(oopDesc*, char const*, JavaThread*)+0x54
2021/07/27 02:59 Igor Ignatyev Oracle (same) (same) JDK-8271663 two runtime/ClassFile tests don't check exit code
2021/07/26 18:04 Jim Laskey Oracle (same) (same) JDK-8271662 UnicodeReader not translating \u005c\\u005d to \\]
2021/07/26 17:19 Igor Ignatyev Oracle (same) (same) JDK-8271661 runtime/jni/FindClassUtf8/FindClassUtf8.java doesn't have to be run in othervm
2021/07/26 17:18 Igor Ignatyev Oracle (same) (same) JDK-8271660 two runtime/Monitor tests don't check exit code
2021/07/24 08:14 Alexander Zvegintsev Oracle (same) (same) JDK-8271659 java/awt/Focus/DeiconifiedFrameLoosesFocus/DeiconifiedFrameLoosesFocus.java sometimes failed on Ubuntu
2021/07/23 17:36 Alexander Zuev Oracle (same) (same) JDK-8271658 [macos] JTabbedPane title looks like disabled
2021/07/23 15:53 Igor Ignatyev Oracle (same) (same) JDK-8271657 serviceability/jvmti/GetObjectSizeClass.java doesn't check exit code
2021/07/23 15:32 Igor Ignatyev Oracle (same) (same) JDK-8271655 runtime/handshake/HandshakeTimeoutTest.java can be run in driver mode
2021/07/22 23:54 Igor Ignatyev Oracle (same) (same) JDK-8271654 runtime/StackTrace/LargeClassTest.java can be run in driver mode
2021/07/22 23:53 Igor Ignatyev Oracle (same) (same) JDK-8271653 runtime/handshake/HandshakeTimeoutTest.java test doesn't check exit code
2021/07/22 23:21 Igor Ignatyev Oracle (same) (same) JDK-8271652 runtime/Safepoint/TestAbortVMOnSafepointTimeout.java can be run in driver mode
2021/07/22 22:15 Igor Ignatyev Oracle (same) (same) JDK-8271651 runtime/jni/checked/TestCheckedJniExceptionCheck.java doesn't set -Djava.library.path
2021/07/22 22:14 Alexey Semenyuk Oracle (same) (same) JDK-8271650 Wrong path separator in env variable
2021/07/22 19:50 Joe Darcy Oracle (same) (same) JDK-8271648 Update java.lang.annotation.Target for changes in JLS 9.6.4.1
2021/07/22 17:14 Igor Ignatyev Oracle (same) (same) JDK-8271646 runtime/duplAttributes/DuplAttributesTest.java doesn't check exit code
2021/07/22 17:13 Igor Ignatyev Oracle (same) (same) JDK-8271645 remove deadcode from runtime/Thread/TestThreadDumpSMRInfo.java test
2021/07/22 14:30 Patricio Chilano Mateo Oracle (same) (same) JDK-8271643 Suspend during block transition may deadlock if lock held
2021/07/22 14:04 Daniel Daugherty Oracle (same) (same) JDK-8271640 ProblemList runtime/InvocationTests/invokevirtualTests.java
2021/07/22 05:59 Tobias Hartmann Oracle (same) (same) JDK-8271638 ZGC: Invalid oop passed to ZBarrierSetRuntime::load_barrier_on_oop_array
2021/07/21 19:47 Igor Ignatyev Oracle (same) (same) JDK-8271636 a few runtime/memory tests don't check exit code
2021/07/21 16:29 Alexander Zvegintsev Oracle (same) (same) JDK-8271635 [TEST_BUG] Failure on solaris of java/awt/Window/MultiWindowApp/MultiWindowAppTest.java
2021/07/21 16:13 Daniel Daugherty Oracle (same) (same) JDK-8271633 ProblemList 3 client tests on Linux-X64
2021/07/21 00:17 Jesper Wilhelmsson Oracle (same) (same) JDK-8271632 Missing forward declaration of ZeroFrame
2021/07/20 21:55 Daniel Daugherty Oracle (same) (same) JDK-8271631 Problemlist vmTestbase/nsk/jdi/HiddenClass/events/events001.java
2021/07/20 13:10 Jorn Vernee Oracle (same) (same) JDK-8271630 java/foreign/stackwalk/TestAsyncStackWalk.java test failed with concurrent GC
2021/07/20 06:10 Yi Yang Alibaba (same) (same) JDK-8271629 C2: assert(false) failed: bad AD file after JDK-8267687

No changesets log

JDK-8285650 Release Note: Zip File System Provider Throws ZipException When Entry Name Element Contains "." or ".."
JDK-8279792 Release Note: Update Timezone Data to 2021c
JDK-8278641 Release Note: ZGC: Fixed Long Process Non-Strong References Times
JDK-8277157 Release Note: Vector Should Throw ClassNotFoundException for a Missing Class of an Element
JDK-8275378 Release Note: file.encoding System Property Has an Incorrect Value on Windows
JDK-8274220 Release Note: Removed Google's GlobalSign Root Certificate
JDK-8273866 JDK-8270110 committed invalid copyright headers
JDK-8273064 compiler/jvmci/compilerToVM/IsMatureTest.java fails with Unexpected isMature state for multiple times invoked method: expected false to equal true
JDK-8271856 IndexOutOfBoundsException while reading large TIFF file
JDK-8271700 Add option to jcmd GC.heap_dump to use existing file
JDK-8271699 stack-use-after-scope in NewObjectA
JDK-8271689 jarsigner doc is not precise when describing jar file re-signing
JDK-8271688 JFR: Docs for -XX:StartFlightRecording is incorrect

Committer push log

Artem.Semenov, JetBrains

Bug Summary
JDK-8274557 missing CAccessibility definitions in JNI code

Ilarion Nakonechnyy, Azul

Bug Summary
JDK-8275877 Fix data races in G1PeriodicGCTask
JDK-8275393 Fix the implementation of loop unrolling heuristic with LoopPercentProfileLimit
JDK-8275878 runtime/cds/appcds/MoveJDKTest.java doesn't check exit codes
JDK-8275880 several hotspot runtime/modules don't check exit codes
JDK-8276860 Slow LoginContext.login() on multi threading application
JDK-8275879 Undeleted debug information

Alexey Bakhtin, Azul

Bug Summary
JDK-8275701 Handle KDC_ERR_SVC_UNAVAILABLE error code from KDC
JDK-8275700 X509CertImpl.getFingerprint should not return the empty String

Adam Farley, Red Hat

Bug Summary
JDK-8277629 tools/launcher/HelpFlagsTest.java Fails on Windows 32bit

Alex Kasko, Red Hat

Bug Summary
JDK-8277640 (fc) Data transfer from FileChannel to itself causes hang in case of overlap
JDK-8277478 (fc) FileChannel.transferTo() transfers no more than Integer.MAX_VALUE bytes in one call
JDK-8277477 (fs) UnixFileSystemProvider should use StaticProperty.userDir().
JDK-8276718 [macos11] SystemIconTest fails with ClassCastException
JDK-8276936 Call new Win32 API SetThreadDescription in os::set_native_thread_name
JDK-8277938 Fix java/nio/file/FileStore/Basic.java test by ignoring /run/user/* mount points
JDK-8277063 Fix jaxp/javax/xml/jaxp/unittest/transform/SurrogateTest.java test
JDK-8276715 Fix the infinite loop in next_line
JDK-8277205 java/io/File/GetXSpace.java failed with "RuntimeException: java.nio.file.NoSuchFileException: /run/user/0"
JDK-8277719 java/nio/channels/FileChannel/Transfer2GPlus.java failed with Unexpected transfer size: 2147418112
JDK-8276861 javax/swing/JComponent/7154030/bug7154030.java fails with "Exception: Failed to hide opaque button"
JDK-8276716 javax/swing/JFileChooser/FileSystemView/SystemIconTest.java fails on windows
JDK-8276725 macos doesn't check `os::set_boot_path()` result
JDK-8276717 Nimbus JTree default tree cell renderer does not use selected text color
JDK-8276710 NTLM authentication fails if HEAD request is used
JDK-8277639 ProblemList java/nio/channels/FileChannel/Transfer2GPlus.java on linux-aarch64
JDK-8277206 Redo: Nimbus JTree renderer properties persist across L&F changes
JDK-8276714 Remove dependancy of TestHttpsServer, HttpTransaction, HttpCallback from open/test/jdk/sun/net/www/protocol/https/ tests
JDK-8276722 Remove native pre-jdk9 support for jtreg failure handler
JDK-8277154 Reusing HttpClient in a WebSocket.Listener hangs.
JDK-8277152 SctpMultiChannel never releases own file descriptor
JDK-8276720 SwingSet2 JTable Demo throws NullPointerException
JDK-8276858 UnProblemList javax/swing/JComponent/7154030/bug7154030.java in JDK18
JDK-8276723 Unused _last_state in osThread_windows
JDK-8276712 Useless initialization in com/sun/crypto/provider/PBES2Parameters.java
JDK-8277064 Windows: link error: unresolved external symbol "int __cdecl convert_to_unicode(char const *,wchar_t * *)"
JDK-8276719 XML Transformer outputs Unicode supplementary character incorrectly to HTML

Abdul Kolarkunnu, Oracle

Bug Summary
JDK-8273006 Automate manual steps listed in the test jdk/sun/security/pkcs12/ParamsTest.java
JDK-8273007 sun/security/pkcs11/Provider/MultipleLogins.sh fails after JDK-8266182

Andrew Hughes, Red Hat

Bug Summary
JDK-8276909 Fake libsyslookup.so library causes tooling issues
JDK-8276967 Sync J2DBench run and analyze Makefile targets with build.xml

Anton Tarasov, JetBrains

Bug Summary
JDK-8277716 [TableRowAccessibility accessibilityChildren] method is ineffective
JDK-8277858 CommonComponentAccessibility.createWithParent isWrapped causes mem leak
JDK-8277717 crash in [CommonComponentAccessibility getCAccessible:withEnv:]

Qi Ao, Loongson

Bug Summary
JDK-8275108 Add Zero support for LoongArch
JDK-8276131 IR framework does not handle client VM builds correctly
JDK-8276133 some testlibrary_tests/ir_framework tests fail when c1 disabled
JDK-8277208 tools/jpackage tests do not work on apt-based Linux distros like Debian

Alexey Pavlyutkin, Azul

Bug Summary
JDK-8275965 (zipfs): Accessing a large entry (> 2^31 bytes) leads to a negative initial size for ByteArrayOutputStream
JDK-8276855 AArch64: size_fits_all_mem_uses should return false if its output is a CAS

Andrew Haley, Red Hat

Bug Summary
JDK-8277384 AArch64: AES Galois CounterMode (GCM) interleaved implementation using vector instructions

Artem Semenov, Independent

Bug Summary
JDK-8277443 accessibility of a table on macOS lacks cell navigation
JDK-8277191 Create implementation for NSAccessibilityCell protocol peer
JDK-8277189 Create implementation for NSAccessibilityColumn protocol peer
JDK-8277184 Create implementation for NSAccessibilityComboBox protocol peer
JDK-8277186 Create implementation for NSAccessibilityList protocol peer
JDK-8277183 Create implementation for NSAccessibilityNavigableStaticText protocol
JDK-8277187 Create implementation for NSAccessibilityOutline protocol
JDK-8277190 Create implementation for NSAccessibilityRow protocol peer
JDK-8277185 Create implementation for NSAccessibilityTabGroup protocol peer
JDK-8277188 Create implementation for NSAccessibilityTable protocol
JDK-8277182 Create NSAccessibilityElement implementation for JavaComponentAccessibility
JDK-8277464 JNI call of getAccessibleSelection on a wrong thread
JDK-8277195 missing CAccessibility definition in [CommonComponentAccessibility accessibilityHitTest]
JDK-8277737 TableAccessibility and TableRowAccessibility miss autorelease

Alexey Semenyuk, Oracle

Bug Summary
JDK-8271650 Wrong path separator in env variable

Alexander Zvegintsev, Oracle

Bug Summary
JDK-8271635 [TEST_BUG] Failure on solaris of java/awt/Window/MultiWindowApp/MultiWindowAppTest.java
JDK-8271659 java/awt/Focus/DeiconifiedFrameLoosesFocus/DeiconifiedFrameLoosesFocus.java sometimes failed on Ubuntu

Peng Xie, Tencent

Bug Summary
JDK-8275129 Build failure on macOS with Xcode 13.0 as vfork is deprecated

Christoph Göttschkes, Microdoc

Bug Summary
JDK-8271668 TestParallelRefProc fails on single core machines

Chris Hegarty, Independent

Bug Summary
JDK-8273530 Parsing epoch seconds at a DST transition with a non-UTC parser is wrong

Chris Plummer, Oracle

Bug Summary
JDK-8271678 ProblemList SA tests that are failing with ZGC due to JDK-8248912
JDK-8271679 ProblemList serviceability/sa/sadebugd/DebugdConnectTest.java due to 8270326

Christoph Langer, SAP

Bug Summary
JDK-8273767 [macos] Focus not painted in JButton when setBorderPainted(false) is invoked
JDK-8273105 [Test]: java/net/httpclient/DigestEchoClientSSL.java contains redundant @run tags
JDK-8271900 AARCH64: typo in LIR_Assembler::emit_profile_type
JDK-8276130 Fix Github Actions of JDK17u to account for update version scheme
JDK-8272883 Kerberos Credential Retrieval from Cache not Working in Cross-Realm Setup
JDK-8274377 Most JDK releases report macOS version 12 as 10.16 instead of 12.0
JDK-8274897 Update OS detection code to recognize Windows Server 2022

Sean Coffey, Oracle

Bug Summary
JDK-8274958 Correct Manifest file name and NPE checks
JDK-8275814 Incorrect instance to dispose
JDK-8277694 Javadoc external links should only have feature version number in URL
JDK-8272845 Session resumption errors
JDK-8277490 sun.security.pkcs.PKCS9Attributes.toString() throws NPE

Clive Verghese, Amazon

Bug Summary
JDK-8273567 Large Allocation in CipherSuite

Joe Darcy, Oracle

Bug Summary
JDK-8274015 Bug in parallel Kahan summation implementation
JDK-8274017 java/util/DoubleStreamSums/CompensatedSums.java failure
JDK-8272789 java/util/Random/RandomTestMoments.java had two Gaussian fails
JDK-8272605 Repeatable annotations without @Target cannot have containers that target module declarations
JDK-8271648 Update java.lang.annotation.Target for changes in JLS 9.6.4.1

Daniel Daugherty, Oracle

Bug Summary
JDK-8271673 ProblemList 2 locale tests on macOS-x64
JDK-8271633 ProblemList 3 client tests on Linux-X64
JDK-8271672 ProblemList javax/sound/midi/Sequencer/Looping.java
JDK-8272176 ProblemList javax/swing/JComponent/7154030/bug7154030.java in JDK17
JDK-8272175 ProblemList jdk/jfr/event/gc/detailed/TestEvacuationFailedEvent.java in JDK17
JDK-8271640 ProblemList runtime/InvocationTests/invokevirtualTests.java
JDK-8272177 ProblemList serviceability/sa/TestJmapCore.java on linux-x64 with ZGC
JDK-8271631 Problemlist vmTestbase/nsk/jdi/HiddenClass/events/events001.java

David Holmes, Oracle

Bug Summary
JDK-8274756 ForkJoinPool.commonPool() does not work with 1 CPU
JDK-8273003 RunThese24H.java failed with EXCEPTION_ACCESS_VIOLATION in java_lang_Thread::get_thread_status
JDK-8272871 StackGuardPages test doesn't build with glibc 2.34

eastig, Amazon

Bug Summary
JDK-8272109 Improve AlgorithmConstraints:checkAlgorithm performance

Erik Österlund, Oracle

Bug Summary
JDK-8272174 ZGC several jvm08 perf regressions after JDK-8268372

Erik Joelsson, Oracle

Bug Summary
JDK-8276122 Change openjdk project in jcheck to jdk-updates

Ekaterina Vergizova, Azul

Bug Summary
JDK-8274905 duplicate checkcast when destination type is not first type of intersection type
JDK-8274697 EXCEPTION_ACCESS_VIOLATION in BFSClosure::closure_impl
JDK-8275401 extended 'for' with expression of type tvar causes the compiler to crash
JDK-8274906 Javac throws when compiling switch (null)
JDK-8274904 NPE in Flow$FlowAnalyzer.visitApply: Cannot invoke getThrownTypes because tree.meth.type is null
JDK-8275402 Passing a *nested* switch expression as a parameter causes an NPE during compile
JDK-8276233 unexpected compiler error: cast, intersection types and sealed

Evan Whelan, Oracle

Bug Summary
JDK-8277779 Cookie stored in CookieHandler not sent if user headers contain cookie
JDK-8275922 HttpURLConnection: HttpClient and HttpsClient incorrectly check request method when set to POST
JDK-8278295 sun/net/www/http/KeepAliveStream/KeepAliveStreamCloseWithWrongContentLength.java wedged in getInputStream

Fairoz Matte, Oracle

Bug Summary
JDK-8278340 SIGSEGV in C2 CompilerThread Node::rematerialize() compiling Packet::readUnsignedTrint

Guoxiong Li, Independent

Bug Summary
JDK-8277618 AssertionError at jdk.compiler/com.sun.tools.javac.util.Assert.error(Assert.java:155)
JDK-8274439 forged ASTs can provoke an AIOOBE at com.sun.tools.javac.jvm.ClassWriter::writePosition
JDK-8274476 java.lang.AssertionError: typeSig ERROR on generated class property of record
JDK-8274477 javac generates unreachable code when using empty semicolon statement
JDK-8274478 Some duplicated javac command-line options have repeated effect

Goetz Lindenmaier, SAP

Bug Summary
JDK-8275188 [TEST_BUG] javax/swing/plaf/basic/BasicHTML/4251579/bug4251579.java failure due to timing
JDK-8275189 The test test/langtools/tools/javac/versions/Versions.java has duplicate test cycles

Hannes Wallnoefer, Oracle

Bug Summary
JDK-8271665 NPE in DocTreePath.getTreePath()

Andy Herrick, Oracle

Bug Summary
JDK-8273593 [REDO] Warn user when using mac-sign option with unsigned app-image.
JDK-8274443 Add unit test for what jpackage app launcher puts in the environment
JDK-8273604 Backout JDK-8271868
JDK-8274441 java.library.path is not set properly by Windows jpackage app launcher
JDK-8273241 jpackaged applications using microphone on mac
JDK-8273282 Warn user when using mac-sign option with unsigned app-image.
JDK-8274290 Windows DLL path not set correctly.

Harold Seigel, Oracle

Bug Summary
JDK-8272663 Cgroup v1 initialization causes NullPointerException when cgroup path contains colon
JDK-8274842 Null pointer dereference in classFileParser.cpp:2817
JDK-8275285 runtime/cds/appcds/loaderConstraints/DynamicLoaderConstraintsTest.java#default-cl crashed with SIGSEGV in MetaspaceShared::link_shared_classes
JDK-8275284 Update OS detection code to recognize Windows 11

Igor Ignatyev, Oracle

Bug Summary
JDK-8272171 [TESTBUG] Rename Whitebox API package
JDK-8271636 a few runtime/memory tests don't check exit code
JDK-8271676 mark hotspot runtime/memory tests which ignore external VM flags
JDK-8271675 mark hotspot runtime/os tests which ignore external VM flags
JDK-8271645 remove deadcode from runtime/Thread/TestThreadDumpSMRInfo.java test
JDK-8271670 runtime/ClassFile/UnsupportedClassFileVersion.java can be run in driver mode
JDK-8271646 runtime/duplAttributes/DuplAttributesTest.java doesn't check exit code
JDK-8271655 runtime/handshake/HandshakeTimeoutTest.java can be run in driver mode
JDK-8271653 runtime/handshake/HandshakeTimeoutTest.java test doesn't check exit code
JDK-8271651 runtime/jni/checked/TestCheckedJniExceptionCheck.java doesn't set -Djava.library.path
JDK-8271661 runtime/jni/FindClassUtf8/FindClassUtf8.java doesn't have to be run in othervm
JDK-8271666 runtime/Safepoint tests use OutputAnalyzer::shouldMatch instead of shouldContaint
JDK-8271652 runtime/Safepoint/TestAbortVMOnSafepointTimeout.java can be run in driver mode
JDK-8271654 runtime/StackTrace/LargeClassTest.java can be run in driver mode
JDK-8271657 serviceability/jvmti/GetObjectSizeClass.java doesn't check exit code
JDK-8271663 two runtime/ClassFile tests don't check exit code
JDK-8271660 two runtime/Monitor tests don't check exit code

Jonathan Dowland, Red Hat

Bug Summary
JDK-8274021 [TEST_BUG] java/awt/print/PrinterJob/PageDialogMarginTest.java catches all exceptions

Jayathirth D V, Oracle

Bug Summary
JDK-8277480 Use appropriate macosx_version_minimum value while compiling metal shaders

Jie Fu, Tencent

Bug Summary
JDK-8272891 [macos] Build failure with Xcode 13.0 after JDK-8264848
JDK-8274996 C4819 warning at vm_version_x86.cpp on Windows after JDK-8234160
JDK-8274997 Fix non-portable HotSpot code in MethodMatcher::parse_method_pattern
JDK-8275088 gtest build failure due to stringop-overflow warning with gcc11
JDK-8276675 Reset LoopPercentProfileLimit for x86 due to suboptimal performance
JDK-8277632 TestJpsHostName.java not reliable, better to expand HostIdentifierCreate.java test

Jonathan Gibbons, Oracle

Bug Summary
JDK-8272179 Final nroff manpage update for JDK 17

Jim Laskey, Oracle

Bug Summary
JDK-8271662 UnicodeReader not translating \u005c\\u005d to \\]

jovan.stevanovic1, Independent

Bug Summary
JDK-8274535 Support XSLT on GraalVM Native Image--deterministic bytecode generation in XSLT

Jorn Vernee, Oracle

Bug Summary
JDK-8271630 java/foreign/stackwalk/TestAsyncStackWalk.java test failed with concurrent GC

Jesper Wilhelmsson, Oracle

Bug Summary
JDK-8271632 Missing forward declaration of ZeroFrame

Kim Barrett, Oracle

Bug Summary
JDK-8271669 Extend jcc erratum mitigation to additional processors

Alexander Zuev, Oracle

Bug Summary
JDK-8277751 [macos] A11y cursor gets stuck when combobox is closed
JDK-8271658 [macos] JTabbedPane title looks like disabled
JDK-8277660 Create implementation for NSAccessibilityMenu protocol peer
JDK-8277663 Create implementation for NSAccessibilityMenuBar protocol peer
JDK-8277662 Create implementation for NSAccessibilityMenuItem protocol peer
JDK-8277661 Create implementation for NSAccessibilityPopUpButton protocol peer
JDK-8277750 Create implementation for NSAccessibilityProgressIndicator protocol peer

Vladimir Kozlov, Oracle

Bug Summary
JDK-8271697 C2: assert(n != __null) failed: Bad immediate dominator info.
JDK-8272399 Fatal error with variable shift count integer rotate operation.

Lucy Schmidt, SAP

Bug Summary
JDK-8273637 [ppc] [s390]: Crash in JavaThread::pd_get_top_frame_for_profiling

Mat Carter, Microsoft

Bug Summary
JDK-8267256 Extend minimal retry for loopback connections on Windows to PlainSocketImpl

Matthias Baesken, SAP

Bug Summary
JDK-8275649 Cleanup AddFontsToX11FontPath
JDK-8275105 handle latest VS2019 in abstract_vm_version
JDK-8273524 linux x86_64 check for binutils 2.25 or higher after 8265783
JDK-8275026 package help is not displayed for missing X11/extensions/Xrandr.h
JDK-8277933 Suspicious string concatenation in logTestUtils.inline.hpp

Mandy Chung, Oracle

Bug Summary
JDK-8276261 LambdaMetaFactory::metafactory on REF_invokeSpecial impl method has incorrect behavior
JDK-8276035 System.loadLibrary fails on Big Sur for libraries hidden from filesystem

Martin Doerr, SAP

Bug Summary
JDK-8277637 [ppc64] Port shenandoahgc to linux on ppc64le
JDK-8275516 [ppc64] Port zgc to linux on ppc64le
JDK-8275397 [PPC64] resolve_jobject needs a generic implementation to support load barriers
JDK-8275394 [TESTBUG] UnsafeIntrinsicsTest intermittently fails on weak memory model platform
JDK-8275396 [TESTBUG] Wrong weakCompareAndSet assumption in UnsafeIntrinsicsTest
JDK-8275399 [ZGC] missing null check in ZNMethod::log_register
JDK-8277332 C2: assert(n->outcnt() != 0 || C->top() == n || n->is_Proj()) failed: No dead instructions after post-alloc
JDK-8275398 C2: GraphKit::load_array_element bypasses Access API
JDK-8275395 c2i entry barriers read int as long on PPC
JDK-8274959 jdk/jshell/CommandCompletionTest.java fails with NoSuchElementException after JDK-8271287

Markus Grönlund, Oracle

Bug Summary
JDK-8272178 JFR Recorder Thread crashed with SIGSEGV in write_klass
JDK-8271664 SEGV at read_string_field(oopDesc*, char const*, JavaThread*)+0x54

Naoto Sato, Oracle

Bug Summary
JDK-8275379 file.encoding system property has an incorrect value on Windows

Olga Mikhaltcova, Azul

Bug Summary
JDK-8276134 memory leak in appendBootClassPath(), paths must be deallocated
JDK-8274375 Remove redundant 'new String' calls after concatenation in java.desktop
JDK-8274376 Remove unreachable return in mutexLocker::wait

pavel.kharskii, Oracle

Bug Summary
JDK-8275141 recover corrupted line endings for the version-numbers.conf

Patricio Chilano Mateo, Oracle

Bug Summary
JDK-8271671 JavaThread::java_suspend() fails with "fatal error: Illegal threadstate encountered: 6"
JDK-8271643 Suspend during block transition may deadlock if lock held

Prajwal Kumaraswamy, Oracle

Bug Summary
JDK-8277633 Concurrent read/close of SSLSockets causes SSLSessions to be invalidated unnecessarily

Per Liden, Independent

Bug Summary
JDK-8273537 ZGC: stack overflow (segv) when -Xlog:gc+start=debug

Philip Race, Oracle

Bug Summary
JDK-8273002 [macOS] "Apple AWT Internal Exception" when input method is changed
JDK-8274604 [macos] Ensure initialisation of sun/lwawt/macosx/CAccessibility in JavaComponentAccessibility.m
JDK-8272794 [macOS] not all KEY_PRESSED events sent when control modifier is used
JDK-8275365 Exceptions after a touchpad gesture on macOS
JDK-8274382 JavaAccessibilityUtilities leaks JNI objects
JDK-8273755 macOS Monterey does not have the font Times needed by Serif

Rajat Mahajan, Oracle

Bug Summary
JDK-8274389 Expand ButtonGroupLayoutTraversalTest.java to run in all LaFs, including Aqua on macOS

Claes Redestad, Oracle

Bug Summary
JDK-8277642 Implement fast-path for ASCII-compatible CharsetEncoders on x86
JDK-8277809 Use encodeASCII for ASCII-compatible DoubleByte encodings

Robbin Ehn, Rivos

Bug Summary
JDK-8274896 Safepoint deadlock on VMOperation_lock

Rajan Halade, Oracle

Bug Summary
JDK-8274215 Remove globalsignr2ca root from 17.0.2
JDK-8272665 Remove Google certificate that is expiring in December 2021
JDK-8271435 Remove IdenTrust certificate that is expiring in September 2021
JDK-8273150 Revert "8225083: Remove Google certificate that is expiring in December 2021"

Roland Westrelin, Red Hat

Bug Summary
JDK-8271680 C2: assert(!had_error) failed: bad dominance

Ravi Reddy, Oracle

Bug Summary
JDK-8274695 (zipfs) Files.walkFileTree walks infinitely if zip has dir named "." inside

Richard Reingruber, SAP

Bug Summary
JDK-8273813 [TESTBUG] gc/g1/TestMixedGCLiveThreshold.java can fail if G1 Full GC uses >1 workers
JDK-8271720 C2: Avoid redundant uncommon traps in GraphKit::builtin_throw() for JVMTI exception events
JDK-8277859 JDWP Spec: the description for the Dispose command confuses suspend with resume.

Roger Riggs, Oracle

Bug Summary
JDK-8271677 (doc) Clarify Filter Factory example
JDK-8277093 Vector should throw ClassNotFoundException for a missing class of an element

Ramkumar Sunderbabu, Oracle

Bug Summary
JDK-8277739 [TESTBUG] serviceability/sa/ClhsdbCDSCore.java fails with -XX:TieredStopAtLevel=1

Sergey Bylokhov, Amazon

Bug Summary
JDK-8274608 [macos] java/awt/color/ICC_ColorSpace/MTTransformReplacedProfile.java timed out
JDK-8274463 Crash when during color transformation the color profile is replaced
JDK-8274526 java/awt/color/ICC_ColorSpace/MTTransformReplacedProfile.java crashes in liblcms.dylib with NULLSeek+0x7
JDK-8274409 javax/swing/JTable/4235420/bug4235420.java fails in GTK L&F

Severin Gehwolf, Red Hat

Bug Summary
JDK-8274607 (zipfs) Files.getFileAttributeView() throws UOE instead of returning null when view not supported
JDK-8272518 --with-harfbuzz=system doesn't add -lharfbuzz after JDK-8255790
JDK-8271955 OperatingSystemMXBean getProcessCpuLoad reports incorrect process cpu usage in containers

Aleksey Shipilev, Amazon

Bug Summary
JDK-8273504 (bf) Replace StringBuffer in *Buffer.toString()
JDK-8277471 (fs) java/nio/file/spi/SetDefaultProvider.java fails on x86_32
JDK-8276933 AArch64: Support for weaker memory ordering in Atomic
JDK-8274724 Add tier4 test groups
JDK-8274012 C2 intrinsic for Reference.refersTo() is often not used
JDK-8277104 C2: assert(false) failed: bad AD file after JDK-8252372 with UseSSE={0,1}
JDK-8277176 C2: Compiler stack overflow during escape analysis on Linux x86_32
JDK-8277197 C2: Conv(D|F)2(I|L)Nodes::Ideal should handle rounding correctly
JDK-8274706 compiler/blackhole tests should not run with interpreter-only VMs
JDK-8274708 compiler/cpuflags/TestSSE4Disabled.java should test for CPU feature explicitly
JDK-8274709 ConcurrentModificationException raised every time ReferralsCache drops referral
JDK-8274693 Create hotspot:tier2 and hotspot:tier3 test groups
JDK-8274877 DoubleFlagWithIntegerValue uses G1GC-only flag
JDK-8274010 Drop zapping values in the Zap* option descriptions
JDK-8273533 Epsilon: Refactor tests to improve performance
JDK-8274014 Improve performance of HeapDumpAllTest
JDK-8273556 Incorrect compile command used by TestIllegalArrayCopyBeforeInfiniteLoop
JDK-8274691 InfoOptsTest is failing in tier1
JDK-8277470 java/awt/print/PrinterJob/CheckPrivilege.java fails due to disabled SecurityManager
JDK-8276882 java/lang/management/ManagementFactory/MXBeanException.java test fails with Shenandoah
JDK-8276883 java/lang/management/MemoryMXBean/MemoryTest.java test should handle Shenandoah
JDK-8277196 JDK-8273416 is incomplete for UseSSE=1
JDK-8277179 jdk/jfr/event/gc/detailed/TestGCLockerEvent.java fails when other GC is selected
JDK-8277469 jdk/jshell/CustomInputToolBuilder.java fails intermittently on storage acquisition
JDK-8277103 JFR: Add test for OldObjectSample event when using Shenandoah
JDK-8274710 Limit run time for java/lang/invoke/LFCaching tests
JDK-8274008 Move CriticalJNI tests out of tier1
JDK-8274772 Move some runtime/Metaspace/elastic/ tests out of tier1
JDK-8274711 Parallelize and increase timeouts for java/foreign/TestMatrix.java test
JDK-8274011 Parallelize runtime/InvocationTests/
JDK-8273706 pauth_aarch64.hpp include name is incorrect
JDK-8277526 PretouchTask num_chunks calculation can overflow
JDK-8277217 security/infra/java/security/cert/CertPathValidator/certification/ComodoCA.java fails due to revoked cert
JDK-8276884 serviceability/jvmti/GetObjectSizeClass.java shouldn't have vm.flagless
JDK-8273535 Shenandoah: Add test for JDK-8269661
JDK-8273534 Shenandoah: Cleanup TestStringDedup and TestStringDedupStress tests
JDK-8272822 Shenandoah: gc/shenandoah/mxbeans tests should be more resilient
JDK-8273501 Shenandoah: Introduce weak/strong marking asserts
JDK-8272824 Shenandoah: Optimize gc/shenandoah/TestRefprocSanity.java for interpreter mode
JDK-8272823 Shenandoah: Provide human-readable labels for test configurations
JDK-8277528 Shenandoah: Relax memory constraint for worker claiming tasks/ranges
JDK-8274623 Shenandoah: Remove the remaining uses of os::is_MP
JDK-8272942 Shenandoah: Resolve UNKNOWN access strength, where possible
JDK-8274712 Some containers/docker/TestJFREvents.java configs are running out of memory
JDK-8277473 split runtime/CommandLine/PrintTouchedMethods.java test
JDK-8274765 StressSeed should be set via FLAG_SET_ERGO
JDK-8278100 String Deduplication table is never cleaned up due to bad dead_factor_for_cleanup
JDK-8274009 Support stack watermarks in Zero VM
JDK-8277527 Update boot JDKs to 17.0.1 in GHA
JDK-8274013 Update JMH devkit to 1.32
JDK-8274725 Update testing docs to mention tiered testing
JDK-8276881 Use SHA256 hash in build.tools.depend.Depend
JDK-8277214 Windows GHA builds fail due to broken Cygwin
JDK-8277177 Windows-Aarch64 build is failing in GitHub actions
JDK-8274703 Zero should warn about unimplemented -XX:+LogTouchedMethods
JDK-8274700 Zero: Cannot invoke JVM in primordial threads on Zero
JDK-8274705 Zero: Clear pending JNI exception check in native method handler
JDK-8274704 Zero: Disable runtime/Unsafe/InternalErrorTest.java
JDK-8274760 Zero: Disable vtable/itableStub gtests
JDK-8274707 Zero: Drop incorrect test block from compiler/startup/NumCompilerThreadsCheck.java
JDK-8274759 Zero: Handle "zero" variant in runtime tests
JDK-8277199 Zero: Handle DiagnoseSyncOnValueBasedClasses VM option
JDK-8274876 Zero: Handle UseHeavyMonitors on all monitorenter paths
JDK-8277472 Zero: Reformat opclabels_data
JDK-8274702 Zero: SPARC64 build fails with si_band type mismatch

Volker Simonis, Amazon

Bug Summary
JDK-8273908 Memory leak in OopStorage due to bug in OopHandle::release()

Sergey Nazarkin, Azul

Bug Summary
JDK-8274292 C2: ClhsdbJstackXcompStress test fails when StressGCM is enabled
JDK-8277039 c2i entry barriers read int as long on AArch64

Stefan Karlsson, Oracle

Bug Summary
JDK-8277641 GC accidentally cleans valid megamorphic vtable inline caches

Thomas Stuefe, Red Hat

Bug Summary
JDK-8274866 gtest/MetaspaceGtests executes unnecessary tests in debug builds
JDK-8273601 jcmd to trim the glibc heap
JDK-8277476 JMM GetDiagnosticXXXInfo APIs should verify output array sizes

Saravana Vijayasekaran, Oracle

Bug Summary
JDK-8273565 Reenable German localization for builds at Oracle
JDK-8271681 Remove EA from JDK 17 version string starting with Initial RC promotion on Aug 5, 2021(B34)
JDK-8275532 Updating RE Configs for BUILD REQUEST 17.0.1+4

Sandhya Viswanathan, Intel

Bug Summary
JDK-8276910 Fix the copyright header of SVML files
JDK-8276980 Hotspot's libsvml.so may conflict with user dependency

Tobias Hartmann, Oracle

Bug Summary
JDK-8272647 [IR Framework] Some default regexes matching on PrintOptoAssembly in IRNode.java do not work on all platforms
JDK-8274489 assert(IncrementalInline || (_late_inlines.length() == 0 && !has_mh_late_inlines()))
JDK-8275092 C2: assert(false) failed: Bad graph detected in build_loop_late
JDK-8272650 C2: assert(iff->Opcode() == Op_If || iff->Opcode() == Op_CountedLoopEnd || iff->Opcode() == Op_RangeCheck) failed: Check this code when new subtype is added
JDK-8272645 C2: assert(no_dead_loop) failed: dead loop detected
JDK-8274487 C2: CheckCastPP which should closely follow Allocate is sunk of a loop
JDK-8275094 C2: condition incorrectly made redundant with dominating main loop exit condition
JDK-8274480 C2: crash in PhaseCFG::global_code_motion
JDK-8274488 C2: Missing interference with mismatched unsafe accesses
JDK-8275093 C2: Missing NegativeArraySizeException when creating StringBuilder with negative capacity
JDK-8272649 C2: Wrong JVM state used for receiver null check
JDK-8274492 CI: ciInstanceKlass::get_canonical_holder() doesn't respect instance size
JDK-8274514 compiler/c2/Test7179138_1.java timed out
JDK-8274486 Crash in PhaseIdealLoop::verify_strip_mined_scheduling
JDK-8274485 Crash PhaseIdealLoop::clone_outer_loop
JDK-8274481 GraphKit::combine_exception_states fails with "matching stack sizes" assert
JDK-8277173 Inconsistent scalar replacement debug info at safepoints
JDK-8274484 Incorrect num of element count calculation for vector cast
JDK-8274493 Opcode() != Op_If && Opcode() != Op_RangeCheck) || outcnt() == 2 assert failure with Test7179138_1.java
JDK-8272657 PhaseMacroExpand::generate_slow_arraycopy crash when clone null CallProjections.fallthrough_ioproj
JDK-8275043 RunThese30M.java failed "assert(!LCA_orig->dominates(pred_block) || early->dominates(pred_block)) failed: early is high enough"
JDK-8275029 SIGFPE with C2 compiled code with -XX:+StressGCM
JDK-8272646 ZGC: Arraycopy stub passes invalid oop to load barrier
JDK-8271638 ZGC: Invalid oop passed to ZBarrierSetRuntime::load_barrier_on_oop_array
JDK-8272644 ZGC: ZBarrierSetC2::clone_at_expansion fails with "Guard against surprises" assert

Thomas Schatzl, Oracle

Bug Summary
JDK-8277487 Missing memory barrier when checking active state for regions

Thejasvi Voniadka, Independent

Bug Summary
JDK-8272825 [Test]: Cleanup: test/jdk/security/infra/java/security/cert/CertPathValidator/certification/BuypassCA.java no longer needs ocspEnabled
JDK-8274184 Add openssl from path variable also in to Default System Openssl Path in OpensslArtifactFetcher
JDK-8276132 java/nio/file/WatchService/LotsOfEvents.java fails intermittently
JDK-8274641 jdk/jshell/CommandCompletionTest.java fails with "lists don't have the same size expected"
JDK-8274474 jdk/nio/zipfs/ZipFSTester.java fails if file path contains '+' character
JDK-8272689 jtreg test security/infra/java/security/cert/CertPathValidator/certification/BuypassCA.java fails
JDK-8272690 security/infra/java/security/cert/CertPathValidator/certification/LetsEncryptCA.java OCSP response error
JDK-8272692 security/infra/java/security/cert/CertPathValidator/certification/QuoVadisCA.java fails, Certificate has been revoked
JDK-8273525 sun/security/ssl/DHKeyExchange/LegacyDHEKeyExchange.java still fails due to "An established connection was aborted by the software in your host machine"

Yoshiki Sato, Oracle

Bug Summary
JDK-8275017 (tz) Update Timezone Data to 2021c
JDK-8275768 (tz) Update Timezone Data to 2021e
JDK-8274246 ArrayIndexOutOfBoundsException thrown in java.util.JapaneseImperialCalendar.add()
JDK-8275213 TestZoneInfo310.java fails with tzdata2021b
JDK-8277220 TestZoneInfo310.java fails with tzdata2021e
JDK-8275214 TimeZoneTest.java fails with tzdata2021b
JDK-8277222 Update TimeZoneNames files to follow the changes made by JDK-8275766

Yi Yang, Alibaba

Bug Summary
JDK-8271629 C2: assert(false) failed: bad AD file after JDK-8267687
JDK-8276747 C2: Improve Add and Xor ideal optimizations
JDK-8275036 Potential cyclic dependencies between Gregorian and CalendarSystem
JDK-8276744 Typo PHASE_CPP in CompilerPhaseType

Zhengyu Gu, Independent

Bug Summary
JDK-8276729 com/sun/jdi/RedefineCrossEvent.java failed "assert(m != __null) failed: NULL mirror"
JDK-8277483 gc/stress/CriticalNativeStress.java fails intermittently with Shenandoah
JDK-8277339 Shenandoah: CodeCache_lock should always be held for initializing code cache iteration
JDK-8275363 Shenandoah: Correct ordering of requested gc cause and gc request flag
JDK-8275362 Shenandoah: intermittent timeout with ConcurrentGCBreakpoint tests
JDK-8276853 Shenandoah: Race results degenerated GC to enter wrong entry point