PUSHES REPORT: 17.0.21

This report shows who pushed the backports to the given release. This usually shows who did the backporting, testing, and review work.

Report generated: Mon Oct 12 05:38:44 CEST 2026

Distribution by priority

Count Priority
6 P2
39 P3
112 P4
1 P5

Distribution by components

Count Component
158 100% Total
55 34.8% security-libs
35 22.2% security-libs/java.security
8 5.1% security-libs/jdk.security
7 4.4% security-libs/javax.crypto
4 2.5% security-libs/javax.net.ssl
1 0.6% security-libs/javax.crypto:pkcs11
36 22.8% core-libs
11 7.0% core-libs/java.net
5 3.2% core-libs/java.util:i18n
4 2.5% core-libs/java.nio
3 1.9% core-libs/java.time
3 1.9% core-libs/java.util.jar
3 1.9% core-libs/java.lang
2 1.3% core-libs
1 0.6% core-libs/java.rmi
1 0.6% core-libs/java.util.concurrent
1 0.6% core-libs/java.io:serialization
1 0.6% core-libs/java.io
1 0.6% core-libs/java.lang.invoke
34 21.5% client-libs
18 11.4% client-libs/java.awt
6 3.8% client-libs/2d
5 3.2% client-libs/javax.sound
3 1.9% client-libs/javax.swing
1 0.6% client-libs
1 0.6% client-libs/javax.accessibility
16 10.1% hotspot
8 5.1% hotspot/compiler
3 1.9% hotspot/runtime
2 1.3% hotspot/jfr
2 1.3% hotspot/gc
1 0.6% hotspot/svc
7 4.4% infrastructure
3 1.9% infrastructure/build
2 1.3% infrastructure/release_eng
2 1.3% infrastructure
5 3.2% tools
4 2.5% tools/jshell
1 0.6% tools
3 1.9% core-svc
2 1.3% core-svc/java.lang.management
1 0.6% core-svc/tools
1 0.6% performance
1 0.6% performance/libraries
1 0.6% xml
1 0.6% xml/jaxp

Distribution by affiliation

This Release Pushes

Original Pushes

Count Committer
158 100% Total
75 47.5% Amazon
69 43.7% Roland Mesde
3 1.9% Min Choi
2 1.3% Satyen Subramaniam
1 0.6% Juyeon Ma
70 44.3% SAP
62 39.2% Goetz Lindenmaier
6 3.8% Christoph Langer
2 1.3% Matthias Baesken
5 3.2% Red Hat
1 0.6% Thomas Fitzsimmons
1 0.6% Frederic Thevenet
1 0.6% Andrew Hughes
1 0.6% Thomas Stuefe
1 0.6% Antonio Vieiro
3 1.9% Azul
2 1.3% Timofei Pushkin
1 0.6% Roman Marchenko
2 1.3% IBM
1 0.6% srutjay1
1 0.6% Varada M
2 1.3% Intel
2 1.3% Mohamed Issa
1 0.6% Microsoft
1 0.6% Ashay Rane
Count Committer
158 100% Total
97 61.4% Oracle
17 10.8% Weijun Wang
9 5.7% Alexander Zvegintsev
7 4.4% Philip Race
6 3.8% Ben Perez
6 3.8% ferenc.r.rakoczi
3 1.9% Daniel Jelinski
3 1.9% Rajan Halade
3 1.9% Daniel Fuchs
2 1.3% Alan Bateman
2 1.3% Jan Lahoda
2 1.3% Prasanta Sadhukhan
2 1.3% Jayathirth D V
2 1.3% Oumaiyma Intissar
2 1.3% Anthony Scarpino
2 1.3% Naoto Sato
2 1.3% Alexander Zuev
1 0.6% Harshitha Onkar
1 0.6% Conor Cleary
1 0.6% johny.jose
1 0.6% Khalid Boulanouare
1 0.6% Erik Gahlin
1 0.6% Tejesh R
1 0.6% Kevin Rushforth
1 0.6% Haimay Chao
1 0.6% Leonid Mesnik
1 0.6% Mark Powers
1 0.6% Lance Andersen
1 0.6% Sean Coffey
1 0.6% Damon Nguyen
1 0.6% Artur Barashev
1 0.6% Alexey Ivanov
1 0.6% Casper Norrbin
1 0.6% Weibing Xiao
1 0.6% Valerie Peng
1 0.6% Sergey Kuksenko
1 0.6% Jamil Nimeh
1 0.6% Kevin Walls
1 0.6% Matthew Donovan
1 0.6% Chen Liang
1 0.6% Abhishek Kumar
1 0.6% Alisen Chung
1 0.6% Erik Joelsson
1 0.6% Daniel Daugherty
29 18.4% Independent
8 5.1% Mikhail Yankelevich
4 2.5% Sendao Yan
4 2.5% Eirik Bjørsnøs
1 0.6% Mahendra Chhipa
1 0.6% Sibabrata Sahoo
1 0.6% Jasmine Karthikeyan
1 0.6% Jim Laskey
1 0.6% Brian Burkhalter
1 0.6% Navi.Bereziuk
1 0.6% Guanqiang Han
1 0.6% Fabian Meumertzheim
1 0.6% 253344819+raneashay
1 0.6% Qing Xiao
1 0.6% Daohan Qu
1 0.6% taizousum11
1 0.6% Roger Riggs
8 5.1% Amazon
4 2.5% Roland Mesde
3 1.9% Sergey Bylokhov
1 0.6% Satyen Subramaniam
7 4.4% SAP
4 2.5% Goetz Lindenmaier
2 1.3% Christoph Langer
1 0.6% Matthias Baesken
4 2.5% Unknown
4 2.5% N/A
2 1.3% AMD
2 1.3% Jatin Bhateja
2 1.3% Canonical
2 1.3% Vladimir Petko
2 1.3% Microsoft
2 1.3% Ashay Rane
2 1.3% Red Hat
1 0.6% Andrew Dinn
1 0.6% Thomas Stuefe
1 0.6% BellSoft
1 0.6% Boris Ulasevich
1 0.6% Huawei
1 0.6% Dong Bo
1 0.6% IBM
1 0.6% srutjay1
1 0.6% JetBrains
1 0.6% dmitry.drobotov
1 0.6% Unknown: @salesforce.com
1 0.6% Xuelei Fan

Chronological push log:

UTC Time Priority Component Bug Summary This Release Push By Original Push By
Name Affiliation Name Affiliation
2026/09/29 13:21 P4 core-libs/java.nio JDK-8393185 (zipfs) Align ZipFileSystem END header validation with the ZipFile implementation Antonio Vieiro Red Hat Eirik Bjørsnøs Independent
2026/09/28 15:24 P4 core-libs/java.nio JDK-8393115 (zipfs) ZipFileSystem.initCEN needlessly reads END header Christoph Langer SAP Eirik Bjørsnøs Independent
2026/09/28 13:38 P4 core-libs/java.nio JDK-8393104 (zipfs) ZipFileSystem.readFullyAt does not tolerate short reads Christoph Langer SAP Alan Bateman Oracle
2026/09/28 13:22 P4 core-libs/java.util.jar JDK-8393103 Unexpected exception thrown when CEN file entry comment length is not valid Christoph Langer SAP Lance Andersen Oracle
2026/09/28 09:46 P3 core-libs/java.time JDK-8393084 Inconsistent TimeZone Names Displayed across JDK release trains Goetz Lindenmaier SAP N/A Unknown
2026/09/15 12:13 P4 client-libs/javax.sound JDK-8392402 Some javax/sound/sampled tests fail on systems with high CPU core number and running with high concurrency Goetz Lindenmaier SAP Philip Race Oracle
2026/09/15 09:13 P4 security-libs/java.security JDK-8392384 Follow-on fix for Improve certification checking Goetz Lindenmaier SAP (same) (same)
2026/09/10 07:49 P4 core-libs/java.time JDK-8392138 TestZoneTextPrinterParser.java assertion fails with expected: but was: Min Choi Amazon Oumaiyma Intissar Oracle
2026/09/09 17:12 P3 core-libs/java.time JDK-8392105 (tz) Update Timezone Data to 2026c Min Choi Amazon Oumaiyma Intissar Oracle
2026/09/09 00:26 P3 core-libs/java.util:i18n JDK-8392011 Cherry-pick metazone changes from CLDR to support tzdata2026c for JDK update releases Min Choi Amazon Sean Coffey Oracle
2026/09/04 13:33 P3 core-libs/java.util:i18n JDK-8391829 Cherry-pick tz attributes from newer CLDR data for jdk25u and earlier Goetz Lindenmaier SAP N/A Unknown
2026/09/01 14:28 P4 core-libs/java.util:i18n JDK-8391566 Support std/dstOffset attributes in CLDR's metazone definitions Goetz Lindenmaier SAP Naoto Sato Oracle
2026/09/01 12:44 P4 client-libs/java.awt JDK-8391559 [TEST_BUG] java/awt/TextField/CaretPositionTest/CaretPositionTest.java fails in OL-9 Roland Mesde Amazon Alexander Zvegintsev Oracle
2026/08/31 16:04 P4 core-libs/java.util:i18n JDK-8391479 Refactor test/jdk/sun/util/resources TestNG tests to JUnit Goetz Lindenmaier SAP Naoto Sato Oracle
2026/08/31 14:07 P4 tools/jshell JDK-8391475 Several JShell tests report JUnit discovery warnings Timofei Pushkin Azul Jan Lahoda Oracle
2026/08/31 13:26 P4 security-libs/java.security JDK-8391469 Add unit test for CertificateBuilder and SimpleOCSPServer test utilities Goetz Lindenmaier SAP Jamil Nimeh Oracle
2026/08/30 15:17 P4 security-libs/java.security JDK-8391435 draft-ietf-lamps-kyber-certificates is now RFC 9935 Goetz Lindenmaier SAP Weijun Wang Oracle
2026/08/28 14:55 P4 security-libs/java.security JDK-8391354 Remove LuxTrust Global Root CA Roland Mesde Amazon Mark Powers Oracle
2026/08/28 06:00 P2 security-libs/javax.crypto JDK-8391331 Add Support for the Latest ML-KEM and ML-DSA Private Key Encodings Goetz Lindenmaier SAP Weijun Wang Oracle
2026/08/26 06:05 P4 security-libs/javax.crypto JDK-8391164 ML-KEM's 12-bit decompression can be simplified on aarch64 Goetz Lindenmaier SAP ferenc.r.rakoczi Oracle
2026/08/26 06:02 P4 security-libs/java.security JDK-8391163 acvp test should throw SkippedException when no ACVP-Server available Goetz Lindenmaier SAP Sendao Yan Independent
2026/08/26 06:00 P4 security-libs/javax.crypto:pkcs11 JDK-8391162 PKCS11-NSS generic keys generated by DH have leading zeroes stripped Goetz Lindenmaier SAP Daniel Jelinski Oracle
2026/08/24 16:43 P4 core-libs/java.net JDK-8390327 [17u] test/jdk/java/net/httpclient/lib/jdk/httpclient/test/lib/common/HttpServerAdapters.java fails to compile in Java 17 after JDK-8343855 backport Roland Mesde Amazon (same) (same)
2026/08/24 14:12 P4 security-libs/java.security JDK-8391001 AlgorithmId should not encode a missing parameters field as NULL unless hardcoded Varada M IBM Weijun Wang Oracle
2026/08/21 15:53 P4 tools/jshell JDK-8390871 Convert JShell tests to use JUnit instead of TestNG Timofei Pushkin Azul Jan Lahoda Oracle
2026/08/21 15:35 P4 core-libs/java.lang JDK-8390868 [Ubuntu 25.10] java/lang/ProcessBuilder/Basic.java, java/lang/ProcessHandle/InfoTest.java fail due to rust-coreutils Roman Marchenko Azul Vladimir Petko Canonical
2026/08/21 11:49 P4 security-libs/javax.crypto JDK-8390829 Define algorithm names for keys derived from KeyAgreement Goetz Lindenmaier SAP Weijun Wang Oracle
2026/08/19 11:28 P4 core-libs JDK-8390648 Fix some Asserts failure messages Goetz Lindenmaier SAP Weijun Wang Oracle
2026/08/19 11:11 P3 security-libs/java.security JDK-8390646 Add a Test against ECDSA and ECDH NIST Test vector Goetz Lindenmaier SAP Sibabrata Sahoo Independent
2026/08/19 06:36 P3 hotspot/compiler JDK-8390626 Remove remnants of debugging in the fix for JDK-8348561 and JDK-8349721 Goetz Lindenmaier SAP ferenc.r.rakoczi Oracle
2026/08/18 18:16 P2 security-libs/java.security JDK-8390583 Update SignatureUtil.java with the new KnownOIDs Roland Mesde Amazon Weijun Wang Oracle
2026/08/18 12:57 P3 security-libs/java.security JDK-8390523 SHAKE128 and SHAKE256 MessageDigest algorithms Roland Mesde Amazon Weijun Wang Oracle
2026/08/17 22:51 P3 client-libs/2d JDK-8390490 [macOS] Window content not updated when rendering to multiple windows Roland Mesde Amazon Sergey Bylokhov Amazon
2026/08/17 22:49 P4 core-libs/java.io:serialization JDK-8390489 [21u] java/io/Serializable/records/ProhibitedMethods.java fails after JDK-8307843 backport in othervm mode Roland Mesde Amazon (same) (same)
2026/08/17 22:49 P4 client-libs/javax.sound JDK-8390488 javax/sound/sampled/Clip/ClipFlushCrash.java timed out Roland Mesde Amazon Philip Race Oracle
2026/08/17 22:49 P4 client-libs/javax.sound JDK-8390487 ClipIsRunningAfterStop.java failed with "../nptl/pthread_mutex_lock.c:81: __pthread_mutex_lock: Assertion `mutex->__data.__owner == 0' failed." Roland Mesde Amazon Philip Race Oracle
2026/08/17 22:49 P3 client-libs/javax.sound JDK-8390486 3 tests from closed/javax/sound/sampled caused BSOD on win 7 x86 Roland Mesde Amazon Philip Race Oracle
2026/08/17 16:18 P4 security-libs/java.security JDK-8390325 [17u] test/jdk/sun/security/x509/GeneralName/DNSNameTest.java fails to compile in Java 17 after JDK-8381771 backport Roland Mesde Amazon (same) (same)
2026/08/15 20:02 P4 security-libs/javax.net.ssl JDK-8390439 Fix typo in onTradAbsence Goetz Lindenmaier SAP Daniel Jelinski Oracle
2026/08/15 19:58 P4 security-libs/javax.crypto JDK-8390438 Optimize Java implementation of ML-KEM Goetz Lindenmaier SAP Ben Perez Oracle
2026/08/15 19:56 P4 security-libs/java.security JDK-8390437 Optimize Java implementation of ML-DSA Goetz Lindenmaier SAP Ben Perez Oracle
2026/08/15 19:54 P4 performance/libraries JDK-8390436 Update crypto microbenchmarks to cover ML-DSA, ML-KEM, and HSS algorithms Goetz Lindenmaier SAP Sergey Kuksenko Oracle
2026/08/13 14:52 P3 hotspot/compiler JDK-8390319 Add aarch64 intrinsics for ML-KEM Goetz Lindenmaier SAP ferenc.r.rakoczi Oracle
2026/08/13 13:20 P4 security-libs/java.security JDK-8390311 Make exceptions in Java_sun_security_mscapi_CKeyPairGenerator generateCKeyPair more specific Matthias Baesken SAP (same) (same)
2026/08/12 14:15 P4 security-libs/javax.crypto JDK-8390226 Investigate cleaner implementation of AArch64 ML-DSA intrinsic introduced in JDK-8348561 Goetz Lindenmaier SAP Andrew Dinn Red Hat
2026/08/11 14:56 P3 hotspot/compiler JDK-8390137 Add aarch64 intrinsics for ML-DSA Goetz Lindenmaier SAP ferenc.r.rakoczi Oracle
2026/08/10 23:09 P4 hotspot/compiler JDK-8390093 [17u] TestUseSHA512IntrinsicsOptionOnUnsupportedCPU failed with java.lang.AssertionError Juyeon Ma Amazon N/A Unknown
2026/08/10 17:17 P4 security-libs/java.security JDK-8390079 Add a check for DNS label not to end with a hyphen Roland Mesde Amazon Artur Barashev Oracle
2026/08/08 08:30 P3 security-libs/java.security JDK-8390021 Update ML tests to verify against ACVP 1.1.0.38 version Goetz Lindenmaier SAP Rajan Halade Oracle
2026/08/07 14:12 P4 hotspot/compiler JDK-8389967 x86 Code cleanup related to move instructions. Mohamed Issa Intel Jatin Bhateja AMD
2026/08/07 12:48 P3 security-libs/java.security JDK-8389956 Switch ML-DSA implementation to FIPS 204 final Goetz Lindenmaier SAP Weijun Wang Oracle
2026/08/07 11:31 P4 infrastructure/release_eng JDK-8390589 [17u] Remove designator DEFAULT_PROMOTED_VERSION_PRE=ea for release 17.0.20.1 Christoph Langer SAP (same) (same)
2026/08/06 15:48 P4 security-libs/java.security JDK-8389904 Remove wrapper functions for intrinsics in PQC algorithms Goetz Lindenmaier SAP Ben Perez Oracle
2026/08/06 15:33 P2 security-libs/java.security JDK-8389900 ML_KEM NamedParameterSpec constants removed by ML-DSA integration Goetz Lindenmaier SAP Valerie Peng Oracle
2026/08/06 15:30 P3 security-libs/java.security JDK-8389899 Implement JEP 497: Quantum-Resistant Module-Lattice-Based Digital Signature Algorithm Goetz Lindenmaier SAP Ben Perez Oracle
2026/08/04 16:26 P4 hotspot/compiler JDK-8389724 Optimize existing fill stubs for AVX-512 target Mohamed Issa Intel Jatin Bhateja AMD
2026/08/03 12:24 P3 security-libs/javax.crypto JDK-8389616 Implement JEP 496: Quantum-Resistant Module-Lattice-Based Key Encapsulation Mechanism Goetz Lindenmaier SAP Ben Perez Oracle
2026/08/03 07:57 P2 security-libs/java.security JDK-8389604 sun/security/tools/keytool/GenKeyPairSigner.java failed due to missing certificate output Goetz Lindenmaier SAP Weijun Wang Oracle
2026/08/03 05:56 P4 client-libs/2d JDK-8389599 Add validation of the raster's layout before using in native Goetz Lindenmaier SAP Sergey Bylokhov Amazon
2026/08/03 05:56 P4 core-libs/java.util.jar JDK-8389598 Improve ZipFile validation of the END header Goetz Lindenmaier SAP Eirik Bjørsnøs Independent
2026/07/31 16:20 P4 security-libs/java.security JDK-8389531 Static ACVP sample tests Goetz Lindenmaier SAP Weijun Wang Oracle
2026/07/31 16:18 P3 security-libs/java.security JDK-8389530 A common framework to support public key algorithms with standard parameter sets Goetz Lindenmaier SAP Weijun Wang Oracle
2026/07/29 12:27 P2 infrastructure/build JDK-8390585 Change .jcheck/conf branches property to match valid branches Goetz Lindenmaier SAP Kevin Rushforth Oracle
2026/07/29 12:20 P3 security-libs/java.security JDK-8389339 ProblemList sun/security/tools/keytool/GenKeyPairSigner.java Goetz Lindenmaier SAP Daniel Daugherty Oracle
2026/07/29 12:18 P4 hotspot/svc JDK-8389338 Add "dt_socket" to `CheckedFeatures.notImplemented` for Windows/ARM64 Ashay Rane Microsoft (same) (same)
2026/07/29 12:16 P3 hotspot/runtime JDK-8389337 TestLimitsUpdating.java fails with runtime exception even after JDK-8370492 is fixed Goetz Lindenmaier SAP Casper Norrbin Oracle
2026/07/29 12:11 P4 core-libs/java.util.jar JDK-8389336 Add a fast, non-manual alternative to test/jdk/java/util/zip/ZipFile/TestTooManyEntries Goetz Lindenmaier SAP Eirik Bjørsnøs Independent
2026/07/29 12:01 P4 client-libs/2d JDK-8389335 Replace the usage of ImageLayoutException by the CMMException Goetz Lindenmaier SAP Sergey Bylokhov Amazon
2026/07/29 11:59 P4 security-libs/jdk.security JDK-8389334 jarsigner output does not explain why an EC key is disabled if its curve has been disabled Goetz Lindenmaier SAP Haimay Chao Oracle
2026/07/24 15:34 P4 infrastructure JDK-8389745 Bump update version for OpenJDK: jdk-17.0.20.1 Goetz Lindenmaier SAP (same) (same)
2026/07/24 15:05 P4 hotspot/jfr JDK-8389078 jdk/jfr/event/os/TestCPULoad.java fails with Expected at least one event Christoph Langer SAP Erik Gahlin Oracle
2026/07/23 14:31 P3 client-libs/javax.accessibility JDK-8388871 MacOS, Accessibility: Crash in [MenuAccessibility accessibilityChildren] after JDK-8341311 Matthias Baesken SAP dmitry.drobotov JetBrains
2026/07/23 13:11 P4 core-libs/java.net JDK-8388857 Refactor some jdk/java/net/httpclient/http2 tests to JUnit Roland Mesde Amazon Mahendra Chhipa Independent
2026/07/23 13:09 P4 client-libs JDK-8388856 Problem list automated tests that fail on macOS15 Roland Mesde Amazon Philip Race Oracle
2026/07/23 13:08 P4 tools JDK-8388855 Use JUnit in lib-test/jdk tests Roland Mesde Amazon Qing Xiao Independent
2026/07/20 16:15 P4 security-libs/javax.net.ssl JDK-8388494 MultiNST tests need more debugging and timing Roland Mesde Amazon Anthony Scarpino Oracle
2026/07/16 11:30 P3 hotspot/jfr JDK-8388395 Path-to-gcroots search should not trigger stack overflows Thomas Stuefe Red Hat (same) (same)
2026/07/13 16:36 P4 client-libs/java.awt JDK-8388153 Regression automated Test 'java/awt/TrayIcon/PopupMenuLeakTest/PopupMenuLeakTest.java' fails Roland Mesde Amazon Alexander Zvegintsev Oracle
2026/07/13 16:36 P4 core-libs/java.net JDK-8388152 Tests should throw SkippedException when SCTP not supported Roland Mesde Amazon Sendao Yan Independent
2026/07/13 16:36 P4 client-libs/java.awt JDK-8388151 Test java/awt/event/KeyEvent/ExtendedKeyCode/ExtendedKeyCodeTest.java failed: Wrong extended key code Roland Mesde Amazon Alisen Chung Oracle
2026/07/13 16:35 P4 security-libs/jdk.security JDK-8388150 /test/jdk/sun/security/pkcs11/Cipher tests skip without SkippedException Roland Mesde Amazon Mikhail Yankelevich Independent
2026/07/13 16:33 P4 security-libs/javax.crypto JDK-8388149 Add EdDSA/XDH/RSASSA-PSS to KeyPairGeneratorBench.java Roland Mesde Amazon Xuelei Fan Unknown: @salesforce.com
2026/07/13 16:33 P4 security-libs/javax.net.ssl JDK-8388148 Test sun/security/ssl/SSLSessionImpl/ResumeChecksServer.java failed: Existing session was used Roland Mesde Amazon Anthony Scarpino Oracle
2026/07/13 16:32 P4 client-libs/java.awt JDK-8388147 Test java/awt/Mouse/TitleBarDoubleClick/TitleBarDoubleClick fails on Ubuntu with mouseReleased event after double click on title bar Roland Mesde Amazon Alexander Zvegintsev Oracle
2026/07/13 16:31 P3 client-libs/javax.swing JDK-8388146 Regression automated Test 'javax/swing/JFileChooser/6738668/bug6738668.java' fails Roland Mesde Amazon Prasanta Sadhukhan Oracle
2026/07/10 17:05 P4 hotspot/runtime JDK-8388099 gtest/GTestWrapper.java fails on armhf due to LogDecorations.iso8601_utctime_test Satyen Subramaniam Amazon Vladimir Petko Canonical
2026/07/08 04:47 P4 infrastructure/release_eng JDK-8388753 [17u] Remove designator DEFAULT_PROMOTED_VERSION_PRE=ea for release 17.0.20 Christoph Langer SAP (same) (same)
2026/07/06 23:24 P3 client-libs/java.awt JDK-8386991 Insets are incorrectly set in newer Gnome versions Satyen Subramaniam Amazon (same) (same)
2026/07/06 16:33 P3 infrastructure/build JDK-8387786 Update autoconf build-aux files with latest from 2022-09-17 Andrew Hughes Red Hat Erik Joelsson Oracle
2026/07/06 16:32 P4 client-libs/java.awt JDK-8387785 Move NativeDialogToFrontBackTest.java PL test to manual category Roland Mesde Amazon Abhishek Kumar Oracle
2026/07/06 16:31 P4 client-libs/java.awt JDK-8387784 java/awt/List/SingleModeDeselect/SingleModeDeselect.java times out Roland Mesde Amazon Alexander Zuev Oracle
2026/07/06 16:31 P4 client-libs/java.awt JDK-8387783 java/awt/Component/NativeInLightShow/NativeInLightShow.java fails Roland Mesde Amazon Alexander Zvegintsev Oracle
2026/07/06 16:31 P4 client-libs/java.awt JDK-8387782 java/awt/TextArea/AutoScrollOnSelectAndAppend/AutoScrollOnSelectAndAppend.java fails on mac10.13 Roland Mesde Amazon Jayathirth D V Oracle
2026/07/06 16:30 P4 client-libs/2d JDK-8387781 [macos26] Graphics2D tests fail on new macOS 26 Roland Mesde Amazon Harshitha Onkar Oracle
2026/07/06 16:30 P4 client-libs/javax.swing JDK-8387779 javax/swing/JTable/7068740/bug7068740.java fails on Ubunutu 20.04 Roland Mesde Amazon Prasanta Sadhukhan Oracle
2026/07/06 16:29 P4 client-libs/java.awt JDK-8387778 java/awt/Scrollbar/ScrollbarMouseWheelTest/ScrollbarMouseWheelTest.java fails Roland Mesde Amazon Alexander Zvegintsev Oracle
2026/07/06 16:29 P4 core-svc/java.lang.management JDK-8387777 MemoryPoolMBean/isCollectionUsageThresholdExceeded/isexceeded005 failed with "isCollectionUsageThresholdExceeded() returned true, while threshold = 1 and used = 0" Roland Mesde Amazon Kevin Walls Oracle
2026/07/06 12:47 P4 core-libs/java.util:i18n JDK-8387766 [REDO] Incorrect Interpretation of POSIX TZ Environment Variable on AIX srutjay1 IBM (same) (same)
2026/06/29 18:03 P3 client-libs/java.awt JDK-8387443 Test java/awt/im/memoryleak/InputContextMemoryLeakTest.java fails Roland Mesde Amazon Alexander Zvegintsev Oracle
2026/06/29 18:02 P4 client-libs/java.awt JDK-8387442 Event time in future part 2, now on X Roland Mesde Amazon Alexander Zvegintsev Oracle
2026/06/29 18:02 P4 client-libs/java.awt JDK-8387440 Few awt test fail for Solaris 11 with RuntimeException Roland Mesde Amazon Alexander Zvegintsev Oracle
2026/06/29 18:02 P4 client-libs/2d JDK-8387439 closed test sun/java2d/OpenGL/XORPaint.java is unstable Roland Mesde Amazon Philip Race Oracle
2026/06/29 18:01 P4 client-libs/java.awt JDK-8387438 GetMousePositionTest fails with the message "Mouse position should not be null" Roland Mesde Amazon Alexander Zuev Oracle
2026/06/29 18:01 P3 client-libs/java.awt JDK-8387437 Consistent failure of java/awt/dnd/MissingEventsOnModalDialog/MissingEventsOnModalDialogTest.java Roland Mesde Amazon Alexander Zvegintsev Oracle
2026/06/29 17:59 P4 hotspot/gc JDK-8387436 Test vmTestbase/gc/gctests/WeakReference/weak006/weak006.java fails: Last soft reference has not been cleared Roland Mesde Amazon Leonid Mesnik Oracle
2026/06/29 17:58 P4 hotspot/gc JDK-8387435 jdk/jfr/event/gc/detailed/TestZAllocationStallEvent.java intermittent OOME Roland Mesde Amazon Sendao Yan Independent
2026/06/29 17:58 P4 core-svc/tools JDK-8387434 containers/docker/TestJcmd.java failed with "RuntimeException: Could not find specified process" Roland Mesde Amazon Navi.Bereziuk Independent
2026/06/29 17:58 P4 core-libs/java.util.concurrent JDK-8387433 java/util/concurrent/forkjoin/AsyncShutdownNow.java is too slow Roland Mesde Amazon Alan Bateman Oracle
2026/06/26 14:00 P3 core-libs JDK-8387338 Compiling OpenJDK with C23 C-Compiler gives warning: initialization discards ‘const’ qualifier from pointer target type Frederic Thevenet Red Hat Jasmine Karthikeyan Independent
2026/06/23 08:44 P3 security-libs/java.security JDK-8387079 Internal XOF Methods for SHAKE128 and SHAKE256 Goetz Lindenmaier SAP ferenc.r.rakoczi Oracle
2026/06/23 08:37 P4 security-libs/java.security JDK-8387077 Ensure randomness is only read from provided SecureRandom object Goetz Lindenmaier SAP Weijun Wang Oracle
2026/06/23 08:34 P3 security-libs/java.security JDK-8387076 DSA does not reset SecureRandom when initSign is called again Goetz Lindenmaier SAP Ben Perez Oracle
2026/06/23 07:42 P3 client-libs/2d JDK-8387205 Update HarfBuzz to 14.2.0 Goetz Lindenmaier SAP Jayathirth D V Oracle
2026/06/23 07:37 P3 security-libs/java.security JDK-8387070 isAssignableFrom checks in AlgorithmParametersSpi.engineGetParameterSpec appear to be backwards Goetz Lindenmaier SAP Weijun Wang Oracle
2026/06/22 16:32 P4 hotspot/compiler JDK-8387038 JitTester: Exclude java.lang.Math.random Roland Mesde Amazon Daohan Qu Independent
2026/06/22 16:32 P4 tools/jshell JDK-8386776 [17u] Test test/langtools/jdk/jshell/UndefinedClassTest.java fails on JDK 17 with java.lang.ThreadDeath Roland Mesde Amazon (same) (same)
2026/06/22 16:32 P4 xml/jaxp JDK-8387037 Test CR6740048.java passes unexpectedly missing CR6740048.xsd Roland Mesde Amazon Sendao Yan Independent
2026/06/22 16:31 P4 core-libs/java.net JDK-8387036 Refactor java/net/httpclient/ThrowingPublishers*.java tests to use JUnit5 Roland Mesde Amazon Daniel Fuchs Oracle
2026/06/22 16:31 P4 core-libs/java.io JDK-8387033 java/io/File/GetXSpace.java fails on Windows with CD-ROM drive Roland Mesde Amazon taizousum11 Independent
2026/06/19 11:55 P4 core-svc/java.lang.management JDK-8386977 OperatingSystemMXBean.getSystemCpuLoad() throws NPE Goetz Lindenmaier SAP Fabian Meumertzheim Independent
2026/06/19 11:52 P4 security-libs/java.security JDK-8386976 SHA3 performance can be improved Goetz Lindenmaier SAP ferenc.r.rakoczi Oracle
2026/06/19 11:50 P3 core-libs/java.net JDK-8386975 Request with timeout aborts later in-flight request on HTTP/1.1 cxn Goetz Lindenmaier SAP Conor Cleary Oracle
2026/06/16 17:21 P3 core-libs/java.lang JDK-8386785 java/lang/StringBuilder/HugeCapacity.java failing with OOME Roland Mesde Amazon Roger Riggs Independent
2026/06/16 15:31 P4 core-libs/java.net JDK-8386775 Refactor java/net/httpclient/ThrowingSubscribers*.java tests to use JUnit5 Roland Mesde Amazon Daniel Fuchs Oracle
2026/06/16 15:30 P4 core-libs/java.nio JDK-8386774 Refactor java/nio/channels/AsynchronousSocketChannel test to use JUnit Roland Mesde Amazon Brian Burkhalter Independent
2026/06/16 15:12 P4 security-libs/java.security JDK-8386768 CAInterop.java#buypassclass3ca fails with Intermediate Root CA not found in the chain Roland Mesde Amazon Rajan Halade Oracle
2026/06/16 15:11 P4 client-libs/java.awt JDK-8386767 UnixMultiResolutionSplashTest.java fails intermittently on Ubuntu_24.04 Roland Mesde Amazon Alexey Ivanov Oracle
2026/06/16 14:40 P3 security-libs/java.security JDK-8386766 SHAKE256 does not work correctly if n >= 137 Roland Mesde Amazon Weijun Wang Oracle
2026/06/16 14:32 P3 security-libs/java.security JDK-8386763 CAInterop.java#microsoftrsa2017 test fails as EE certificate does not specify OCSP responder Roland Mesde Amazon Rajan Halade Oracle
2026/06/16 13:36 P4 core-libs/java.lang JDK-8386751 java/lang/StringBuffer(StringBuilder)/HugeCapacity.java intermittently fails Roland Mesde Amazon Jim Laskey Independent
2026/06/16 12:46 P2 infrastructure/build JDK-8386743 Windows build broken because of MSys2/Make update Goetz Lindenmaier SAP Ashay Rane Microsoft
2026/06/15 10:22 P3 security-libs/java.security JDK-8386651 EdDSA does not verify when there is no message Goetz Lindenmaier SAP Weijun Wang Oracle
2026/06/15 10:17 P4 security-libs/java.security JDK-8386650 Certificate's IP x509 NameConstraints raises ArrayIndexOutOfBoundsException Goetz Lindenmaier SAP Daniel Jelinski Oracle
2026/06/10 14:41 P4 core-libs/java.rmi JDK-8386365 TEST_BUG: java/rmi/transport/checkLeaseInfoLeak/CheckLeaseLeak.java failing intermittently Roland Mesde Amazon johny.jose Oracle
2026/06/10 14:39 P4 security-libs/jdk.security JDK-8386364 sun/security/tools/keytool/i18n.java add an ability to add comment for failures Roland Mesde Amazon Mikhail Yankelevich Independent
2026/06/10 14:38 P4 client-libs/java.awt JDK-8386363 Test java/awt/Frame/MultiScreenTest.java fails: Window list is empty Roland Mesde Amazon Khalid Boulanouare Oracle
2026/06/10 14:37 P4 tools/jshell JDK-8386362 Add an extra test for JDK-8292755 Roland Mesde Amazon Weibing Xiao Oracle
2026/06/10 14:37 P4 core-libs/java.lang.invoke JDK-8386361 Test java/lang/invoke/TestVHInvokerCaching.java tests nothing Roland Mesde Amazon Chen Liang Oracle
2026/06/10 14:36 P5 security-libs/jdk.security JDK-8386360 sun/security/tools/keytool/i18n.java user country is current user location instead of the language Roland Mesde Amazon Mikhail Yankelevich Independent
2026/06/10 14:36 P4 security-libs/jdk.security JDK-8386359 test/jdk/sun/security/pkcs11/Provider/ tests skipped without SkippedException Roland Mesde Amazon Mikhail Yankelevich Independent
2026/06/10 14:35 P4 security-libs/javax.net.ssl JDK-8386358 Some PKCS11Tests are being skipped when they shouldn't Roland Mesde Amazon Matthew Donovan Oracle
2026/06/10 14:33 P4 core-libs/java.net JDK-8386447 [17u] Fix NTLMHeadTest after backport of 8384486 Goetz Lindenmaier SAP (same) (same)
2026/06/09 14:20 P4 core-libs/java.net JDK-8386446 NTLM tests fail on Windows 11 and Windows Server 2025 Goetz Lindenmaier SAP 253344819+raneashay Independent
2026/06/09 14:10 P3 security-libs/java.security JDK-8386445 No need for visible input warning in s.s.u.Password when not reading from System.in Goetz Lindenmaier SAP Weijun Wang Oracle
2026/06/09 14:09 P3 core-libs/java.net JDK-8386444 HttpsURLConnection.getServerCertificates() throws "java.lang.IllegalStateException: connection not yet open" for the HEAD method Goetz Lindenmaier SAP Daniel Fuchs Oracle
2026/06/09 14:06 P3 hotspot/compiler JDK-8386267 AArch64: test/jdk/sun/security/ec/ed/EdDSATest.java failed with -XX:+UseSHA3Intrinsics Goetz Lindenmaier SAP Dong Bo Huawei
2026/06/08 10:40 P4 core-libs/java.net JDK-8386443 HttpServer.stop should terminate immediately if no exchanges are in progress Goetz Lindenmaier SAP Mikhail Yankelevich Independent
2026/06/08 09:07 P4 hotspot/runtime JDK-8386145 assert(false) failed: "Attempting to acquire lock NativeHeapTrimmer_lock/nosafepoint out of order with lock ConcurrentHashTableResize_lock/nosafepoint-2 -- possible deadlock" when using native heap trimmer Goetz Lindenmaier SAP Guanqiang Han Independent
2026/06/08 09:04 P4 security-libs/java.security JDK-8386144 SHA3: changing java implementation to help C2 create high-performance code Goetz Lindenmaier SAP Boris Ulasevich BellSoft
2026/06/08 09:02 P4 core-libs/java.net JDK-8386442 Process httpserver cancelled keys more quickly Goetz Lindenmaier SAP N/A Unknown
2026/06/08 07:27 P3 security-libs/java.security JDK-8386441 Keytool exposes the password in plain text when command is piped using | grep Thomas Fitzsimmons Red Hat Weijun Wang Oracle
2026/06/03 14:13 P4 security-libs/jdk.security JDK-8385905 TestDynamicStore.java '/manual' disables use of '/timeout' Roland Mesde Amazon Mikhail Yankelevich Independent
2026/06/03 13:16 P4 client-libs/java.awt JDK-8385898 Test java/awt/Modal/ToFront/DialogToFrontModeless1Test.java fails on Linux Roland Mesde Amazon Tejesh R Oracle
2026/06/03 13:15 P4 client-libs/javax.swing JDK-8385897 Test javax/swing/JFileChooser/4966171/bug4966171.java is failing with OOME Roland Mesde Amazon Damon Nguyen Oracle
2026/06/03 13:15 P4 client-libs/javax.sound JDK-8385896 Some sound tests failing in CI due to lack of sound key Roland Mesde Amazon Philip Race Oracle
2026/06/03 13:14 P4 security-libs/jdk.security JDK-8385895 jdk/open/test/jdk/sun/security/pkcs11/ rsa, ec, config, secmod and sslecc tests are skipping but showing as pass Roland Mesde Amazon Mikhail Yankelevich Independent
2026/06/03 13:14 P4 security-libs/jdk.security JDK-8385894 sun/security/krb5/config/native/TestDynamicStore.java ensure that the test is run with sudo Roland Mesde Amazon Mikhail Yankelevich Independent
2026/06/03 07:30 P4 infrastructure JDK-8385509 Bump update version for OpenJDK: jdk-17.0.21 Goetz Lindenmaier SAP (same) (same)

No changesets log

P4 security-libs/java.security JDK-8388000 Release Note: Added Support for the Latest ML-KEM and ML-DSA Private Key Encodings

Committer push log

Andrew Hughes, Red Hat

Bug Summary
JDK-8387786 Update autoconf build-aux files with latest from 2022-09-17

Ashay Rane, Microsoft

Bug Summary
JDK-8389338 Add "dt_socket" to `CheckedFeatures.notImplemented` for Windows/ARM64

Antonio Vieiro, Red Hat

Bug Summary
JDK-8393185 (zipfs) Align ZipFileSystem END header validation with the ZipFile implementation

Christoph Langer, SAP

Bug Summary
JDK-8393115 (zipfs) ZipFileSystem.initCEN needlessly reads END header
JDK-8393104 (zipfs) ZipFileSystem.readFullyAt does not tolerate short reads
JDK-8388753 [17u] Remove designator DEFAULT_PROMOTED_VERSION_PRE=ea for release 17.0.20
JDK-8390589 [17u] Remove designator DEFAULT_PROMOTED_VERSION_PRE=ea for release 17.0.20.1
JDK-8389078 jdk/jfr/event/os/TestCPULoad.java fails with Expected at least one event
JDK-8393103 Unexpected exception thrown when CEN file entry comment length is not valid

Thomas Fitzsimmons, Red Hat

Bug Summary
JDK-8386441 Keytool exposes the password in plain text when command is piped using | grep

Frederic Thevenet, Red Hat

Bug Summary
JDK-8387338 Compiling OpenJDK with C23 C-Compiler gives warning: initialization discards ‘const’ qualifier from pointer target type

Goetz Lindenmaier, SAP

Bug Summary
JDK-8386447 [17u] Fix NTLMHeadTest after backport of 8384486
JDK-8389530 A common framework to support public key algorithms with standard parameter sets
JDK-8386267 AArch64: test/jdk/sun/security/ec/ed/EdDSATest.java failed with -XX:+UseSHA3Intrinsics
JDK-8391163 acvp test should throw SkippedException when no ACVP-Server available
JDK-8389336 Add a fast, non-manual alternative to test/jdk/java/util/zip/ZipFile/TestTooManyEntries
JDK-8390646 Add a Test against ECDSA and ECDH NIST Test vector
JDK-8390137 Add aarch64 intrinsics for ML-DSA
JDK-8390319 Add aarch64 intrinsics for ML-KEM
JDK-8391331 Add Support for the Latest ML-KEM and ML-DSA Private Key Encodings
JDK-8391469 Add unit test for CertificateBuilder and SimpleOCSPServer test utilities
JDK-8389599 Add validation of the raster's layout before using in native
JDK-8386145 assert(false) failed: "Attempting to acquire lock NativeHeapTrimmer_lock/nosafepoint out of order with lock ConcurrentHashTableResize_lock/nosafepoint-2 -- possible deadlock" when using native heap trimmer
JDK-8389745 Bump update version for OpenJDK: jdk-17.0.20.1
JDK-8385509 Bump update version for OpenJDK: jdk-17.0.21
JDK-8386650 Certificate's IP x509 NameConstraints raises ArrayIndexOutOfBoundsException
JDK-8390585 Change .jcheck/conf branches property to match valid branches
JDK-8391829 Cherry-pick tz attributes from newer CLDR data for jdk25u and earlier
JDK-8390829 Define algorithm names for keys derived from KeyAgreement
JDK-8391435 draft-ietf-lamps-kyber-certificates is now RFC 9935
JDK-8387076 DSA does not reset SecureRandom when initSign is called again
JDK-8386651 EdDSA does not verify when there is no message
JDK-8387077 Ensure randomness is only read from provided SecureRandom object
JDK-8390648 Fix some Asserts failure messages
JDK-8390439 Fix typo in onTradAbsence
JDK-8392384 Follow-on fix for Improve certification checking
JDK-8386443 HttpServer.stop should terminate immediately if no exchanges are in progress
JDK-8386444 HttpsURLConnection.getServerCertificates() throws "java.lang.IllegalStateException: connection not yet open" for the HEAD method
JDK-8389616 Implement JEP 496: Quantum-Resistant Module-Lattice-Based Key Encapsulation Mechanism
JDK-8389899 Implement JEP 497: Quantum-Resistant Module-Lattice-Based Digital Signature Algorithm
JDK-8389598 Improve ZipFile validation of the END header
JDK-8393084 Inconsistent TimeZone Names Displayed across JDK release trains
JDK-8387079 Internal XOF Methods for SHAKE128 and SHAKE256
JDK-8390226 Investigate cleaner implementation of AArch64 ML-DSA intrinsic introduced in JDK-8348561
JDK-8387070 isAssignableFrom checks in AlgorithmParametersSpi.engineGetParameterSpec appear to be backwards
JDK-8389334 jarsigner output does not explain why an EC key is disabled if its curve has been disabled
JDK-8391164 ML-KEM's 12-bit decompression can be simplified on aarch64
JDK-8389900 ML_KEM NamedParameterSpec constants removed by ML-DSA integration
JDK-8386445 No need for visible input warning in s.s.u.Password when not reading from System.in
JDK-8386446 NTLM tests fail on Windows 11 and Windows Server 2025
JDK-8386977 OperatingSystemMXBean.getSystemCpuLoad() throws NPE
JDK-8390437 Optimize Java implementation of ML-DSA
JDK-8390438 Optimize Java implementation of ML-KEM
JDK-8391162 PKCS11-NSS generic keys generated by DH have leading zeroes stripped
JDK-8389339 ProblemList sun/security/tools/keytool/GenKeyPairSigner.java
JDK-8386442 Process httpserver cancelled keys more quickly
JDK-8391479 Refactor test/jdk/sun/util/resources TestNG tests to JUnit
JDK-8390626 Remove remnants of debugging in the fix for JDK-8348561 and JDK-8349721
JDK-8389904 Remove wrapper functions for intrinsics in PQC algorithms
JDK-8389335 Replace the usage of ImageLayoutException by the CMMException
JDK-8386975 Request with timeout aborts later in-flight request on HTTP/1.1 cxn
JDK-8386976 SHA3 performance can be improved
JDK-8386144 SHA3: changing java implementation to help C2 create high-performance code
JDK-8392402 Some javax/sound/sampled tests fail on systems with high CPU core number and running with high concurrency
JDK-8389531 Static ACVP sample tests
JDK-8389604 sun/security/tools/keytool/GenKeyPairSigner.java failed due to missing certificate output
JDK-8391566 Support std/dstOffset attributes in CLDR's metazone definitions
JDK-8389956 Switch ML-DSA implementation to FIPS 204 final
JDK-8389337 TestLimitsUpdating.java fails with runtime exception even after JDK-8370492 is fixed
JDK-8390436 Update crypto microbenchmarks to cover ML-DSA, ML-KEM, and HSS algorithms
JDK-8387205 Update HarfBuzz to 14.2.0
JDK-8390021 Update ML tests to verify against ACVP 1.1.0.38 version
JDK-8386743 Windows build broken because of MSys2/Make update

Juyeon Ma, Amazon

Bug Summary
JDK-8390093 [17u] TestUseSHA512IntrinsicsOptionOnUnsupportedCPU failed with java.lang.AssertionError

Matthias Baesken, SAP

Bug Summary
JDK-8388871 MacOS, Accessibility: Crash in [MenuAccessibility accessibilityChildren] after JDK-8341311
JDK-8390311 Make exceptions in Java_sun_security_mscapi_CKeyPairGenerator generateCKeyPair more specific

Min Choi, Amazon

Bug Summary
JDK-8392105 (tz) Update Timezone Data to 2026c
JDK-8392011 Cherry-pick metazone changes from CLDR to support tzdata2026c for JDK update releases
JDK-8392138 TestZoneTextPrinterParser.java assertion fails with expected: but was:

Mohamed Issa, Intel

Bug Summary
JDK-8389724 Optimize existing fill stubs for AVX-512 target
JDK-8389967 x86 Code cleanup related to move instructions.

Roman Marchenko, Azul

Bug Summary
JDK-8390868 [Ubuntu 25.10] java/lang/ProcessBuilder/Basic.java, java/lang/ProcessHandle/InfoTest.java fail due to rust-coreutils

Roland Mesde, Amazon

Bug Summary
JDK-8388150 /test/jdk/sun/security/pkcs11/Cipher tests skip without SkippedException
JDK-8390486 3 tests from closed/javax/sound/sampled caused BSOD on win 7 x86
JDK-8386776 [17u] Test test/langtools/jdk/jshell/UndefinedClassTest.java fails on JDK 17 with java.lang.ThreadDeath
JDK-8390327 [17u] test/jdk/java/net/httpclient/lib/jdk/httpclient/test/lib/common/HttpServerAdapters.java fails to compile in Java 17 after JDK-8343855 backport
JDK-8390325 [17u] test/jdk/sun/security/x509/GeneralName/DNSNameTest.java fails to compile in Java 17 after JDK-8381771 backport
JDK-8390489 [21u] java/io/Serializable/records/ProhibitedMethods.java fails after JDK-8307843 backport in othervm mode
JDK-8387781 [macos26] Graphics2D tests fail on new macOS 26
JDK-8390490 [macOS] Window content not updated when rendering to multiple windows
JDK-8391559 [TEST_BUG] java/awt/TextField/CaretPositionTest/CaretPositionTest.java fails in OL-9
JDK-8390079 Add a check for DNS label not to end with a hyphen
JDK-8386362 Add an extra test for JDK-8292755
JDK-8388149 Add EdDSA/XDH/RSASSA-PSS to KeyPairGeneratorBench.java
JDK-8386768 CAInterop.java#buypassclass3ca fails with Intermediate Root CA not found in the chain
JDK-8386763 CAInterop.java#microsoftrsa2017 test fails as EE certificate does not specify OCSP responder
JDK-8390487 ClipIsRunningAfterStop.java failed with "../nptl/pthread_mutex_lock.c:81: __pthread_mutex_lock: Assertion `mutex->__data.__owner == 0' failed."
JDK-8387439 closed test sun/java2d/OpenGL/XORPaint.java is unstable
JDK-8387437 Consistent failure of java/awt/dnd/MissingEventsOnModalDialog/MissingEventsOnModalDialogTest.java
JDK-8387434 containers/docker/TestJcmd.java failed with "RuntimeException: Could not find specified process"
JDK-8387442 Event time in future part 2, now on X
JDK-8387440 Few awt test fail for Solaris 11 with RuntimeException
JDK-8387438 GetMousePositionTest fails with the message "Mouse position should not be null"
JDK-8387783 java/awt/Component/NativeInLightShow/NativeInLightShow.java fails
JDK-8387784 java/awt/List/SingleModeDeselect/SingleModeDeselect.java times out
JDK-8387778 java/awt/Scrollbar/ScrollbarMouseWheelTest/ScrollbarMouseWheelTest.java fails
JDK-8387782 java/awt/TextArea/AutoScrollOnSelectAndAppend/AutoScrollOnSelectAndAppend.java fails on mac10.13
JDK-8387033 java/io/File/GetXSpace.java fails on Windows with CD-ROM drive
JDK-8386751 java/lang/StringBuffer(StringBuilder)/HugeCapacity.java intermittently fails
JDK-8386785 java/lang/StringBuilder/HugeCapacity.java failing with OOME
JDK-8387433 java/util/concurrent/forkjoin/AsyncShutdownNow.java is too slow
JDK-8390488 javax/sound/sampled/Clip/ClipFlushCrash.java timed out
JDK-8387779 javax/swing/JTable/7068740/bug7068740.java fails on Ubunutu 20.04
JDK-8387435 jdk/jfr/event/gc/detailed/TestZAllocationStallEvent.java intermittent OOME
JDK-8385895 jdk/open/test/jdk/sun/security/pkcs11/ rsa, ec, config, secmod and sslecc tests are skipping but showing as pass
JDK-8387038 JitTester: Exclude java.lang.Math.random
JDK-8387777 MemoryPoolMBean/isCollectionUsageThresholdExceeded/isexceeded005 failed with "isCollectionUsageThresholdExceeded() returned true, while threshold = 1 and used = 0"
JDK-8387785 Move NativeDialogToFrontBackTest.java PL test to manual category
JDK-8388494 MultiNST tests need more debugging and timing
JDK-8388856 Problem list automated tests that fail on macOS15
JDK-8387036 Refactor java/net/httpclient/ThrowingPublishers*.java tests to use JUnit5
JDK-8386775 Refactor java/net/httpclient/ThrowingSubscribers*.java tests to use JUnit5
JDK-8386774 Refactor java/nio/channels/AsynchronousSocketChannel test to use JUnit
JDK-8388857 Refactor some jdk/java/net/httpclient/http2 tests to JUnit
JDK-8388153 Regression automated Test 'java/awt/TrayIcon/PopupMenuLeakTest/PopupMenuLeakTest.java' fails
JDK-8388146 Regression automated Test 'javax/swing/JFileChooser/6738668/bug6738668.java' fails
JDK-8391354 Remove LuxTrust Global Root CA
JDK-8390523 SHAKE128 and SHAKE256 MessageDigest algorithms
JDK-8386766 SHAKE256 does not work correctly if n >= 137
JDK-8386358 Some PKCS11Tests are being skipped when they shouldn't
JDK-8385896 Some sound tests failing in CI due to lack of sound key
JDK-8385894 sun/security/krb5/config/native/TestDynamicStore.java ensure that the test is run with sudo
JDK-8386364 sun/security/tools/keytool/i18n.java add an ability to add comment for failures
JDK-8386360 sun/security/tools/keytool/i18n.java user country is current user location instead of the language
JDK-8387037 Test CR6740048.java passes unexpectedly missing CR6740048.xsd
JDK-8388151 Test java/awt/event/KeyEvent/ExtendedKeyCode/ExtendedKeyCodeTest.java failed: Wrong extended key code
JDK-8386363 Test java/awt/Frame/MultiScreenTest.java fails: Window list is empty
JDK-8387443 Test java/awt/im/memoryleak/InputContextMemoryLeakTest.java fails
JDK-8385898 Test java/awt/Modal/ToFront/DialogToFrontModeless1Test.java fails on Linux
JDK-8388147 Test java/awt/Mouse/TitleBarDoubleClick/TitleBarDoubleClick fails on Ubuntu with mouseReleased event after double click on title bar
JDK-8386361 Test java/lang/invoke/TestVHInvokerCaching.java tests nothing
JDK-8385897 Test javax/swing/JFileChooser/4966171/bug4966171.java is failing with OOME
JDK-8388148 Test sun/security/ssl/SSLSessionImpl/ResumeChecksServer.java failed: Existing session was used
JDK-8387436 Test vmTestbase/gc/gctests/WeakReference/weak006/weak006.java fails: Last soft reference has not been cleared
JDK-8386359 test/jdk/sun/security/pkcs11/Provider/ tests skipped without SkippedException
JDK-8386365 TEST_BUG: java/rmi/transport/checkLeaseInfoLeak/CheckLeaseLeak.java failing intermittently
JDK-8385905 TestDynamicStore.java '/manual' disables use of '/timeout'
JDK-8388152 Tests should throw SkippedException when SCTP not supported
JDK-8386767 UnixMultiResolutionSplashTest.java fails intermittently on Ubuntu_24.04
JDK-8390583 Update SignatureUtil.java with the new KnownOIDs
JDK-8388855 Use JUnit in lib-test/jdk tests

srutjay1, IBM

Bug Summary
JDK-8387766 [REDO] Incorrect Interpretation of POSIX TZ Environment Variable on AIX

Satyen Subramaniam, Amazon

Bug Summary
JDK-8388099 gtest/GTestWrapper.java fails on armhf due to LogDecorations.iso8601_utctime_test
JDK-8386991 Insets are incorrectly set in newer Gnome versions

Thomas Stuefe, Red Hat

Bug Summary
JDK-8388395 Path-to-gcroots search should not trigger stack overflows

Timofei Pushkin, Azul

Bug Summary
JDK-8390871 Convert JShell tests to use JUnit instead of TestNG
JDK-8391475 Several JShell tests report JUnit discovery warnings

Varada M, IBM

Bug Summary
JDK-8391001 AlgorithmId should not encode a missing parameters field as NULL unless hardcoded