PUSHES REPORT: 17.0.4

This report shows who pushed the backports to the given release. This usually shows who did the backporting, testing, and review work.

Report generated: Sat Oct 01 01:48:55 CEST 2022

Distribution by priority

Count Priority
9 P2
84 P3
145 P4
2 P5

Distribution by components

Count Component
240 100% Total
117 48.8% hotspot
65 27.1% hotspot/compiler
34 14.2% hotspot/runtime
6 2.5% hotspot/gc
5 2.1% hotspot/jfr
4 1.7% hotspot/jvmti
2 0.8% hotspot/svc
1 0.4% hotspot/test
38 15.8% core-libs
8 3.3% core-libs/java.nio
5 2.1% core-libs/java.net
4 1.7% core-libs/java.io:serialization
3 1.3% core-libs/java.util
3 1.3% core-libs/java.util.regex
3 1.3% core-libs
3 1.3% core-libs/java.util.jar
2 0.8% core-libs/java.io
2 0.8% core-libs/java.lang
1 0.4% core-libs/java.lang.invoke
1 0.4% core-libs/java.lang.module
1 0.4% core-libs/java.text
1 0.4% core-libs/java.time
1 0.4% core-libs/java.util:i18n
25 10.4% client-libs
8 3.3% client-libs/2d
6 2.5% client-libs/java.awt
4 1.7% client-libs/javax.accessibility
3 1.3% client-libs/javax.swing
2 0.8% client-libs/java.awt:i18n
1 0.4% client-libs
1 0.4% client-libs/javax.imageio
21 8.8% infrastructure
20 8.3% infrastructure/build
1 0.4% infrastructure
14 5.8% security-libs
8 3.3% security-libs/java.security
3 1.3% security-libs/javax.xml.crypto
2 0.8% security-libs/org.ietf.jgss
1 0.4% security-libs/javax.crypto
11 4.6% tools
5 2.1% tools
4 1.7% tools/javac
1 0.4% tools/javadoc(tool)
1 0.4% tools/launcher
7 2.9% xml
6 2.5% xml/jaxp
1 0.4% xml/javax.xml.xpath
6 2.5% core-svc
4 1.7% core-svc/debugger
1 0.4% core-svc/javax.management
1 0.4% core-svc
1 0.4% docs
1 0.4% docs/hotspot

Distribution by affiliation

This Release Pushes

Original Pushes

Count Committer
240 100% Total
173 72.1% SAP
76 31.7% Martin Doerr
61 25.4% Goetz Lindenmaier
13 5.4% Christoph Langer
11 4.6% Thomas Stuefe
10 4.2% Matthias Baesken
2 0.8% Richard Reingruber
24 10.0% Red Hat
11 4.6% Aleksey Shipilev
7 2.9% Andrew Leonard
2 0.8% Severin Gehwolf
1 0.4% fzakkak
1 0.4% Jonathan Dowland
1 0.4% Andrew Hughes
1 0.4% Adam Farley
14 5.8% Independent
12 5.0% Zhengyu Gu
1 0.4% Chris Hegarty
1 0.4% Vladimir Kempik
6 2.5% Amazon
6 2.5% Sergey Bylokhov
6 2.5% IBM
4 1.7% Ichiroh Takiguchi
2 0.8% Tyler Steele
4 1.7% @amazon.de
4 1.7% Roman Kennke
4 1.7% BellSoft
2 0.8% Alexandr Scherbatiy
2 0.8% Dmitry Chuyko
4 1.7% Tencent
4 1.7% Jie Fu
2 0.8% Azul
1 0.4% Anton Kozlov
1 0.4% Olga Mikhaltcova
1 0.4% @basilcrow.com
1 0.4% me
1 0.4% DataDog
1 0.4% Jaroslav Bachorík
1 0.4% Oracle
1 0.4% Jim Laskey
Count Committer
239 100% Total
107 44.8% Oracle
7 2.9% Vladimir Ivanov
6 2.5% Weijun Wang
5 2.1% Harold Seigel
4 1.7% Daniel Daugherty
4 1.7% Fernando Guallini
4 1.7% Philip Race
3 1.3% Brian Burkhalter
3 1.3% Joe Wang
3 1.3% Tobias Hartmann
3 1.3% Emanuel Peter
3 1.3% David Holmes
3 1.3% Leonid Mesnik
3 1.3% Igor Ignatyev
3 1.3% Alexey Ivanov
3 1.3% Mandy Chung
2 0.8% Ravi Reddy
2 0.8% Roger Riggs
2 0.8% Dean Long
2 0.8% Thomas Schatzl
2 0.8% Ioi Lam
2 0.8% Igor Veresov
2 0.8% Lance Andersen
2 0.8% Rajan Halade
2 0.8% Coleen Phillimore
2 0.8% Ian Graves
2 0.8% Jaikiran Pai
2 0.8% Jonathan Gibbons
1 0.4% Sibabrata Sahoo
1 0.4% Sean Mullan
1 0.4% Michael McMahon
1 0.4% Yoshiki Sato
1 0.4% Albert Yang
1 0.4% Douglas Simon
1 0.4% Mahendra Chhipa
1 0.4% Jim Laskey
1 0.4% Tobias Holenstein
1 0.4% Daniel Fuchs
1 0.4% Stefan Karlsson
1 0.4% Kevin Walls
1 0.4% Alex Menkov
1 0.4% Rajat Mahajan
1 0.4% Alexander Zuev
1 0.4% Raffaello Giulietti
1 0.4% Paul Sandoz
1 0.4% Magnus Ihse Bursie
1 0.4% Mikhailo Seledtsov
1 0.4% Dmitry Markov
1 0.4% Naoto Sato
1 0.4% Jamil Nimeh
1 0.4% Joe Darcy
1 0.4% Anton Litvinov
1 0.4% Christian Hagedorn
1 0.4% Yumin Qi
37 15.5% Red Hat
16 6.7% Aleksey Shipilev
11 4.6% Roland Westrelin
6 2.5% Andrew Leonard
1 0.4% Andrew Haley
1 0.4% fzakkak
1 0.4% Severin Gehwolf
1 0.4% Adam Farley
32 13.4% SAP
11 4.6% Christoph Langer
9 3.8% Thomas Stuefe
8 3.3% Matthias Baesken
2 0.8% Richard Reingruber
1 0.4% Goetz Lindenmaier
1 0.4% Martin Doerr
17 7.1% Independent
11 4.6% Zhengyu Gu
1 0.4% mag
1 0.4% yifan.tsai
1 0.4% Chris Hegarty
1 0.4% josephtay19
1 0.4% devinrsmith
1 0.4% Quan Anh Mai
7 2.9% IBM
3 1.3% Tyler Steele
2 0.8% Ichiroh Takiguchi
2 0.8% Toshio Nakamura
7 2.9% Tencent
5 2.1% Jie Fu
1 0.4% Peng Xie
1 0.4% casparcwang
6 2.5% Amazon
5 2.1% Sergey Bylokhov
1 0.4% Xin Liu
4 1.7% @amazon.de
4 1.7% Roman Kennke
4 1.7% JetBrains
2 0.8% Artem Semenov
1 0.4% Maxim Kartashev
1 0.4% Aleksandr Veselov
4 1.7% Microdoc
4 1.7% Christoph Göttschkes
2 0.8% ARM
1 0.4% Hao Sun
1 0.4% Pengfei Li
2 0.8% Alibaba
1 0.4% Yi Yang
1 0.4% Joshua Zhu
2 0.8% Fujitsu
1 0.4% Takuya Kiriyama
1 0.4% Masanori Yano
2 0.8% Huawei
2 0.8% Wang Huang
2 0.8% Loongson
1 0.4% Qi Ao
1 0.4% Haomin Wang
1 0.4% Azul
1 0.4% Anton Kozlov
1 0.4% BellSoft
1 0.4% Alexandr Scherbatiy
1 0.4% Intel
1 0.4% Jatin Bhateja
1 0.4% Unknown
1 0.4% N/A

Chronological push log:

Days Ago This Release Push By Original Push By Bug Summary
Name Affiliation Name Affiliation
112 Goetz Lindenmaier SAP Jaikiran Pai Oracle JDK-8288243 (dc) DatagramChannel.disconnect fails with "Invalid argument" on macOS 12.4
114 Goetz Lindenmaier SAP Rajan Halade Oracle JDK-8288030 Distrust.java failed with CertificateExpiredException
115 Christoph Langer SAP Christoph Langer SAP JDK-8287940 javac error on invalid jar should only print filename
119 Christoph Langer SAP Lance Andersen Oracle JDK-8287802 (zipfs) Performance regression related to support for POSIX file permissions
119 Christoph Langer SAP Christoph Langer SAP JDK-8287792 (zipfs) Mention paths with dot elements in ZipException and cleanups
119 Christoph Langer SAP Christoph Langer SAP JDK-8287789 javac errors after JDK-8251329 are not helpful enough to find root cause
120 Christoph Langer SAP Christoph Langer SAP JDK-8287719 GHA: Update cygwin to fix issues in langtools tests on Windows
122 Andrew Leonard Red Hat Andrew Leonard Red Hat JDK-8287564 Reproducible assembly builds without relative linking
123 Andrew Hughes Red Hat Roman Kennke @amazon.de JDK-8287536 Memory leak in invoker_completeInvokeRequest()
123 Andrew Leonard Red Hat Andrew Leonard Red Hat JDK-8287514 Building from different users/workspace is not always deterministic
124 Ichiroh Takiguchi IBM Ichiroh Takiguchi IBM JDK-8287500 FieldAccessWatch testcase failed on AIX platform
124 Ichiroh Takiguchi IBM Ichiroh Takiguchi IBM JDK-8287499 JTable.print() failed with UnsupportedCharsetException on AIX ko_KR locale
124 Christoph Langer SAP Christoph Langer SAP JDK-8287498 GHA: Workflows break on patch versions
126 Andrew Leonard Red Hat Andrew Leonard Red Hat JDK-8287444 jrt-fs.jar not always deterministically built
128 Alexandr Scherbatiy BellSoft Philip Race Oracle JDK-8287322 JNI exception pending in CUPSfuncs.c:250
129 Alexandr Scherbatiy BellSoft Alexandr Scherbatiy BellSoft JDK-8287209 printing to CUPS fails on mac sandbox app
129 Matthias Baesken SAP Rajan Halade Oracle JDK-8287204 Add Distrust.java to ProblemList
130 Adam Farley Red Hat Adam Farley Red Hat JDK-8287184 Mac Aarch: Excessive warnings to be ignored for build jdk
131 Ichiroh Takiguchi IBM Toshio Nakamura IBM JDK-8287127 [macosx] JInternalFrame shadow is not properly drawn
133 Sergey Bylokhov Amazon Sergey Bylokhov Amazon JDK-8287116 Improve test java/io/FileOutputStream/OpenNUL.java
133 Goetz Lindenmaier SAP Fernando Guallini Oracle JDK-8287081 Refactor jdk/security/JavaDotSecurity/ifdefs.sh to plain java test
134 Ichiroh Takiguchi IBM Toshio Nakamura IBM JDK-8287023 [macos] SwingSet2:TableDemo:Printed Japanese characters were garbled
135 Zhengyu Gu Independent Zhengyu Gu Independent JDK-8286958 Don't use memset to initialize members in FileMapInfo and fix memory leak
135 Goetz Lindenmaier SAP Daniel Fuchs Oracle JDK-8286949 Tests ShortResponseBody and ShortResponseBodyWithRetry should use less resources
135 Goetz Lindenmaier SAP josephtay19 Independent JDK-8286947 tests which use CompilationMode shouldn't be run w/ TieredStopAtLevel
135 Goetz Lindenmaier SAP Philip Race Oracle JDK-8286938 Update FreeType to 2.12.0
137 Matthias Baesken SAP Matthias Baesken SAP JDK-8286804 Alpine Linux build fails with busybox tar
137 Matthias Baesken SAP Matthias Baesken SAP JDK-8286803 [linux] improve print_container_info
137 Matthias Baesken SAP Matthias Baesken SAP JDK-8286802 print more interesting env variables in hs_err and VM.info
140 Martin Doerr SAP Magnus Ihse Bursie Oracle JDK-8286738 libharfbuzz optimization level results in extreme build times
141 Thomas Stuefe SAP Thomas Stuefe SAP JDK-8286656 [linux] Fix process-memory information
141 Tyler Steele IBM Tyler Steele IBM JDK-8286652 (fs) Excessive default poll interval in PollingWatchService
141 Richard Reingruber SAP Richard Reingruber SAP JDK-8286632 [PPC64, S390] redundant allocation of MacroAssembler in StubGenerator ctor
141 Richard Reingruber SAP Richard Reingruber SAP JDK-8286631 JDWP deadlocks if some Java thread reaches wait in blockOnDebuggerSuspend
141 me @basilcrow.com David Holmes Oracle JDK-8286629 Improvements related to: Failed to start thread - pthread_create failed (EAGAIN)
141 Olga Mikhaltcova Azul Roger Riggs Oracle JDK-8286626 Incorrect handling of quoted arguments in ProcessBuilder
142 Aleksey Shipilev Red Hat Aleksey Shipilev Red Hat JDK-8286592 C2: Compiler blackhole arguments should be treated as globally escaping
143 Matthias Baesken SAP Matthias Baesken SAP JDK-8286485 serviceability/dcmd/jvmti/AttachFailed/AttachReturnError.java fails on Alpine
144 Goetz Lindenmaier SAP Kevin Walls Oracle JDK-8286415 javax/management/remote/mandatory/connection/DefaultAgentFilterTest.java fails with Port already in use
144 Jie Fu Tencent Jie Fu Tencent JDK-8286406 Incorrect test configurations for compiler/stable/TestStableShort.java
144 Jie Fu Tencent Jie Fu Tencent JDK-8286404 Fix misleading Vector API doc for LSHR operator
144 Jie Fu Tencent Jie Fu Tencent JDK-8286403 runtime/execstack/TestCheckJDK.java fails with zipped debug symbols
147 Christoph Langer SAP Christoph Langer SAP JDK-8285727 [11u, 17u] Unify fix for JDK-8284920 with version from head
147 Christoph Langer SAP Christoph Langer SAP JDK-8285726 [11u, 17u] Unify fix for JDK-8284548 with version from head
147 Martin Doerr SAP Naoto Sato Oracle JDK-8286310 Localized monetary symbols are not reflected in `toLocalizedPattern` return value
147 Tyler Steele IBM Tyler Steele IBM JDK-8286309 Add classpath exemption to globals_vectorApiSupport_***.S.inc
149 Zhengyu Gu Independent Zhengyu Gu Independent JDK-8286150 java.sun.awt.X11GraphicsDevice.getDoubleBufferVisuals() leaks XdbeScreenVisualInfo
149 Zhengyu Gu Independent Zhengyu Gu Independent JDK-8286144 Memory leak in BitSet::BitMapFragmentTable in JFR leak profiler
149 Aleksey Shipilev Red Hat Aleksey Shipilev Red Hat JDK-8286136 JVMTI SetBreakpoint metaspace allocation test
149 Aleksey Shipilev Red Hat Aleksey Shipilev Red Hat JDK-8286135 Compiler blackholes can be eliminated due to stale ciMethod::intrinsic_id()
149 Zhengyu Gu Independent Zhengyu Gu Independent JDK-8286131 JFR: FieldTable leaks FieldInfoTable member
149 Zhengyu Gu Independent Zhengyu Gu Independent JDK-8286127 CodeBuffer may leak _overflow_arena
154 Sergey Bylokhov Amazon Philip Race Oracle JDK-8285948 javax.imageio.IIOException: Unsupported Image Type while processing a valid JPEG image
154 Goetz Lindenmaier SAP Daniel Daugherty Oracle JDK-8285901 ProblemList sun/security/ssl/SSLSessionImpl/NoInvalidateSocketException.java
154 Goetz Lindenmaier SAP Daniel Daugherty Oracle JDK-8285900 ProblemList java/nio/channels/DatagramChannel/ManySourcesAndTargets.java on macosx-aarch64
154 Martin Doerr SAP Sibabrata Sahoo Oracle JDK-8285894 Domain value for system property jdk.https.negotiate.cbt should be case-insensitive
154 Martin Doerr SAP Michael McMahon Oracle JDK-8284766 HTTPS Channel Binding support for Java GSS/Kerberos
155 Jaroslav Bachorík DataDog Takuya Kiriyama Fujitsu JDK-8285864 JfrRecorderService failes with guarantee(num_written > 0) when no space left on device.
155 Matthias Baesken SAP Brian Burkhalter Oracle JDK-8285787 cannot open file "NUL:"
156 Zhengyu Gu Independent Zhengyu Gu Independent JDK-8285757 CodeHeapState::aggregate() leaks blob_name
156 Martin Doerr SAP Raffaello Giulietti Oracle JDK-8285707 Add test to JDK-8273056
156 Martin Doerr SAP Alex Menkov Oracle JDK-8285706 serviceability/jvmti/FieldAccessWatch/FieldAccessWatch.java failed "assert(handle != __null) failed: JNI handle should not be null"
156 Martin Doerr SAP Alexey Ivanov Oracle JDK-8285705 [TESTBUG] In DefaultButtonModelCrashTest.java, frame is accessed from main thread
156 Martin Doerr SAP Dean Long Oracle JDK-8285704 vmTestbase/vm/mlvm/anonloader/stress/oome/heap/Test.java fails with "wrong OOME"
156 Martin Doerr SAP Haomin Wang Loongson JDK-8285703 [TestCase] compiler/inlining/ResolvedClassTest.java will fail when --with-jvm-features=-compiler1
156 Jie Fu Tencent Jie Fu Tencent JDK-8285701 Zero build failure with clang due to values not handled in switch
157 Christoph Langer SAP Christoph Langer SAP JDK-8285652 Update versions of some Github Actions used in JDK workflow
158 Sergey Bylokhov Amazon Sergey Bylokhov Amazon JDK-8285613 Create a new test for JDK-8254790
158 Martin Doerr SAP Hao Sun ARM JDK-8285587 [TESTBUG] ReturnBlobToWrongHeapTest.java fails with -XX:TieredStopAtLevel=1 on machines with many cores
158 Martin Doerr SAP Alexey Ivanov Oracle JDK-8285586 Replace polling with waiting in javax/swing/text/html/parser/Parser/8078268/bug8078268.java
158 Zhengyu Gu Independent Zhengyu Gu Independent JDK-8285584 Leak XVisualInfo in getAllConfigs in awt_GraphicsEnv.c
168 Anton Kozlov Azul Anton Kozlov Azul JDK-8285557 Incorrect Token type causes XPath expression to return incorrect results
170 Thomas Stuefe SAP David Holmes Oracle JDK-8284817 Launching java with "-Xlog:gc*=trace,safepoint*=trace,class*=trace" crashes the JVM
171 Martin Doerr SAP Weijun Wang Oracle JDK-8284736 SPNEGO has not passed channel binding info into the underlying mechanism
172 Christoph Langer SAP Christoph Langer SAP JDK-8284684 GHA: Only check test results if testing was not skipped
172 Christoph Langer SAP Christoph Langer SAP JDK-8284603 [17u] Update Boot JDK used in GHA to 17.0.2
172 Christoph Langer SAP Christoph Langer SAP JDK-8284682 Improve stability of GHA Pre-submit testing by caching cygwin installer
172 Goetz Lindenmaier SAP Weijun Wang Oracle JDK-8284652 Remove test/jdk/sun/security/ec/ECDSAJavaVerify.java
174 Zhengyu Gu Independent Zhengyu Gu Independent JDK-8284627 Leak FcObjectSet in getFontConfigLocations() in fontpath.c
175 Martin Doerr SAP Vladimir Ivanov Oracle JDK-8284594 CI: Constant pool entries in error state are not supported
175 Christoph Langer SAP Joe Wang Oracle JDK-8285556 Invalid XPath expression causes StringIndexOutOfBoundsException
176 Martin Doerr SAP Roger Riggs Oracle JDK-8284523 Remove java/lang/RuntimeTests/exec/ExecWithDir as unnecessary
176 Martin Doerr SAP Tobias Hartmann Oracle JDK-8284522 TestFailedAllocationBadGraph fails with -XX:TieredStopAtLevel < 4
176 Severin Gehwolf Red Hat Severin Gehwolf Red Hat JDK-8284513 [Testbug] Improve TestGetSwapSpaceSize
176 Matthias Baesken SAP Matthias Baesken SAP JDK-8283347 [macos] Bad JNI lookup accessibilityHitTest is shown when Screen magnifier is enabled
178 Martin Doerr SAP Roland Westrelin Red Hat JDK-8284340 C2: loop candidate for superword not always unrolled fully if superword fails
178 Martin Doerr SAP Aleksey Shipilev Red Hat JDK-8284337 Test failures on non-DTrace builds due to incomplete DTrace* flags handling
178 Thomas Stuefe SAP Thomas Stuefe SAP JDK-8284325 gtest os.release_multi_mappings_vm is racy
178 Thomas Stuefe SAP Thomas Stuefe SAP JDK-8284324 Rename ADLC classes which have the same name as hotspot variants
178 Thomas Stuefe SAP Thomas Stuefe SAP JDK-8284323 Report glibc malloc tunables in error reports
180 Sergey Bylokhov Amazon Sergey Bylokhov Amazon JDK-8284222 Incorrect size of the pixel storage is used by the robot on macOS
181 Zhengyu Gu Independent Zhengyu Gu Independent JDK-8284218 Potential memory leak in sun.util.locale.provider.HostLocaleProviderAdapterImpl.getNumberPattern() on Windows
181 Zhengyu Gu Independent Zhengyu Gu Independent JDK-8284215 Potential memory leak in sun.font.FontConfigManager.getFontConfig()
182 Thomas Stuefe SAP Thomas Stuefe SAP JDK-8284176 [windows] print TMP and TEMP in hs_err and VM.info
182 Thomas Stuefe SAP Thomas Stuefe SAP JDK-8284174 CompressedClassPointers.java fails on ppc with 'Narrow klass shift: 0' missing
182 Thomas Stuefe SAP Thomas Stuefe SAP JDK-8284173 Remove unnecessary operator new and delete from ObjectMonitor
182 Thomas Stuefe SAP Thomas Stuefe SAP JDK-8284172 os::print_memory_mappings() prints segment preceeding the inclusion range
182 Thomas Stuefe SAP Thomas Stuefe SAP JDK-8284171 DCmdArgument::parse_value() should handle NULL input
182 Martin Doerr SAP Mahendra Chhipa Oracle JDK-8284158 Remove dependancy of TestHttpServer, HttpTransaction, HttpCallback from open/test/jdk/sun/net/www/protocol/http/ tests
182 Martin Doerr SAP Vladimir Ivanov Oracle JDK-8284157 Avoid repeated upcalls into Java to re-resolve MH/VH linkers/invokers
182 Martin Doerr SAP Emanuel Peter Oracle JDK-8284156 C2: assert(addp->is_AddP() && addp->outcnt() > 0) failed: Don't process dead nodes
182 Martin Doerr SAP Ioi Lam Oracle JDK-8284155 Large value for CompileThresholdScaling causes assert
182 Martin Doerr SAP Roland Westrelin Red Hat JDK-8284154 C2: assert(_base == Long) failed: Not a Long
182 Martin Doerr SAP Tobias Hartmann Oracle JDK-8284152 Unmappable character for US-ASCII encoding in TestPredicateInputBelowLoopPredicate
182 Martin Doerr SAP Roland Westrelin Red Hat JDK-8284151 C2: assert(false) failed: graph should be schedulable
182 Martin Doerr SAP Roland Westrelin Red Hat JDK-8284150 assert(_base == Tuple) failed: Not a Tuple after JDK-8280799
182 Martin Doerr SAP Roland Westrelin Red Hat JDK-8284147 С2: assert(false) failed: cyclic dependency prevents range check elimination
182 Martin Doerr SAP Jamil Nimeh Oracle JDK-8284145 Minor corrections to evbroadcasti32x4 intrinsic on x86
183 Sergey Bylokhov Amazon Alexander Zuev Oracle JDK-8284106 [macos] custom JCheckBox and JRadioBox with custom icon set: focus is still displayed after unchecking
183 Martin Doerr SAP Coleen Phillimore Oracle JDK-8284099 appcds/*/MethodHandlesAsCollectorTest.java tests time out because of excessive GC (CodeCache GC Threshold) in loom
183 Martin Doerr SAP Joshua Zhu Alibaba JDK-8284098 Bad performance on gather/scatter API caused by different IntSpecies of indexMap
183 Martin Doerr SAP Vladimir Ivanov Oracle JDK-8284097 MethodHandle::linkToNative stub is missing w/ -Xint
183 Martin Doerr SAP Roland Westrelin Red Hat JDK-8284096 When loop strip mining fails, safepoints are removed from loop anyway
183 Martin Doerr SAP Andrew Haley Red Hat JDK-8284095 x86-32: runtime call to SharedRuntime::ldiv corrupts registers
183 Martin Doerr SAP Fernando Guallini Oracle JDK-8284084 Missing coverage for certain classes in com.sun.org.apache.xml.internal.security
183 Martin Doerr SAP Brian Burkhalter Oracle JDK-8284083 java/nio/file/Files/InterruptCopy.java fails with java.lang.RuntimeException: Copy was not interrupted
183 Martin Doerr SAP Yi Yang Alibaba JDK-8284082 Suboptimal code generation around Preconditions.checkIndex intrinsic with AVX2
183 Martin Doerr SAP Pengfei Li ARM JDK-8284081 Fix a C2 crash when filling arrays with unsafe
183 Martin Doerr SAP Aleksey Shipilev Red Hat JDK-8284079 CompileBroker::log_metaspace_failure is called from non-Java/compiler threads
183 Martin Doerr SAP Aleksey Shipilev Red Hat JDK-8284078 Cpuid1Ecx feature parsing is incorrect for AMD CPUs
184 Martin Doerr SAP Roland Westrelin Red Hat JDK-8283949 C2: assert(!had_error) failed: bad dominance
184 Martin Doerr SAP Dean Long Oracle JDK-8283948 Crash during deoptimization with "assert(bb->is_reachable()) failed: getting result from unreachable basicblock" with -XX:+VerifyStack
184 Martin Doerr SAP Philip Race Oracle JDK-8283947 [Linux aarch64] : drawImage dithers TYPE_BYTE_INDEXED images incorrectly
184 Martin Doerr SAP Sergey Bylokhov Amazon JDK-8283946 Some tests may fail when executed with other locales than the US
184 Martin Doerr SAP Tobias Holenstein Oracle JDK-8283945 Assert "missing inlining msg" with -XX:+PrintIntrinsics
184 Martin Doerr SAP Leonid Mesnik Oracle JDK-8283944 vmTestbase/nsk/jvmti/SuspendThread/suspendthrd003/TestDescription.java failed with "agent_tools.cpp, 471: (foundThread = (jthread) jni_env->NewGlobalRef(foundThread)) != NULL"
184 Martin Doerr SAP Roland Westrelin Red Hat JDK-8283943 [REDO] C2 crash when allocating array of size too large
184 Martin Doerr SAP Emanuel Peter Oracle JDK-8283942 assert(VM_Version::supports_avx512bw()) failed for Tests jdk/incubator/vector/
184 Martin Doerr SAP Yoshiki Sato Oracle JDK-8283941 (tz) Update Timezone Data to 2022a
184 Martin Doerr SAP Igor Veresov Oracle JDK-8283940 C1: assert(false) failed: live_in set of first block must be empty
184 Martin Doerr SAP Peng Xie Tencent JDK-8283939 java/util/regex/NegativeArraySize.java failed after JDK-8271302
184 Martin Doerr SAP Ian Graves Oracle JDK-8283938 Regex Test Refresh
185 Severin Gehwolf Red Hat devinrsmith Independent JDK-8283852 Properly initialize L32X64MixRandom state
185 Martin Doerr SAP Ravi Reddy Oracle JDK-8283848 Infinite loop in DeflaterOutputStream.finish()
185 Martin Doerr SAP Leonid Mesnik Oracle JDK-8283847 Crash in java_lang_invoke_MethodType::print_signature
185 Martin Doerr SAP Weijun Wang Oracle JDK-8283845 ShortECDSA.java test is not complete
186 Matthias Baesken SAP Matthias Baesken SAP JDK-8283753 UNIX sun/font coding misses SUSE distro detection on recent distro SUSE 15
189 Roman Kennke @amazon.de Roman Kennke @amazon.de JDK-8283682 Refactor subclassAudits to use ClassValue
189 Roman Kennke @amazon.de Aleksey Shipilev Red Hat JDK-8283679 Retry loop issues in java.io.ClassCache
189 Roman Kennke @amazon.de Roman Kennke @amazon.de JDK-8283678 ObjectStreamClass caches keep ClassLoaders alive
190 Goetz Lindenmaier SAP Weijun Wang Oracle JDK-8283637 Update Public Suffix List to 3c213aa
190 Chris Hegarty Independent Chris Hegarty Independent JDK-8283613 Module finder incorrectly assumes default file system path-separator character
191 fzakkak Red Hat fzakkak Red Hat JDK-8283554 [JVMCI] MetaUtil.toInternalName() doesn't handle hidden classes correctly
191 Martin Doerr SAP Artem Semenov JetBrains JDK-8283553 NSAccessibilityPressAction action for tree node and NSAccessibilityShowMenuAcgtion action not working
191 Matthias Baesken SAP Matthias Baesken SAP JDK-8283549 handle latest VS2022 in abstract_vm_version
191 Matthias Baesken SAP Matthias Baesken SAP JDK-8283548 deal with ActiveProcessorCount in os::Linux::print_container_info
191 Thomas Stuefe SAP Ioi Lam Oracle JDK-8283545 Update the "java" and "jcmd" tool specification for CDS
192 Jonathan Dowland Red Hat Ravi Reddy Oracle JDK-8283522 Infinite loop in ZipOutputStream.close()
192 Goetz Lindenmaier SAP Joe Wang Oracle JDK-8283521 Update BCEL md to include the copyright notice
192 Goetz Lindenmaier SAP Anton Litvinov Oracle JDK-8283505 Unable to click JCheckBox in JTable through Java Access Bridge
192 Goetz Lindenmaier SAP Rajat Mahajan Oracle JDK-8283504 Robot.mouseMove moves cursor to incorrect location when display scale varies and Java runs in DPI Unaware mode
192 Goetz Lindenmaier SAP Coleen Phillimore Oracle JDK-8283503 SymbolPropertyEntry::set_method_type fails with assert
192 Goetz Lindenmaier SAP David Holmes Oracle JDK-8283502 Upgrading from 8 to 11 no longer accepts '/' as filepath separator in gc paths
192 Goetz Lindenmaier SAP Maxim Kartashev JetBrains JDK-8283501 Windows builds in different directories are not fully reproducible
192 Goetz Lindenmaier SAP Alexey Ivanov Oracle JDK-8283499 Invalid value set to CANDIDATEFORM structure
192 Goetz Lindenmaier SAP Artem Semenov JetBrains JDK-8283491 Re-examine copyright headers on files in src/java.desktop/macosx/native/libawt_lwawt/awt/a11y
193 Zhengyu Gu Independent Brian Burkhalter Oracle JDK-8283472 java/nio/file/Files/InterruptCopy.java fails with java.lang.RuntimeException: Copy was not interrupted
194 Goetz Lindenmaier SAP Weijun Wang Oracle JDK-8283433 [sspi] gss_accept_sec_context leaves output_token uninitialized
194 Goetz Lindenmaier SAP Aleksandr Veselov JetBrains JDK-8283431 Access Bridge: Wrong frame position and hit test result on HiDPI display
194 Goetz Lindenmaier SAP Sergey Bylokhov Amazon JDK-8283429 ZipException: zip END header not found at ZipFile#Source.findEND
196 Goetz Lindenmaier SAP Sean Mullan Oracle JDK-8283369 Correct signer logic for jars signed with multiple digest algorithms
196 Goetz Lindenmaier SAP Aleksey Shipilev Red Hat JDK-8283359 gc/TestSystemGC.java large pages subtest fails with ZGC
197 Vladimir Kempik Independent Daniel Daugherty Oracle JDK-8283342 [macOS] : hotspot arm64 bug exposed by latest clang
197 Goetz Lindenmaier SAP N/A Unknown JDK-8283552 XPathFactoryImpl remove setProperty and getProperty methods
197 Goetz Lindenmaier SAP Harold Seigel Oracle JDK-8283309 runtime/8176717/TestInheritFD.java timed out
197 Goetz Lindenmaier SAP Douglas Simon Oracle JDK-8283308 [JVMCI] exception in HotSpotJVMCIRuntime.translate can exit the VM
197 Goetz Lindenmaier SAP Weijun Wang Oracle JDK-8283305 org.jcp.xml.dsig.internal.dom.Utils.parseIdFromSameDocumentURI throws StringIndexOutOfBoundsException when calling substring method
197 Goetz Lindenmaier SAP Lance Andersen Oracle JDK-8283304 tools/jar/JarEntryTime.java fails with modified time mismatch
197 Goetz Lindenmaier SAP Mandy Chung Oracle JDK-8283303 jdeps does not report some exceptions correctly
197 Goetz Lindenmaier SAP Mandy Chung Oracle JDK-8283302 Data race in jdeps VersionHelper
197 Goetz Lindenmaier SAP Mandy Chung Oracle JDK-8283301 jdeps --multi-release --print-module-deps fails if module-info.class in different versioned directories
197 Goetz Lindenmaier SAP Harold Seigel Oracle JDK-8283299 Test vmTestbase/nsk/sysdict/vm/stress/btree/btree011/btree011.java crashes with memory exhaustion on Windows
197 Sergey Bylokhov Amazon Dmitry Markov Oracle JDK-8283295 Drag And Drop hangs on Windows
198 Andrew Leonard Red Hat Andrew Leonard Red Hat JDK-8283261 Alpine Linux fails to build when --with-source-date enabled
198 Aleksey Shipilev Red Hat Jie Fu Tencent JDK-8283252 jfr/event/allocation tests fail with release VMs after JDK-8281318 due to lack of -XX:+UnlockDiagnosticVMOptions
198 Aleksey Shipilev Red Hat Aleksey Shipilev Red Hat JDK-8283251 Improve jfr/event/allocation tests reliability
198 Aleksey Shipilev Red Hat Aleksey Shipilev Red Hat JDK-8283250 Arraycopy stress tests
199 Zhengyu Gu Independent Zhengyu Gu Independent JDK-8283207 Deadlock caused by jdwp agent
199 Andrew Leonard Red Hat Andrew Leonard Red Hat JDK-8283182 Enable OpenJDK build support for reproducible jars and jmods using --date
199 Martin Doerr SAP Emanuel Peter Oracle JDK-8283171 C2: assert(f <= 1 && f >= 0) failed: Incorrect frequency
199 Aleksey Shipilev Red Hat Aleksey Shipilev Red Hat JDK-8283165 GHA: Workflows break with update release versions
199 Goetz Lindenmaier SAP Daniel Daugherty Oracle JDK-8283159 UT: MonitorUsedDeflationThresholdTest failed: did not find too_many string in output
199 Goetz Lindenmaier SAP Jonathan Gibbons Oracle JDK-8283158 Convert JavadocTester to use NIO
199 Goetz Lindenmaier SAP Igor Ignatyev Oracle JDK-8283157 some hotspot runtime/logging tests don't check exit code
200 Goetz Lindenmaier SAP Stefan Karlsson Oracle JDK-8283108 TestSystemGC uses "require vm.gc.G1" for large pages subtest
200 Goetz Lindenmaier SAP Mikhailo Seledtsov Oracle JDK-8283107 Rename anonymous loader tests to hidden loader tests
200 Aleksey Shipilev Red Hat Aleksey Shipilev Red Hat JDK-8283096 Micro-optimize VarForm.getMemberName for interpreter
203 Aleksey Shipilev Red Hat Aleksey Shipilev Red Hat JDK-8283040 x86: AVX2 versions of vpxor should be asserted
203 Aleksey Shipilev Red Hat Aleksey Shipilev Red Hat JDK-8283038 Provide configure hints for Alpine/apk package managers
203 Goetz Lindenmaier SAP Joe Wang Oracle JDK-8283036 XSLT compiler tries to define a class with empty name
203 Goetz Lindenmaier SAP Harold Seigel Oracle JDK-8283035 hotspot/runtime/SelectionResolution test errors
203 Goetz Lindenmaier SAP Brian Burkhalter Oracle JDK-8283034 (se) Remove java/nio/channels/Selector/Wakeup.java from ProblemList (win)
203 Goetz Lindenmaier SAP Harold Seigel Oracle JDK-8283033 vmTestbase/nsk/sysdict/vm/stress/btree/btree010/btree010.java fails with ClassNotFoundException: nsk.sysdict.share.BTree0LLRLRLRRLR
203 Goetz Lindenmaier SAP Jaikiran Pai Oracle JDK-8283032 java/io/Serializable/serialFilter/GlobalFilterTest.java#id1 failed in timeout
203 Goetz Lindenmaier SAP Joe Darcy Oracle JDK-8283031 ReportOnImportedModuleAnnotation.java fails on rerun
203 Goetz Lindenmaier SAP Qi Ao Loongson JDK-8283030 sun/net/ftp/TestFtpTimeValue.java timed out on slow machines
203 Goetz Lindenmaier SAP Jonathan Gibbons Oracle JDK-8283027 Minor cleanup for ToolBox
203 Goetz Lindenmaier SAP Masanori Yano Fujitsu JDK-8283025 some tests in jdk/tools/launcher/ fails on localized Windows platform
203 Martin Doerr SAP Tyler Steele IBM JDK-8283024 [exploded image] ResolvedClassTest fails with similar output
204 Aleksey Shipilev Red Hat Aleksey Shipilev Red Hat JDK-8282977 GHA: Allow one concurrent run per PR only
204 Goetz Lindenmaier SAP Fernando Guallini Oracle JDK-8282973 [TESTBUG] Case 2 in TestP11KeyFactoryGetRSAKeySpec is skipped
204 Goetz Lindenmaier SAP Christoph Göttschkes Microdoc JDK-8282972 Disable Fibonacci test on memory constrained systems
204 Martin Doerr SAP Vladimir Ivanov Oracle JDK-8282970 C1: No inlining through invokedynamic and invokestatic call sites when resolved class is not linked
204 Goetz Lindenmaier SAP Igor Ignatyev Oracle JDK-8282969 runtime/logging/LoaderConstraintsTest.java doesn't build test.Empty
204 Goetz Lindenmaier SAP Igor Ignatyev Oracle JDK-8282967 runtime/EnclosingMethodAttr/EnclMethodAttr.java doesn't check exit code
204 Goetz Lindenmaier SAP Ian Graves Oracle JDK-8282965 Misplaced caret in PatternSyntaxException's detail message
204 Goetz Lindenmaier SAP Leonid Mesnik Oracle JDK-8282964 [TESTBUG] Fix initialization in NonbranchyTree
204 Goetz Lindenmaier SAP Fernando Guallini Oracle JDK-8282963 test/jdk/javax/net/ssl/compatibility/JdkInfo incorrect verification of protocol and cipher support
204 Goetz Lindenmaier SAP Harold Seigel Oracle JDK-8282962 fix typos in test TestSigParse.java
204 Goetz Lindenmaier SAP Albert Yang Oracle JDK-8282961 Incorrect log decorators in gc/g1/plab/TestPLABEvacuationFailure.java
204 Goetz Lindenmaier SAP Yumin Qi Oracle JDK-8282960 SharedArchiveConsistency.java should test -Xshare:auto as well
204 Goetz Lindenmaier SAP Christoph Göttschkes Microdoc JDK-8282957 TestDifferentProtectionDomains runs into timeout in client VM
204 Goetz Lindenmaier SAP Thomas Schatzl Oracle JDK-8282956 gc/g1/mixedgc/TestOldGenCollectionUsage.java assumes that GCs take 1ms minimum
204 Goetz Lindenmaier SAP Thomas Schatzl Oracle JDK-8282955 jdk/jfr/event/gc/detailed/TestEvacuationFailedEvent.java uses wrong mechanism to cause evacuation failure
205 Andrew Leonard Red Hat mag Independent JDK-8282889 Reproducible copyright headers
205 Andrew Leonard Red Hat Andrew Leonard Red Hat JDK-8282888 MakeZipReproducible ZipEntry timestamps not localized to UTC
205 Martin Doerr SAP Christoph Göttschkes Microdoc JDK-8282865 TestRangeCheckEliminated fails because methods are not compiled
205 Martin Doerr SAP Christoph Göttschkes Microdoc JDK-8282864 Multiple tier1 tests in hotspot/jtreg/compiler are failing for client VMs
206 Martin Doerr SAP Quan Anh Mai Independent JDK-8282822 compiler/vectorapi/reshape/TestVectorCastAVX1.java crashes in assembler
206 Martin Doerr SAP Vladimir Ivanov Oracle JDK-8282821 [vector] assert(payload->is_object()) failed: expected 'object' value for scalar-replaced boxed vector but got: NULL
206 Martin Doerr SAP Roland Westrelin Red Hat JDK-8282820 two microbenchmarks tests fail "assert(!jvms->method()->has_exception_handlers()) failed: no exception handler expected" after JDK-8275638
206 Martin Doerr SAP Roland Westrelin Red Hat JDK-8282818 GraphKit::combine_exception_states fails with "matching stack sizes" assert
206 Jim Laskey Oracle Jim Laskey Oracle JDK-8282817 java.util.random does not correctly sample exponential or Gaussian distributions
206 Roman Kennke @amazon.de Roman Kennke @amazon.de JDK-8282808 Memory leak in invoker.c fillInvokeRequest() during JDI operations
207 Martin Doerr SAP Igor Veresov Oracle JDK-8282741 vectorapi tests failing with assert(!vbox->is_Phi()) failed
207 Martin Doerr SAP Jatin Bhateja Intel JDK-8282736 Incorrect behavior of FloatVector.withLane on x86
207 Martin Doerr SAP Paul Sandoz Oracle JDK-8282735 [vectorapi] Remove test run script
207 Martin Doerr SAP Vladimir Ivanov Oracle JDK-8282734 C2: Receiver downcast is missing when inlining through method handle linkers
207 Martin Doerr SAP Vladimir Ivanov Oracle JDK-8282733 C2: Infinite loop in CMoveINode::Ideal during IGVN
207 Martin Doerr SAP Aleksey Shipilev Red Hat JDK-8282732 Platform.isTieredSupported should handle the no-compiler case
210 Dmitry Chuyko BellSoft Wang Huang Huawei JDK-8282654 AArch64: generate_compare_long_string_same_encoding and LARGE_LOOP_PREFETCH alignment
210 Martin Doerr SAP Tobias Hartmann Oracle JDK-8282647 Method linking fails with guarantee(mh->adapter() != NULL) failed: Adapter blob must already exist!
210 Martin Doerr SAP Christian Hagedorn Oracle JDK-8282646 C2: assert(is_Loop()) failed: invalid node class: Region
210 Martin Doerr SAP yifan.tsai Independent JDK-8282645 Compilation logging crashes for thread suspension / debugging tests
211 Dmitry Chuyko BellSoft Wang Huang Huawei JDK-8282634 Aarch64: Use Ldp in intrinsics for String.compareTo
211 Martin Doerr SAP casparcwang Tencent JDK-8282597 C2: assert(stride_con != 0) failed: missed some peephole opt
211 Martin Doerr SAP Roland Westrelin Red Hat JDK-8282596 Incorrect type for IV phi of long counted loops after CCP
211 Martin Doerr SAP Xin Liu Amazon JDK-8282595 C1 optimizes the invocation of private interface methods
211 Martin Doerr SAP Martin Doerr SAP JDK-8282594 Intrinsify recursive ObjectMonitor locking for PPC64
212 Goetz Lindenmaier SAP Goetz Lindenmaier SAP JDK-8282499 Bump update version for OpenJDK: jdk-17.0.4

No changesets log

Committer push log

Adam Farley, Red Hat

Bug Summary
JDK-8287184 Mac Aarch: Excessive warnings to be ignored for build jdk

Anton Kozlov, Azul

Bug Summary
JDK-8285557 Incorrect Token type causes XPath expression to return incorrect results

Andrew Leonard, Red Hat

Bug Summary
JDK-8283261 Alpine Linux fails to build when --with-source-date enabled
JDK-8287514 Building from different users/workspace is not always deterministic
JDK-8283182 Enable OpenJDK build support for reproducible jars and jmods using --date
JDK-8287444 jrt-fs.jar not always deterministically built
JDK-8282888 MakeZipReproducible ZipEntry timestamps not localized to UTC
JDK-8287564 Reproducible assembly builds without relative linking
JDK-8282889 Reproducible copyright headers

Alexandr Scherbatiy, BellSoft

Bug Summary
JDK-8287322 JNI exception pending in CUPSfuncs.c:250
JDK-8287209 printing to CUPS fails on mac sandbox app

Andrew Hughes, Red Hat

Bug Summary
JDK-8287536 Memory leak in invoker_completeInvokeRequest()

Chris Hegarty, Independent

Bug Summary
JDK-8283613 Module finder incorrectly assumes default file system path-separator character

Christoph Langer, SAP

Bug Summary
JDK-8287792 (zipfs) Mention paths with dot elements in ZipException and cleanups
JDK-8287802 (zipfs) Performance regression related to support for POSIX file permissions
JDK-8285726 [11u, 17u] Unify fix for JDK-8284548 with version from head
JDK-8285727 [11u, 17u] Unify fix for JDK-8284920 with version from head
JDK-8284603 [17u] Update Boot JDK used in GHA to 17.0.2
JDK-8284684 GHA: Only check test results if testing was not skipped
JDK-8287719 GHA: Update cygwin to fix issues in langtools tests on Windows
JDK-8287498 GHA: Workflows break on patch versions
JDK-8284682 Improve stability of GHA Pre-submit testing by caching cygwin installer
JDK-8285556 Invalid XPath expression causes StringIndexOutOfBoundsException
JDK-8287940 javac error on invalid jar should only print filename
JDK-8287789 javac errors after JDK-8251329 are not helpful enough to find root cause
JDK-8285652 Update versions of some Github Actions used in JDK workflow

Dmitry Chuyko, BellSoft

Bug Summary
JDK-8282654 AArch64: generate_compare_long_string_same_encoding and LARGE_LOOP_PREFETCH alignment
JDK-8282634 Aarch64: Use Ldp in intrinsics for String.compareTo

fzakkak, Red Hat

Bug Summary
JDK-8283554 [JVMCI] MetaUtil.toInternalName() doesn't handle hidden classes correctly

Goetz Lindenmaier, SAP

Bug Summary
JDK-8288243 (dc) DatagramChannel.disconnect fails with "Invalid argument" on macOS 12.4
JDK-8283034 (se) Remove java/nio/channels/Selector/Wakeup.java from ProblemList (win)
JDK-8283308 [JVMCI] exception in HotSpotJVMCIRuntime.translate can exit the VM
JDK-8283433 [sspi] gss_accept_sec_context leaves output_token uninitialized
JDK-8282973 [TESTBUG] Case 2 in TestP11KeyFactoryGetRSAKeySpec is skipped
JDK-8282964 [TESTBUG] Fix initialization in NonbranchyTree
JDK-8283431 Access Bridge: Wrong frame position and hit test result on HiDPI display
JDK-8282499 Bump update version for OpenJDK: jdk-17.0.4
JDK-8283158 Convert JavadocTester to use NIO
JDK-8283369 Correct signer logic for jars signed with multiple digest algorithms
JDK-8283302 Data race in jdeps VersionHelper
JDK-8282972 Disable Fibonacci test on memory constrained systems
JDK-8288030 Distrust.java failed with CertificateExpiredException
JDK-8282962 fix typos in test TestSigParse.java
JDK-8282956 gc/g1/mixedgc/TestOldGenCollectionUsage.java assumes that GCs take 1ms minimum
JDK-8283359 gc/TestSystemGC.java large pages subtest fails with ZGC
JDK-8283035 hotspot/runtime/SelectionResolution test errors
JDK-8282961 Incorrect log decorators in gc/g1/plab/TestPLABEvacuationFailure.java
JDK-8283499 Invalid value set to CANDIDATEFORM structure
JDK-8283032 java/io/Serializable/serialFilter/GlobalFilterTest.java#id1 failed in timeout
JDK-8286415 javax/management/remote/mandatory/connection/DefaultAgentFilterTest.java fails with Port already in use
JDK-8283301 jdeps --multi-release --print-module-deps fails if module-info.class in different versioned directories
JDK-8283303 jdeps does not report some exceptions correctly
JDK-8282955 jdk/jfr/event/gc/detailed/TestEvacuationFailedEvent.java uses wrong mechanism to cause evacuation failure
JDK-8283027 Minor cleanup for ToolBox
JDK-8282965 Misplaced caret in PatternSyntaxException's detail message
JDK-8283305 org.jcp.xml.dsig.internal.dom.Utils.parseIdFromSameDocumentURI throws StringIndexOutOfBoundsException when calling substring method
JDK-8285900 ProblemList java/nio/channels/DatagramChannel/ManySourcesAndTargets.java on macosx-aarch64
JDK-8285901 ProblemList sun/security/ssl/SSLSessionImpl/NoInvalidateSocketException.java
JDK-8283491 Re-examine copyright headers on files in src/java.desktop/macosx/native/libawt_lwawt/awt/a11y
JDK-8287081 Refactor jdk/security/JavaDotSecurity/ifdefs.sh to plain java test
JDK-8284652 Remove test/jdk/sun/security/ec/ECDSAJavaVerify.java
JDK-8283107 Rename anonymous loader tests to hidden loader tests
JDK-8283031 ReportOnImportedModuleAnnotation.java fails on rerun
JDK-8283504 Robot.mouseMove moves cursor to incorrect location when display scale varies and Java runs in DPI Unaware mode
JDK-8283309 runtime/8176717/TestInheritFD.java timed out
JDK-8282967 runtime/EnclosingMethodAttr/EnclMethodAttr.java doesn't check exit code
JDK-8282969 runtime/logging/LoaderConstraintsTest.java doesn't build test.Empty
JDK-8282960 SharedArchiveConsistency.java should test -Xshare:auto as well
JDK-8283157 some hotspot runtime/logging tests don't check exit code
JDK-8283025 some tests in jdk/tools/launcher/ fails on localized Windows platform
JDK-8283030 sun/net/ftp/TestFtpTimeValue.java timed out on slow machines
JDK-8283503 SymbolPropertyEntry::set_method_type fails with assert
JDK-8283299 Test vmTestbase/nsk/sysdict/vm/stress/btree/btree011/btree011.java crashes with memory exhaustion on Windows
JDK-8282963 test/jdk/javax/net/ssl/compatibility/JdkInfo incorrect verification of protocol and cipher support
JDK-8282957 TestDifferentProtectionDomains runs into timeout in client VM
JDK-8286949 Tests ShortResponseBody and ShortResponseBodyWithRetry should use less resources
JDK-8286947 tests which use CompilationMode shouldn't be run w/ TieredStopAtLevel
JDK-8283108 TestSystemGC uses "require vm.gc.G1" for large pages subtest
JDK-8283304 tools/jar/JarEntryTime.java fails with modified time mismatch
JDK-8283505 Unable to click JCheckBox in JTable through Java Access Bridge
JDK-8283521 Update BCEL md to include the copyright notice
JDK-8286938 Update FreeType to 2.12.0
JDK-8283637 Update Public Suffix List to 3c213aa
JDK-8283502 Upgrading from 8 to 11 no longer accepts '/' as filepath separator in gc paths
JDK-8283159 UT: MonitorUsedDeflationThresholdTest failed: did not find too_many string in output
JDK-8283033 vmTestbase/nsk/sysdict/vm/stress/btree/btree010/btree010.java fails with ClassNotFoundException: nsk.sysdict.share.BTree0LLRLRLRRLR
JDK-8283501 Windows builds in different directories are not fully reproducible
JDK-8283552 XPathFactoryImpl remove setProperty and getProperty methods
JDK-8283036 XSLT compiler tries to define a class with empty name
JDK-8283429 ZipException: zip END header not found at ZipFile#Source.findEND

Ichiroh Takiguchi, IBM

Bug Summary
JDK-8287023 [macos] SwingSet2:TableDemo:Printed Japanese characters were garbled
JDK-8287127 [macosx] JInternalFrame shadow is not properly drawn
JDK-8287500 FieldAccessWatch testcase failed on AIX platform
JDK-8287499 JTable.print() failed with UnsupportedCharsetException on AIX ko_KR locale

Jaroslav Bachorík, DataDog

Bug Summary
JDK-8285864 JfrRecorderService failes with guarantee(num_written > 0) when no space left on device.

Jonathan Dowland, Red Hat

Bug Summary
JDK-8283522 Infinite loop in ZipOutputStream.close()

Jie Fu, Tencent

Bug Summary
JDK-8286404 Fix misleading Vector API doc for LSHR operator
JDK-8286406 Incorrect test configurations for compiler/stable/TestStableShort.java
JDK-8286403 runtime/execstack/TestCheckJDK.java fails with zipped debug symbols
JDK-8285701 Zero build failure with clang due to values not handled in switch

Jim Laskey, Oracle

Bug Summary
JDK-8282817 java.util.random does not correctly sample exponential or Gaussian distributions

Matthias Baesken, SAP

Bug Summary
JDK-8286803 [linux] improve print_container_info
JDK-8283347 [macos] Bad JNI lookup accessibilityHitTest is shown when Screen magnifier is enabled
JDK-8287204 Add Distrust.java to ProblemList
JDK-8286804 Alpine Linux build fails with busybox tar
JDK-8285787 cannot open file "NUL:"
JDK-8283548 deal with ActiveProcessorCount in os::Linux::print_container_info
JDK-8283549 handle latest VS2022 in abstract_vm_version
JDK-8286802 print more interesting env variables in hs_err and VM.info
JDK-8286485 serviceability/dcmd/jvmti/AttachFailed/AttachReturnError.java fails on Alpine
JDK-8283753 UNIX sun/font coding misses SUSE distro detection on recent distro SUSE 15

Martin Doerr, SAP

Bug Summary
JDK-8283941 (tz) Update Timezone Data to 2022a
JDK-8283024 [exploded image] ResolvedClassTest fails with similar output
JDK-8283947 [Linux aarch64] : drawImage dithers TYPE_BYTE_INDEXED images incorrectly
JDK-8283943 [REDO] C2 crash when allocating array of size too large
JDK-8285705 [TESTBUG] In DefaultButtonModelCrashTest.java, frame is accessed from main thread
JDK-8285587 [TESTBUG] ReturnBlobToWrongHeapTest.java fails with -XX:TieredStopAtLevel=1 on machines with many cores
JDK-8285703 [TestCase] compiler/inlining/ResolvedClassTest.java will fail when --with-jvm-features=-compiler1
JDK-8282821 [vector] assert(payload->is_object()) failed: expected 'object' value for scalar-replaced boxed vector but got: NULL
JDK-8282735 [vectorapi] Remove test run script
JDK-8285707 Add test to JDK-8273056
JDK-8284099 appcds/*/MethodHandlesAsCollectorTest.java tests time out because of excessive GC (CodeCache GC Threshold) in loom
JDK-8283945 Assert "missing inlining msg" with -XX:+PrintIntrinsics
JDK-8284150 assert(_base == Tuple) failed: Not a Tuple after JDK-8280799
JDK-8283942 assert(VM_Version::supports_avx512bw()) failed for Tests jdk/incubator/vector/
JDK-8284157 Avoid repeated upcalls into Java to re-resolve MH/VH linkers/invokers
JDK-8284098 Bad performance on gather/scatter API caused by different IntSpecies of indexMap
JDK-8282595 C1 optimizes the invocation of private interface methods
JDK-8283940 C1: assert(false) failed: live_in set of first block must be empty
JDK-8282970 C1: No inlining through invokedynamic and invokestatic call sites when resolved class is not linked
JDK-8283949 C2: assert(!had_error) failed: bad dominance
JDK-8284154 C2: assert(_base == Long) failed: Not a Long
JDK-8284156 C2: assert(addp->is_AddP() && addp->outcnt() > 0) failed: Don't process dead nodes
JDK-8283171 C2: assert(f <= 1 && f >= 0) failed: Incorrect frequency
JDK-8284151 C2: assert(false) failed: graph should be schedulable
JDK-8282646 C2: assert(is_Loop()) failed: invalid node class: Region
JDK-8282597 C2: assert(stride_con != 0) failed: missed some peephole opt
JDK-8282733 C2: Infinite loop in CMoveINode::Ideal during IGVN
JDK-8284340 C2: loop candidate for superword not always unrolled fully if superword fails
JDK-8282734 C2: Receiver downcast is missing when inlining through method handle linkers
JDK-8284594 CI: Constant pool entries in error state are not supported
JDK-8282645 Compilation logging crashes for thread suspension / debugging tests
JDK-8284079 CompileBroker::log_metaspace_failure is called from non-Java/compiler threads
JDK-8282822 compiler/vectorapi/reshape/TestVectorCastAVX1.java crashes in assembler
JDK-8284078 Cpuid1Ecx feature parsing is incorrect for AMD CPUs
JDK-8283948 Crash during deoptimization with "assert(bb->is_reachable()) failed: getting result from unreachable basicblock" with -XX:+VerifyStack
JDK-8283847 Crash in java_lang_invoke_MethodType::print_signature
JDK-8285894 Domain value for system property jdk.https.negotiate.cbt should be case-insensitive
JDK-8284081 Fix a C2 crash when filling arrays with unsafe
JDK-8282818 GraphKit::combine_exception_states fails with "matching stack sizes" assert
JDK-8284766 HTTPS Channel Binding support for Java GSS/Kerberos
JDK-8282736 Incorrect behavior of FloatVector.withLane on x86
JDK-8282596 Incorrect type for IV phi of long counted loops after CCP
JDK-8283848 Infinite loop in DeflaterOutputStream.finish()
JDK-8282594 Intrinsify recursive ObjectMonitor locking for PPC64
JDK-8284083 java/nio/file/Files/InterruptCopy.java fails with java.lang.RuntimeException: Copy was not interrupted
JDK-8283939 java/util/regex/NegativeArraySize.java failed after JDK-8271302
JDK-8284155 Large value for CompileThresholdScaling causes assert
JDK-8286738 libharfbuzz optimization level results in extreme build times
JDK-8286310 Localized monetary symbols are not reflected in `toLocalizedPattern` return value
JDK-8282647 Method linking fails with guarantee(mh->adapter() != NULL) failed: Adapter blob must already exist!
JDK-8284097 MethodHandle::linkToNative stub is missing w/ -Xint
JDK-8284145 Minor corrections to evbroadcasti32x4 intrinsic on x86
JDK-8284084 Missing coverage for certain classes in com.sun.org.apache.xml.internal.security
JDK-8282864 Multiple tier1 tests in hotspot/jtreg/compiler are failing for client VMs
JDK-8283553 NSAccessibilityPressAction action for tree node and NSAccessibilityShowMenuAcgtion action not working
JDK-8282732 Platform.isTieredSupported should handle the no-compiler case
JDK-8283938 Regex Test Refresh
JDK-8284158 Remove dependancy of TestHttpServer, HttpTransaction, HttpCallback from open/test/jdk/sun/net/www/protocol/http/ tests
JDK-8284523 Remove java/lang/RuntimeTests/exec/ExecWithDir as unnecessary
JDK-8285586 Replace polling with waiting in javax/swing/text/html/parser/Parser/8078268/bug8078268.java
JDK-8285706 serviceability/jvmti/FieldAccessWatch/FieldAccessWatch.java failed "assert(handle != __null) failed: JNI handle should not be null"
JDK-8283845 ShortECDSA.java test is not complete
JDK-8283946 Some tests may fail when executed with other locales than the US
JDK-8284736 SPNEGO has not passed channel binding info into the underlying mechanism
JDK-8284082 Suboptimal code generation around Preconditions.checkIndex intrinsic with AVX2
JDK-8284337 Test failures on non-DTrace builds due to incomplete DTrace* flags handling
JDK-8284522 TestFailedAllocationBadGraph fails with -XX:TieredStopAtLevel < 4
JDK-8282865 TestRangeCheckEliminated fails because methods are not compiled
JDK-8282820 two microbenchmarks tests fail "assert(!jvms->method()->has_exception_handlers()) failed: no exception handler expected" after JDK-8275638
JDK-8284152 Unmappable character for US-ASCII encoding in TestPredicateInputBelowLoopPredicate
JDK-8282741 vectorapi tests failing with assert(!vbox->is_Phi()) failed
JDK-8283944 vmTestbase/nsk/jvmti/SuspendThread/suspendthrd003/TestDescription.java failed with "agent_tools.cpp, 471: (foundThread = (jthread) jni_env->NewGlobalRef(foundThread)) != NULL"
JDK-8285704 vmTestbase/vm/mlvm/anonloader/stress/oome/heap/Test.java fails with "wrong OOME"
JDK-8284096 When loop strip mining fails, safepoints are removed from loop anyway
JDK-8284095 x86-32: runtime call to SharedRuntime::ldiv corrupts registers
JDK-8284147 С2: assert(false) failed: cyclic dependency prevents range check elimination

me, @basilcrow.com

Bug Summary
JDK-8286629 Improvements related to: Failed to start thread - pthread_create failed (EAGAIN)

Olga Mikhaltcova, Azul

Bug Summary
JDK-8286626 Incorrect handling of quoted arguments in ProcessBuilder

Roman Kennke, @amazon.de

Bug Summary
JDK-8282808 Memory leak in invoker.c fillInvokeRequest() during JDI operations
JDK-8283678 ObjectStreamClass caches keep ClassLoaders alive
JDK-8283682 Refactor subclassAudits to use ClassValue
JDK-8283679 Retry loop issues in java.io.ClassCache

Richard Reingruber, SAP

Bug Summary
JDK-8286632 [PPC64, S390] redundant allocation of MacroAssembler in StubGenerator ctor
JDK-8286631 JDWP deadlocks if some Java thread reaches wait in blockOnDebuggerSuspend

Sergey Bylokhov, Amazon

Bug Summary
JDK-8284106 [macos] custom JCheckBox and JRadioBox with custom icon set: focus is still displayed after unchecking
JDK-8285613 Create a new test for JDK-8254790
JDK-8283295 Drag And Drop hangs on Windows
JDK-8287116 Improve test java/io/FileOutputStream/OpenNUL.java
JDK-8284222 Incorrect size of the pixel storage is used by the robot on macOS
JDK-8285948 javax.imageio.IIOException: Unsupported Image Type while processing a valid JPEG image

Severin Gehwolf, Red Hat

Bug Summary
JDK-8284513 [Testbug] Improve TestGetSwapSpaceSize
JDK-8283852 Properly initialize L32X64MixRandom state

Aleksey Shipilev, Red Hat

Bug Summary
JDK-8283250 Arraycopy stress tests
JDK-8286592 C2: Compiler blackhole arguments should be treated as globally escaping
JDK-8286135 Compiler blackholes can be eliminated due to stale ciMethod::intrinsic_id()
JDK-8282977 GHA: Allow one concurrent run per PR only
JDK-8283165 GHA: Workflows break with update release versions
JDK-8283251 Improve jfr/event/allocation tests reliability
JDK-8283252 jfr/event/allocation tests fail with release VMs after JDK-8281318 due to lack of -XX:+UnlockDiagnosticVMOptions
JDK-8286136 JVMTI SetBreakpoint metaspace allocation test
JDK-8283096 Micro-optimize VarForm.getMemberName for interpreter
JDK-8283038 Provide configure hints for Alpine/apk package managers
JDK-8283040 x86: AVX2 versions of vpxor should be asserted

Thomas Stuefe, SAP

Bug Summary
JDK-8286656 [linux] Fix process-memory information
JDK-8284176 [windows] print TMP and TEMP in hs_err and VM.info
JDK-8284174 CompressedClassPointers.java fails on ppc with 'Narrow klass shift: 0' missing
JDK-8284171 DCmdArgument::parse_value() should handle NULL input
JDK-8284325 gtest os.release_multi_mappings_vm is racy
JDK-8284817 Launching java with "-Xlog:gc*=trace,safepoint*=trace,class*=trace" crashes the JVM
JDK-8284172 os::print_memory_mappings() prints segment preceeding the inclusion range
JDK-8284173 Remove unnecessary operator new and delete from ObjectMonitor
JDK-8284324 Rename ADLC classes which have the same name as hotspot variants
JDK-8284323 Report glibc malloc tunables in error reports
JDK-8283545 Update the "java" and "jcmd" tool specification for CDS

Tyler Steele, IBM

Bug Summary
JDK-8286652 (fs) Excessive default poll interval in PollingWatchService

Tyler Steele, IBM

Bug Summary
JDK-8286309 Add classpath exemption to globals_vectorApiSupport_***.S.inc

Vladimir Kempik, Independent

Bug Summary
JDK-8283342 [macOS] : hotspot arm64 bug exposed by latest clang

Zhengyu Gu, Independent

Bug Summary
JDK-8286127 CodeBuffer may leak _overflow_arena
JDK-8285757 CodeHeapState::aggregate() leaks blob_name
JDK-8283207 Deadlock caused by jdwp agent
JDK-8286958 Don't use memset to initialize members in FileMapInfo and fix memory leak
JDK-8286150 java.sun.awt.X11GraphicsDevice.getDoubleBufferVisuals() leaks XdbeScreenVisualInfo
JDK-8283472 java/nio/file/Files/InterruptCopy.java fails with java.lang.RuntimeException: Copy was not interrupted
JDK-8286131 JFR: FieldTable leaks FieldInfoTable member
JDK-8284627 Leak FcObjectSet in getFontConfigLocations() in fontpath.c
JDK-8285584 Leak XVisualInfo in getAllConfigs in awt_GraphicsEnv.c
JDK-8286144 Memory leak in BitSet::BitMapFragmentTable in JFR leak profiler
JDK-8284215 Potential memory leak in sun.font.FontConfigManager.getFontConfig()
JDK-8284218 Potential memory leak in sun.util.locale.provider.HostLocaleProviderAdapterImpl.getNumberPattern() on Windows