PUSHES REPORT: 17.0.5

This report shows who pushed the backports to the given release. This usually shows who did the backporting, testing, and review work.

Report generated: Thu Dec 01 04:40:35 CET 2022

Distribution by priority

Count Priority
2 P1
16 P2
82 P3
121 P4
4 P5

Distribution by components

Count Component
225 100% Total
72 32.0% hotspot
39 17.3% hotspot/compiler
18 8.0% hotspot/runtime
6 2.7% hotspot/jfr
4 1.8% hotspot/gc
2 0.9% hotspot/svc
1 0.4% hotspot/jvmti
1 0.4% hotspot/svc-agent
1 0.4% hotspot
61 27.1% client-libs
21 9.3% client-libs/javax.swing
11 4.9% client-libs/java.awt
11 4.9% client-libs/javax.accessibility
9 4.0% client-libs/2d
8 3.6% client-libs
1 0.4% client-libs/javax.imageio
28 12.4% core-libs
6 2.7% core-libs/java.util:i18n
5 2.2% core-libs/java.nio
4 1.8% core-libs/java.util
4 1.8% core-libs
2 0.9% core-libs/java.lang
1 0.4% core-libs/java.net
1 0.4% core-libs/java.rmi
1 0.4% core-libs/java.lang:class_loading
1 0.4% core-libs/java.text
1 0.4% core-libs/java.time
1 0.4% core-libs/javax.naming
1 0.4% core-libs/java.util.jar
24 10.7% tools
17 7.6% tools/jpackage
2 0.9% tools/javac
2 0.9% tools/javadoc(tool)
2 0.9% tools
1 0.4% tools/jlink
17 7.6% infrastructure
13 5.8% infrastructure/build
2 0.9% infrastructure/release_eng
2 0.9% infrastructure
15 6.7% security-libs
5 2.2% security-libs/java.security
3 1.3% security-libs/javax.net.ssl
2 0.9% security-libs/javax.crypto
2 0.9% security-libs
1 0.4% security-libs/javax.smartcardio
1 0.4% security-libs/jdk.security
1 0.4% security-libs/javax.crypto:pkcs11
5 2.2% xml
3 1.3% xml/jaxp
1 0.4% xml
1 0.4% xml/javax.xml.xpath
3 1.3% core-svc
2 0.9% core-svc/java.lang.management
1 0.4% core-svc

Distribution by affiliation

This Release Pushes

Original Pushes

Count Committer
225 100% Total
168 74.7% SAP
135 60.0% Goetz Lindenmaier
13 5.8% Matthias Baesken
10 4.4% Christoph Langer
4 1.8% Johannes Bechberger
3 1.3% Martin Doerr
2 0.9% Thomas Stuefe
1 0.4% Richard Reingruber
16 7.1% Red Hat
7 3.1% Severin Gehwolf
2 0.9% Aleksey Shipilev
2 0.9% Jonathan Dowland
2 0.9% Andrew Hughes
1 0.4% Andrew Leonard
1 0.4% Jiří Vaněk
1 0.4% Roland Westrelin
15 6.7% Independent
9 4.0% georgeadams1995
2 0.9% Zhengyu Gu
2 0.9% Vladimir Kempik
1 0.4% Guoxiong Li
1 0.4% Martijn Verburg
13 5.8% Amazon
6 2.7% Sergey Bylokhov
4 1.8% Joshua Cao
2 0.9% David Alvarez
1 0.4% Dan Lutker
6 2.7% Azul
2 0.9% jkratochvil
2 0.9% Alexey Pavlyutkin
1 0.4% Ekaterina Vergizova
1 0.4% Olga Mikhaltcova
2 0.9% DataDog
2 0.9% Jaroslav Bachorík
2 0.9% IBM
2 0.9% Shruthi.Shruthi1
2 0.9% Tencent
2 0.9% Peng Xie
1 0.4% Microsoft
1 0.4% Stephanie Crater
Count Committer
225 100% Total
148 65.8% Oracle
21 9.3% Manukumar V S
10 4.4% Srinivas Mandalika
8 3.6% Magnus Ihse Bursie
8 3.6% Alexey Semenyuk
5 2.2% Dean Long
5 2.2% Daniel Jelinski
5 2.2% Alexander Matveev
4 1.8% Roberto Castaneda Lozano
4 1.8% Tobias Hartmann
4 1.8% Alexander Zuev
4 1.8% Lawrence Andrews
4 1.8% Ioi Lam
4 1.8% Naoto Sato
4 1.8% Philip Race
3 1.3% Michael McMahon
3 1.3% Yoshiki Sato
3 1.3% Joe Wang
3 1.3% Alexander Zvegintsev
3 1.3% Emanuel Peter
3 1.3% Erik Gahlin
3 1.3% Joe Darcy
3 1.3% Andy Herrick
2 0.9% Sean Mullan
2 0.9% Jayathirth D V
2 0.9% Hannes Wallnoefer
2 0.9% Vladimir Kozlov
2 0.9% Jaikiran Pai
2 0.9% Christian Hagedorn
1 0.4% Weijun Wang
1 0.4% Brian Burkhalter
1 0.4% Ludvig Janiuk
1 0.4% Leo Korinth
1 0.4% Valerie Peng
1 0.4% Tobias Holenstein
1 0.4% Robert Mckenna
1 0.4% Fairoz Matte
1 0.4% Alex Menkov
1 0.4% Erik Joelsson
1 0.4% Raffaello Giulietti
1 0.4% Tom Rodriguez
1 0.4% Chris Plummer
1 0.4% Leonid Mesnik
1 0.4% Igor Veresov
1 0.4% Lance Andersen
1 0.4% Prasanta Sadhukhan
1 0.4% Rajan Halade
1 0.4% Coleen Phillimore
1 0.4% Ivan Walulya
1 0.4% Mikael Vidstedt
1 0.4% Vladimir Ivanov
31 13.8% SAP
11 4.9% Matthias Baesken
6 2.7% Christoph Langer
4 1.8% Thomas Stuefe
3 1.3% Goetz Lindenmaier
3 1.3% Martin Doerr
3 1.3% Johannes Bechberger
1 0.4% Richard Reingruber
18 8.0% Red Hat
5 2.2% Aleksey Shipilev
4 1.8% Severin Gehwolf
3 1.3% Andrew Haley
3 1.3% Roland Westrelin
1 0.4% Andrew Leonard
1 0.4% Andrew Hughes
1 0.4% Zdenek Zambersky
9 4.0% Independent
2 0.9% Zhengyu Gu
2 0.9% 87324768+lawrence-andrew
1 0.4% mag
1 0.4% georgeadams1995
1 0.4% 54955201+macarte
1 0.4% Vladimir Kempik
1 0.4% Guoxiong Li
4 1.8% Amazon
3 1.3% Sergey Bylokhov
1 0.4% Dan Lutker
4 1.8% JetBrains
1 0.4% Anton Tarasov
1 0.4% Artem Semenov
1 0.4% Maxim Kartashev
1 0.4% Aleksandr Veselov
4 1.8% Tencent
2 0.9% Peng Xie
1 0.4% tobytbzhang
1 0.4% Jie Fu
2 0.9% IBM
2 0.9% Shruthi.Shruthi1
2 0.9% Unknown
2 0.9% N/A
1 0.4% Azul
1 0.4% Olga Mikhaltcova
1 0.4% DataDog
1 0.4% Jaroslav Bachorík
1 0.4% Huawei
1 0.4% Dongbo He

Chronological push log:

Days Ago This Release Push By Original Push By Bug Summary
Name Affiliation Name Affiliation
51 Christoph Langer SAP Christoph Langer SAP JDK-8295056 [17u] Remove designator DEFAULT_PROMOTED_VERSION_PRE=ea for release 17.0.5
69 David Alvarez Amazon Yoshiki Sato Oracle JDK-8294260 (tz) Update Timezone Data to 2022c
75 Goetz Lindenmaier SAP Sean Mullan Oracle JDK-8293909 jarsigner prints invalid digest/signature algorithm warnings if keysize is weak/disabled
76 David Alvarez Amazon Yoshiki Sato Oracle JDK-8293880 Add legacy tz tests to OpenJDK
91 Matthias Baesken SAP Matthias Baesken SAP JDK-8293155 remove os::print_statistics()
92 Andrew Hughes Red Hat Zdenek Zambersky Red Hat JDK-8293144 P11TlsKeyMaterialGenerator should work with ChaCha20-Poly1305
92 Ekaterina Vergizova Azul Erik Gahlin Oracle JDK-8293133 JFR: Disable TestDevNull.java on Windows
96 Severin Gehwolf Red Hat Severin Gehwolf Red Hat JDK-8292962 [TESTBUG] TestMemoryAwareness.java fails on cgroups v2 and crun
99 Joshua Cao Amazon Daniel Jelinski Oracle JDK-8292776 javax/net/ssl/ServerName/SSLEngineExplorerMatchedSNI.java failed intermittently due to SSLException: Tag mismatch
99 Joshua Cao Amazon Daniel Jelinski Oracle JDK-8292775 Tests fail with SSLProtocolException: Input record too big
99 Peng Xie Tencent Peng Xie Tencent JDK-8292767 CgroupV1 detection code should consider memory.swappiness
99 Alexey Pavlyutkin Azul tobytbzhang Tencent JDK-8292759 ZGC: fastdebug build crashes when printing ClassLoaderData
100 Martijn Verburg Independent 54955201+macarte Independent JDK-8292747 It is not possible to read local computer certificates with the SunMSCAPI provider
103 Jiří Vaněk Red Hat Erik Gahlin Oracle JDK-8292651 JFR: Dump on shutdown live-locks in some conditions
104 Joshua Cao Amazon Jie Fu Tencent JDK-8292644 compiler/loopopts/TestOverUnrolling2.java fails with release VMs
105 Joshua Cao Amazon Fairoz Matte Oracle JDK-8292571 compiler/loopopts/TestSkeletonPredicateNegation.java times out with -XX:TieredStopAtLevel < 4
105 Roland Westrelin Red Hat Roland Westrelin Red Hat JDK-8292540 Apache Lucene triggers: DEBUG MESSAGE: duplicated predicate failed which is impossible
105 Matthias Baesken SAP Matthias Baesken SAP JDK-8292529 unify _WIN32_WINNT settings
105 Matthias Baesken SAP Matthias Baesken SAP JDK-8292528 unify os::message_box across posix platforms
105 Matthias Baesken SAP Aleksey Shipilev Red Hat JDK-8292527 Build failures with GCC 11, Alpine 3 due to incompatible casts from nullptr
106 Peng Xie Tencent Peng Xie Tencent JDK-8292514 GetContainerCpuLoad does not return the correct result in share mode
106 Severin Gehwolf Red Hat Vladimir Kozlov Oracle JDK-8292470 [BACKOUT] JDK-8279219: [REDO] C2 crash when allocating array of size too large
110 Severin Gehwolf Red Hat Severin Gehwolf Red Hat JDK-8292469 Bump update version for OpenJDK: jdk-17.0.4.1
114 Andrew Leonard Red Hat Andrew Leonard Red Hat JDK-8292032 MacOS debug symbol files not always deterministic in reproducible builds
115 Goetz Lindenmaier SAP Naoto Sato Oracle JDK-8292020 ISO 4217 Amendment 172 Update
116 Goetz Lindenmaier SAP Naoto Sato Oracle JDK-8292013 ISO 4217 Amendment 171 Update
118 Christoph Langer SAP Michael McMahon Oracle JDK-8291900 Enable Unix domain sockets in Windows Selector notification mechanism
119 Goetz Lindenmaier SAP Srinivas Mandalika Oracle JDK-8291838 Create an automated test for JDK-4702199
119 Goetz Lindenmaier SAP Srinivas Mandalika Oracle JDK-8291837 Create an automated test for JDK-4170173
119 Goetz Lindenmaier SAP Lawrence Andrews Oracle JDK-8291835 Fix java/awt/print/PrinterJob/ImagePrinting/PrintARGBImage.java manual test
119 Shruthi.Shruthi1 IBM Shruthi.Shruthi1 IBM JDK-8291834 Issue in Initialization of keys in ErrorMsg.java and XPATHErrorResources.java
119 Goetz Lindenmaier SAP Goetz Lindenmaier SAP JDK-8291595 [17u] Delete files missed in backport of 8269039
119 Goetz Lindenmaier SAP Manukumar V S Oracle JDK-8291833 Create an automated regression test for RFE-4390885
119 Goetz Lindenmaier SAP Philip Race Oracle JDK-8291787 [TESTBUG] Regression test java/awt/Graphics2D/DrawString/LCDTextSrcEa.java has issues
119 Goetz Lindenmaier SAP Lawrence Andrews Oracle JDK-8291783 Create a manual test framework class
119 Goetz Lindenmaier SAP Lawrence Andrews Oracle JDK-8291782 Fix PrintLatinCJKTest.java test that is failing with Parse Exception
119 Goetz Lindenmaier SAP Srinivas Mandalika Oracle JDK-8291780 Create a test for JDK-4670319
120 Goetz Lindenmaier SAP Manukumar V S Oracle JDK-8291682 Create a regression test for RFE 4287690
120 Goetz Lindenmaier SAP Srinivas Mandalika Oracle JDK-8291677 Create a test for JDK-4529616
120 Goetz Lindenmaier SAP Manukumar V S Oracle JDK-8291674 Write a regression test for CCC4400728
120 Goetz Lindenmaier SAP Manukumar V S Oracle JDK-8291673 Create an automated regression test for JDK-4525475
121 Goetz Lindenmaier SAP Andrew Haley Red Hat JDK-8291621 AArch64: CMN should be handled the same way as CMP
121 Goetz Lindenmaier SAP Srinivas Mandalika Oracle JDK-8291617 Create a test for JDK-4715496
121 Goetz Lindenmaier SAP Manukumar V S Oracle JDK-8291616 Create an automated regression test for RFE 4231298
121 Goetz Lindenmaier SAP Manukumar V S Oracle JDK-8291614 Create a regression test for the JTree usecase of JDK-4618767
121 Goetz Lindenmaier SAP Manukumar V S Oracle JDK-8291613 Create a regression test for JRootPane.setDefaultButton() method
121 Goetz Lindenmaier SAP Chris Plummer Oracle JDK-8291611 sun/tools/jhsdb/JShellHeapDumpTest.java fails with RuntimeException 'JShellToolProvider' missing from stdout/stderr
121 Goetz Lindenmaier SAP Jayathirth D V Oracle JDK-8291609 [TESTBUG] Use color tolerance only for XRender in BlitRotateClippedArea test
121 Goetz Lindenmaier SAP Coleen Phillimore Oracle JDK-8291607 misc tests failed with "NoClassDefFoundError: Could not initialize class java.util.concurrent.ThreadLocalRandom"
121 Goetz Lindenmaier SAP Lawrence Andrews Oracle JDK-8291604 Error: Not a test or directory containing tests: java/awt/print/PrinterJob/XparColor.java
124 jkratochvil Azul Ioi Lam Oracle JDK-8291547 CDS cannot archive lamda proxy with useImplMethodHandle
125 Goetz Lindenmaier SAP Philip Race Oracle JDK-8291489 Update FreeType to 2.12.1
125 Goetz Lindenmaier SAP Vladimir Kozlov Oracle JDK-8291488 test fails "assert(init != __null) failed: initialization not found"
125 Goetz Lindenmaier SAP N/A Unknown JDK-8291487 Trampoline not created for far runtime targets outside small CodeCache
125 Goetz Lindenmaier SAP Tobias Hartmann Oracle JDK-8291486 Unreachable loop is not removed from C2 IR, leading to a broken graph
125 Goetz Lindenmaier SAP Alexey Semenyuk Oracle JDK-8291485 jpackage does not work if class file has `$$` in the name on windows
125 Goetz Lindenmaier SAP 87324768+lawrence-andrew Independent JDK-8291484 Enhance PassFailJFrame
125 Goetz Lindenmaier SAP 87324768+lawrence-andrew Independent JDK-8291483 Remove jtreg tag manual=yesno for java/awt/print/PrinterJob/PrintGlyphVectorTest.java and fix test
125 Goetz Lindenmaier SAP Mikael Vidstedt Oracle JDK-8291482 Update Visual Studio 2022 to version 17.1.0 for Oracle builds on Windows
125 Goetz Lindenmaier SAP Naoto Sato Oracle JDK-8291480 The NumberFormat for locale sq_XK formats price incorrectly.
126 Andrew Hughes Red Hat Andrew Hughes Red Hat JDK-8283911 DEFAULT_PROMOTED_VERSION_PRE not reset to 'ea' for jdk-17.0.4
126 Dan Lutker Amazon Dan Lutker Amazon JDK-8291335 bug in GIFImageReader
127 Goetz Lindenmaier SAP Manukumar V S Oracle JDK-8291030 Write a regression test for JDK-4164779
127 Richard Reingruber SAP Richard Reingruber SAP JDK-8291015 C1: LIR_OpVisitState::maxNumberOfOperands too small
128 Goetz Lindenmaier SAP Philip Race Oracle JDK-8290952 Update HarfBuzz to 4.4.1
128 Goetz Lindenmaier SAP Alexander Zuev Oracle JDK-8290950 java Robot API did the 'm' keypress and caused /awt/event/KeyEvent/KeyCharTest/KeyCharTest.html is timing out on macOS 12
128 Goetz Lindenmaier SAP Alexey Semenyuk Oracle JDK-8290948 jpackage'd launcher reports non-zero exit codes with error prompt
128 Goetz Lindenmaier SAP Srinivas Mandalika Oracle JDK-8290946 Create a test or JDK-4715503
128 Goetz Lindenmaier SAP Manukumar V S Oracle JDK-8290944 Create a regression test for JDK-4330998
128 Goetz Lindenmaier SAP Manukumar V S Oracle JDK-8290941 Create a regression test for JDK-4532513
128 Goetz Lindenmaier SAP Manukumar V S Oracle JDK-8290939 Create a regression test for JDK-4518432
128 Goetz Lindenmaier SAP Alexander Zuev Oracle JDK-8290937 NoResizeEventOnDMChangeTest.java fails because FS Window didn't receive all resizes!
128 Goetz Lindenmaier SAP Alexander Zvegintsev Oracle JDK-8290935 [TEST_BUG] java/awt/event/MouseEvent/SpuriousExitEnter/SpuriousExitEnter_3.java fails in jdk6u14 & jdk7
128 Goetz Lindenmaier SAP Alexander Zuev Oracle JDK-8290932 [TESTBUG] javax/swing/JPopupMenu/4634626/bug4634626.java sometimes failed on mac
128 Goetz Lindenmaier SAP Jayathirth D V Oracle JDK-8290931 [XRender] the BlitRotateClippedArea test fails on Linux in the XR pipeline
128 Goetz Lindenmaier SAP Tom Rodriguez Oracle JDK-8290930 [JVMCI] Add API for reading and writing JVMCI thread locals
130 Goetz Lindenmaier SAP Alexander Matveev Oracle JDK-8290905 [REDO] Quarantined jpackage apps are labeled as "damaged"
131 Goetz Lindenmaier SAP Alexey Semenyuk Oracle JDK-8290891 Assorted enhancements to jpackage testing framework
131 Goetz Lindenmaier SAP Alexander Matveev Oracle JDK-8290890 [macos] tools/jpackage tests timeout due to /usr/bin/osascript
132 Goetz Lindenmaier SAP Ludvig Janiuk Oracle JDK-8290805 Deadlock in leakprofiler::emit_events during shutdown
132 Goetz Lindenmaier SAP Joe Wang Oracle JDK-8290804 Improve XSLT XPath operators count efficiency
132 Goetz Lindenmaier SAP Alexander Matveev Oracle JDK-8290803 [macos] Multiple jpackage tests fail/timeout on same host
132 Goetz Lindenmaier SAP Alexander Matveev Oracle JDK-8290802 [macos]: App bundle cannot upload to Mac App Store due to info.plist embedded in java exe
132 Goetz Lindenmaier SAP Manukumar V S Oracle JDK-8290800 Create a regression test for checking the 'Space' key activation of focused Button
132 Goetz Lindenmaier SAP Manukumar V S Oracle JDK-8290799 Create a regression test for JDK-4618767
132 Goetz Lindenmaier SAP Manukumar V S Oracle JDK-8290798 Create a regression test for JDK-4514331
132 Goetz Lindenmaier SAP Manukumar V S Oracle JDK-8290797 Create a regression test for JDK-4670051
132 Goetz Lindenmaier SAP Aleksey Shipilev Red Hat JDK-8290794 jdk.jpackage/share/native/applauncher/JvmLauncher.cpp fails to build with GCC 6.3.0
132 Goetz Lindenmaier SAP Alexey Semenyuk Oracle JDK-8290792 Debian packaging doesn't work
132 Goetz Lindenmaier SAP Andy Herrick Oracle JDK-8290788 [macos]: Error when signing the additional launcher
132 Goetz Lindenmaier SAP Andy Herrick Oracle JDK-8290785 Windows product version issue
132 georgeadams1995 Independent georgeadams1995 Independent JDK-8290777 Bump macOS GitHub actions to macOS 11
134 Alexey Pavlyutkin Azul Michael McMahon Oracle JDK-8290526 Temporarily disable Unix domain sockets in Windows PipeImpl
134 Goetz Lindenmaier SAP Joe Wang Oracle JDK-8290508 Update Xerces2 Java to Version 2.12.2
134 Goetz Lindenmaier SAP Alexey Semenyuk Oracle JDK-8290507 Conflicting jpackage static library name
134 Goetz Lindenmaier SAP Alexey Semenyuk Oracle JDK-8290506 Failing jpackage tests with fastdebug/release build
135 Shruthi.Shruthi1 IBM Shruthi.Shruthi1 IBM JDK-8290470 Duplicate XML keys in XPATHErrorResources.java and XSLTErrorResources.java
135 georgeadams1995 Independent Magnus Ihse Bursie Oracle JDK-8290457 Restore cancel-in-progress in GHA
135 Goetz Lindenmaier SAP Artem Semenov JetBrains JDK-8290443 Menu items with submenus in JPopupMenu are not spoken on macOS
135 Goetz Lindenmaier SAP Alexander Matveev Oracle JDK-8290439 Missing ')' in MacResources.properties
135 Goetz Lindenmaier SAP Alexey Semenyuk Oracle JDK-8290437 jpackage --type rpm produces an error: Invalid or unsupported type: [null]
135 Goetz Lindenmaier SAP Andy Herrick Oracle JDK-8290435 Turning off JpAllowDowngrades (or Upgrades)
135 Matthias Baesken SAP Matthias Baesken SAP JDK-8290424 log events for os::dll_unload
136 georgeadams1995 Independent Magnus Ihse Bursie Oracle JDK-8290404 Rewrite of GitHub Actions (GHA) sanity tests
138 Matthias Baesken SAP Matthias Baesken SAP JDK-8290371 move os::get_default_process_handle and os::dll_lookup to os_posix for POSIX platforms
138 Matthias Baesken SAP Matthias Baesken SAP JDK-8290346 unify os::infinite_sleep on posix platforms
139 Martin Doerr SAP Martin Doerr SAP JDK-8290305 [PPC64] ZGC C2 load barrier stub needs to preserve vector registers
139 Martin Doerr SAP Martin Doerr SAP JDK-8290303 [PPC64] SIGSEGV in C2Compiler::init_c2_runtime() after JDK-8289060
139 Martin Doerr SAP Martin Doerr SAP JDK-8290301 [PPC64] JfrGetCallTrace: assert(_pc != nullptr) failed: must have PC
140 Goetz Lindenmaier SAP Leonid Mesnik Oracle JDK-8290232 com/sun/management/OperatingSystemMXBean/TestTotalSwap.java: Expected total swap size ... but getTotalSwapSpaceSize returned ...
141 georgeadams1995 Independent Magnus Ihse Bursie Oracle JDK-8290152 UnreadableRB case in MissingResourceCauseTest is not working reliably on Windows
142 Stephanie Crater Microsoft Naoto Sato Oracle JDK-8290120 Java launcher can not parse Chinese character when system locale is set to UTF-8
142 georgeadams1995 Independent Magnus Ihse Bursie Oracle JDK-8290109 PropertiesTest.sh fail on msys2
142 georgeadams1995 Independent Magnus Ihse Bursie Oracle JDK-8290107 Fix various issues with msys2
142 Guoxiong Li Independent Guoxiong Li Independent JDK-8290105 Remove the unnecessary method Attr#attribTopLevel and its usage
142 georgeadams1995 Independent Magnus Ihse Bursie Oracle JDK-8290099 Some langtools tests fail on msys2
142 georgeadams1995 Independent mag Independent JDK-8290094 Update build README to reflect that MSYS2 is supported
142 Vladimir Kempik Independent Vladimir Kempik Independent JDK-8290042 buffer overflow in MTLVertexCache.m: MTLVertexCache_AddGlyphQuad
142 georgeadams1995 Independent Aleksey Shipilev Red Hat JDK-8290068 Remove .hgtags
145 Thomas Stuefe SAP Thomas Stuefe SAP JDK-8289990 Build warning in methodData.cpp memset zero-length parameter
146 Jonathan Dowland Red Hat Aleksandr Veselov JetBrains JDK-8289929 [macos] accessibility frame is misplaced on a secondary monitor on macOS
146 Goetz Lindenmaier SAP Alexander Zuev Oracle JDK-8289924 [macos] VoiceOver : Moving JTable column to be the first column JVM crashes
146 Goetz Lindenmaier SAP Anton Tarasov JetBrains JDK-8289922 [macos] test/jdk/java/awt/dnd/RemoveDropTargetCrashTest crashes with VoiceOver on macOS
146 Thomas Stuefe SAP Thomas Stuefe SAP JDK-8289915 Memory corruption with CPU_ALLOC, CPU_FREE on muslc
146 Matthias Baesken SAP Matthias Baesken SAP JDK-8289914 MetricsTesterCgroupV2.getLongValueEntryFromFile fails when named value doesn't exist
146 Matthias Baesken SAP Matthias Baesken SAP JDK-8289913 Provide separate event category for dll operations
146 jkratochvil Azul Ioi Lam Oracle JDK-8289912 CDS VerifyError when calling clone() on object array
146 Matthias Baesken SAP Matthias Baesken SAP JDK-8289888 [test] java/lang/ProcessBuilder/Basic.java fails on Alpine/musl
148 Goetz Lindenmaier SAP Christian Hagedorn Oracle JDK-8289746 [IR Framework] Whitelist and ignore CompileThreshold
148 Goetz Lindenmaier SAP Sean Mullan Oracle JDK-8288965 Disable SHA-1 Signed JARs
149 Jonathan Dowland Red Hat Yoshiki Sato Oracle JDK-8289685 System.loadLibrary does not work on Big Sur if JDK is built with macOS SDK 10.15 and earlier
150 Goetz Lindenmaier SAP Vladimir Ivanov Oracle JDK-8289638 CI: ciInstanceKlass::implementor() is not consistent for well-known classes
150 Goetz Lindenmaier SAP Christian Hagedorn Oracle JDK-8289637 C2: assert(tn->in(0) != __null) failed: must have live top node
150 Goetz Lindenmaier SAP Roland Westrelin Red Hat JDK-8289636 C2 fails with assert(!n->is_Store() && !n->is_LoadStore()) failed: no node with a side effect
150 Goetz Lindenmaier SAP Michael McMahon Oracle JDK-8288977 Make HttpURLConnection default keep alive timeout configurable
152 Vladimir Kempik Independent Thomas Stuefe SAP JDK-8289576 Make NMT late-initializable
152 Matthias Baesken SAP Ioi Lam Oracle JDK-8289568 Do not use CPU Shares to compute active processor count
154 Goetz Lindenmaier SAP Tobias Holenstein Oracle JDK-8289461 assert(cnt++ < 40) failed: infinite cycle in loop optimization
154 Goetz Lindenmaier SAP Manukumar V S Oracle JDK-8289459 Create an automated regression test for RFE 4138746
154 Goetz Lindenmaier SAP Manukumar V S Oracle JDK-8289457 Write a regression test for JDK-4615365
154 Goetz Lindenmaier SAP Emanuel Peter Oracle JDK-8289455 remove memory_operand assert for spilled instructions
154 Goetz Lindenmaier SAP Dean Long Oracle JDK-8289453 LIR_Opr::vreg_number() and data() can return negative number
155 Zhengyu Gu Independent Zhengyu Gu Independent JDK-8289376 sun.font.FontConfigManager.getFontConfig() leaks charset
155 Zhengyu Gu Independent Zhengyu Gu Independent JDK-8289374 Potential leak awtImageData/color_data when initializes X11GraphicsEnvironment
156 Goetz Lindenmaier SAP Goetz Lindenmaier SAP JDK-8289197 [17u] Push of backport of 8286177 did not remove assertion
156 Christoph Langer SAP Magnus Ihse Bursie Oracle JDK-8289199 Improve test failure reporting in GHA
159 Goetz Lindenmaier SAP Robert Mckenna Oracle JDK-8289135 jtreg test com/sun/jndi/ldap/LdapPoolTimeoutTest.java fails intermittently in nightly run
159 Goetz Lindenmaier SAP N/A Unknown JDK-8289134 C1: Inlining attempt through MH::invokeBasic() with null receiver
159 Goetz Lindenmaier SAP Dean Long Oracle JDK-8289133 jdk/incubator/vector/Float128VectorTests.java failed a subtest
159 Goetz Lindenmaier SAP Andrew Haley Red Hat JDK-8289132 [REDO] JDK-8285802 AArch64: Consistently handle offsets in MacroAssembler as 64-bit quantities
159 Goetz Lindenmaier SAP Andrew Haley Red Hat JDK-8289131 aarch64 : guarantee(val < (1ULL << nbits)) failed: Field too big for insn
159 Goetz Lindenmaier SAP Roberto Castaneda Lozano Oracle JDK-8289130 C2: "failed: non-reduction loop contains reduction nodes" assert failure
159 Goetz Lindenmaier SAP Tobias Hartmann Oracle JDK-8289123 C2 compilation hits assert(is_dominator(c, n_ctrl)) failed
159 Goetz Lindenmaier SAP Tobias Hartmann Oracle JDK-8289122 Memory leak with RepeatCompilation
159 Goetz Lindenmaier SAP Roberto Castaneda Lozano Oracle JDK-8289121 C2: miscompilation of map pattern as a vector reduction
159 Goetz Lindenmaier SAP Manukumar V S Oracle JDK-8289120 Write a regression test for JDK-4820080
159 Goetz Lindenmaier SAP Brian Burkhalter Oracle JDK-8289119 test/jdk/java/lang/Math/PowTests.java skips testing for non-corner-case values
160 Sergey Bylokhov Amazon Jaikiran Pai Oracle JDK-8289102 Build fails on macos aarch64 when using --with-zlib=bundled
160 Aleksey Shipilev Red Hat Aleksey Shipilev Red Hat JDK-8289067 GCC 12 fails to build zReferenceProcessor.cpp
160 Aleksey Shipilev Red Hat Aleksey Shipilev Red Hat JDK-8289065 C1: Miscompilation due to broken Class.getModifiers intrinsic
161 Sergey Bylokhov Amazon Philip Race Oracle JDK-8289034 [macos] libpng build failures with Xcode13.3
161 Goetz Lindenmaier SAP Joe Wang Oracle JDK-8288963 Improve XPath operators count accuracy
161 Goetz Lindenmaier SAP Valerie Peng Oracle JDK-8288962 Update PCSC-Lite for SUSE Linux to 1.9.5
161 Goetz Lindenmaier SAP Hannes Wallnoefer Oracle JDK-8288960 Upgrade JQueryUI to 1.13.1 from 1.12.1
161 Goetz Lindenmaier SAP Emanuel Peter Oracle JDK-8288959 C2: CmpU needs to do more precise over/underflow analysis
161 Goetz Lindenmaier SAP Emanuel Peter Oracle JDK-8288958 Missing memory edge when spilling MoveF2I, MoveD2L etc
161 Goetz Lindenmaier SAP Igor Veresov Oracle JDK-8288957 several compiler/whitebox tests fail with "private compiler.whitebox.SimpleTestCaseHelper(int) must be compiled"
161 Goetz Lindenmaier SAP Manukumar V S Oracle JDK-8288956 [TEST_BUG] [macosx] java/awt/dnd/DropTargetEnterExitTest/MissedDragExitTest.java failed
161 Goetz Lindenmaier SAP Manukumar V S Oracle JDK-8288955 Some of the dnd tests time out and fail intermittently
161 Goetz Lindenmaier SAP Manukumar V S Oracle JDK-8288952 Write an automated regression test for RFE 4371575
161 Goetz Lindenmaier SAP Srinivas Mandalika Oracle JDK-8288951 Create a regression test for JDK-8000326
161 Goetz Lindenmaier SAP Alexander Zvegintsev Oracle JDK-8288950 [TEST_BUG] Test java/awt/Frame/MiscUndecorated/RepaintTest.java fails
162 Goetz Lindenmaier SAP Srinivas Mandalika Oracle JDK-8288889 Create a regression test for JDK-4699544
162 Goetz Lindenmaier SAP Magnus Ihse Bursie Oracle JDK-8288888 Fix typos in security
162 Jaroslav Bachorík DataDog Erik Gahlin Oracle JDK-8288884 JFR: Periodic task thread uses period for method sampling events
162 Goetz Lindenmaier SAP Dean Long Oracle JDK-8288878 JVM crash: guarantee(sect->end() <= sect->limit()) failed: sanity on AVX512
162 Goetz Lindenmaier SAP Tobias Hartmann Oracle JDK-8288876 C2: assert(!requires_atomic_access) failed: can't ensure atomicity
162 Goetz Lindenmaier SAP Daniel Jelinski Oracle JDK-8288874 AlgorithmConstraints:permits not throwing IllegalArgumentException when 'alg' is null
162 Goetz Lindenmaier SAP Daniel Jelinski Oracle JDK-8288866 Cache the results of constraint checks
162 Goetz Lindenmaier SAP Alexey Semenyuk Oracle JDK-8288864 "jpackage.exe" creates application launcher without Windows Application Manfiest
162 Goetz Lindenmaier SAP Erik Joelsson Oracle JDK-8288863 jpackageapplauncher build fails intermittently in Tier[45]
162 Goetz Lindenmaier SAP Roland Westrelin Red Hat JDK-8288860 CountedLoopEndNode::stride_con crash in debug build with -XX:+TraceLoopOpts
162 Goetz Lindenmaier SAP Srinivas Mandalika Oracle JDK-8288857 Create a test for JDK-4740761
162 Goetz Lindenmaier SAP Srinivas Mandalika Oracle JDK-8288852 Create tests for Frame.setMinimumSize() method
162 Olga Mikhaltcova Azul Olga Mikhaltcova Azul JDK-8288827 PKCS11 tests fail on CentOS Stream 9
169 Johannes Bechberger SAP Thomas Stuefe SAP JDK-8288419 JDK-8282306 breaks gtests on zero
169 Matthias Baesken SAP Matthias Baesken SAP JDK-8288418 unify os::dir_is_empty across posix platforms
169 Johannes Bechberger SAP Johannes Bechberger SAP JDK-8288417 os::is_first_C_frame(frame*) crashes on invalid link access
169 Johannes Bechberger SAP Johannes Bechberger SAP JDK-8288401 Interval of < 1 ms disables ExecutionSample events
169 Goetz Lindenmaier SAP Leo Korinth Oracle JDK-8288390 TestStressG1Humongous fails with guarantee(is_range_uncommitted)
169 Goetz Lindenmaier SAP Raffaello Giulietti Oracle JDK-8288389 java/util/DoubleStreamSums/CompensatedSums.java fails with expected [true] but found [false]
170 Jaroslav Bachorík DataDog Jaroslav Bachorík DataDog JDK-8288331 AsyncGetCallTrace may crash JVM on guarantee
170 Severin Gehwolf Red Hat Severin Gehwolf Red Hat JDK-8288322 Add a regression test for JDK-8287073
170 Severin Gehwolf Red Hat Maxim Kartashev JetBrains JDK-8288308 NPE from CgroupV2Subsystem.getInstance()
170 Goetz Lindenmaier SAP Ivan Walulya Oracle JDK-8288305 [TESTBUG] Wrong reporting of gc/g1/humongousObjects/TestHeapCounters test.
170 Goetz Lindenmaier SAP Dean Long Oracle JDK-8288304 C2: segmentation fault in ciMethodBlocks::make_block_at(int)
173 Sergey Bylokhov Amazon Prasanta Sadhukhan Oracle JDK-8288248 javax/swing/JTree/4908142/bug4908142.java The selected index should be "aad"
173 Goetz Lindenmaier SAP Jaikiran Pai Oracle JDK-8288463 (dc) DatagramChannel.disconnect fails with "Invalid argument" on macOS 12.4
173 Goetz Lindenmaier SAP Daniel Jelinski Oracle JDK-8288202 Avoid evaluating SSLAlgorithmConstraints twice
173 Goetz Lindenmaier SAP Alexander Zvegintsev Oracle JDK-8288201 HiDPI, Unity, java/awt/dnd/DropTargetEnterExitTest/MissedDragExitTest.java
173 Goetz Lindenmaier SAP Roberto Castaneda Lozano Oracle JDK-8288200 C2: LCM prioritizes locally dependent CreateEx nodes over projections after 8270090
173 Goetz Lindenmaier SAP Roberto Castaneda Lozano Oracle JDK-8288196 C2: LCM may prioritize CheckCastPP nodes over projections
174 Severin Gehwolf Red Hat Severin Gehwolf Red Hat JDK-8288102 Fix of JDK-8287107 (unused cgv1 freezer controller) was incomplete
174 Severin Gehwolf Red Hat Ioi Lam Oracle JDK-8288100 CgroupSubsystemFactory.setCgroupV2Path asserts with freezer controller
174 Sergey Bylokhov Amazon Sergey Bylokhov Amazon JDK-8288095 Change implementation of safeAdd/safeMult in the LCMSImageLayout class
175 Sergey Bylokhov Amazon Sergey Bylokhov Amazon JDK-8288066 The MTPerLineTransformValidation tests has a typo in the @run tag
175 Sergey Bylokhov Amazon Sergey Bylokhov Amazon JDK-8288065 Test AncestorResized.java fails when Windows desktop is scaled.
175 Goetz Lindenmaier SAP Joe Darcy Oracle JDK-8288063 RandomGenerator:NextDouble() default behavior partially fixed by JDK-8280950
175 Goetz Lindenmaier SAP Joe Darcy Oracle JDK-8288061 RandomGenerator:NextDouble() default behavior non conformant after JDK-8280550 fix
175 Goetz Lindenmaier SAP Joe Darcy Oracle JDK-8288055 SplittableRandom#nextDouble(double,double) can return result >= bound
175 Goetz Lindenmaier SAP Alex Menkov Oracle JDK-8288037 [REDO] Invalid generic signature for redefined classes
175 Goetz Lindenmaier SAP Hannes Wallnoefer Oracle JDK-8288036 Upgrade JQuery to version 3.6.0
175 Goetz Lindenmaier SAP Weijun Wang Oracle JDK-8288034 KeyAgreement : generateSecret intermittently not resetting
175 Goetz Lindenmaier SAP Dean Long Oracle JDK-8288032 add extra diagnostics for JDK-8268184
175 Goetz Lindenmaier SAP Rajan Halade Oracle JDK-8288462 Distrust.java failed with CertificateExpiredException
176 Christoph Langer SAP Christoph Langer SAP JDK-8287995 javac error on invalid jar should only print filename
176 Johannes Bechberger SAP Johannes Bechberger SAP JDK-8287931 [x86, aarch64] vmassert(_last_Java_pc == NULL, "already walkable"); fails with async profiler
176 Matthias Baesken SAP Matthias Baesken SAP JDK-8287928 [test] show real exception in bomb call in sun/rmi/runtime/Log/checkLogging/CheckLogging.java
180 Christoph Langer SAP Lance Andersen Oracle JDK-8287993 (zipfs) Performance regression related to support for POSIX file permissions
180 Christoph Langer SAP Christoph Langer SAP JDK-8287991 (zipfs) Mention paths with dot elements in ZipException and cleanups
180 Christoph Langer SAP Christoph Langer SAP JDK-8287989 javac errors after JDK-8251329 are not helpful enough to find root cause
181 Christoph Langer SAP Dongbo He Huawei JDK-8287722 Add test to check that jmod hashes are reproducible
181 Christoph Langer SAP Christoph Langer SAP JDK-8287720 GHA: Add macOS aarch64 to the list of default platforms for workflow_dispatch event
181 Christoph Langer SAP Christoph Langer SAP JDK-8287987 GHA: Update cygwin to fix issues in langtools tests on Windows
182 Goetz Lindenmaier SAP Goetz Lindenmaier SAP JDK-8287016 Bump update version for OpenJDK: jdk-17.0.5

No changesets log

Committer push log

Shruthi.Shruthi1, IBM

Bug Summary
JDK-8290470 Duplicate XML keys in XPATHErrorResources.java and XSLTErrorResources.java
JDK-8291834 Issue in Initialization of keys in ErrorMsg.java and XPATHErrorResources.java

Andrew Leonard, Red Hat

Bug Summary
JDK-8292032 MacOS debug symbol files not always deterministic in reproducible builds

David Alvarez, Amazon

Bug Summary
JDK-8294260 (tz) Update Timezone Data to 2022c
JDK-8293880 Add legacy tz tests to OpenJDK

Andrew Hughes, Red Hat

Bug Summary
JDK-8283911 DEFAULT_PROMOTED_VERSION_PRE not reset to 'ea' for jdk-17.0.4
JDK-8293144 P11TlsKeyMaterialGenerator should work with ChaCha20-Poly1305

Alexey Pavlyutkin, Azul

Bug Summary
JDK-8290526 Temporarily disable Unix domain sockets in Windows PipeImpl
JDK-8292759 ZGC: fastdebug build crashes when printing ClassLoaderData

Peng Xie, Tencent

Bug Summary
JDK-8292767 CgroupV1 detection code should consider memory.swappiness
JDK-8292514 GetContainerCpuLoad does not return the correct result in share mode

Christoph Langer, SAP

Bug Summary
JDK-8295056 [17u] Remove designator DEFAULT_PROMOTED_VERSION_PRE=ea for release 17.0.5

Christoph Langer, SAP

Bug Summary
JDK-8287991 (zipfs) Mention paths with dot elements in ZipException and cleanups
JDK-8287993 (zipfs) Performance regression related to support for POSIX file permissions
JDK-8287722 Add test to check that jmod hashes are reproducible
JDK-8291900 Enable Unix domain sockets in Windows Selector notification mechanism
JDK-8287720 GHA: Add macOS aarch64 to the list of default platforms for workflow_dispatch event
JDK-8287987 GHA: Update cygwin to fix issues in langtools tests on Windows
JDK-8289199 Improve test failure reporting in GHA
JDK-8287995 javac error on invalid jar should only print filename
JDK-8287989 javac errors after JDK-8251329 are not helpful enough to find root cause

Ekaterina Vergizova, Azul

Bug Summary
JDK-8293133 JFR: Disable TestDevNull.java on Windows

georgeadams1995, Independent

Bug Summary
JDK-8290777 Bump macOS GitHub actions to macOS 11
JDK-8290107 Fix various issues with msys2
JDK-8290109 PropertiesTest.sh fail on msys2
JDK-8290068 Remove .hgtags
JDK-8290457 Restore cancel-in-progress in GHA
JDK-8290404 Rewrite of GitHub Actions (GHA) sanity tests
JDK-8290099 Some langtools tests fail on msys2
JDK-8290152 UnreadableRB case in MissingResourceCauseTest is not working reliably on Windows
JDK-8290094 Update build README to reflect that MSYS2 is supported

Guoxiong Li, Independent

Bug Summary
JDK-8290105 Remove the unnecessary method Attr#attribTopLevel and its usage

Goetz Lindenmaier, SAP

Bug Summary
JDK-8288864 "jpackage.exe" creates application launcher without Windows Application Manfiest
JDK-8288463 (dc) DatagramChannel.disconnect fails with "Invalid argument" on macOS 12.4
JDK-8291595 [17u] Delete files missed in backport of 8269039
JDK-8289197 [17u] Push of backport of 8286177 did not remove assertion
JDK-8289746 [IR Framework] Whitelist and ignore CompileThreshold
JDK-8290930 [JVMCI] Add API for reading and writing JVMCI thread locals
JDK-8290803 [macos] Multiple jpackage tests fail/timeout on same host
JDK-8289922 [macos] test/jdk/java/awt/dnd/RemoveDropTargetCrashTest crashes with VoiceOver on macOS
JDK-8290890 [macos] tools/jpackage tests timeout due to /usr/bin/osascript
JDK-8289924 [macos] VoiceOver : Moving JTable column to be the first column JVM crashes
JDK-8290802 [macos]: App bundle cannot upload to Mac App Store due to info.plist embedded in java exe
JDK-8290788 [macos]: Error when signing the additional launcher
JDK-8288037 [REDO] Invalid generic signature for redefined classes
JDK-8289132 [REDO] JDK-8285802 AArch64: Consistently handle offsets in MacroAssembler as 64-bit quantities
JDK-8290905 [REDO] Quarantined jpackage apps are labeled as "damaged"
JDK-8288956 [TEST_BUG] [macosx] java/awt/dnd/DropTargetEnterExitTest/MissedDragExitTest.java failed
JDK-8290935 [TEST_BUG] java/awt/event/MouseEvent/SpuriousExitEnter/SpuriousExitEnter_3.java fails in jdk6u14 & jdk7
JDK-8288950 [TEST_BUG] Test java/awt/Frame/MiscUndecorated/RepaintTest.java fails
JDK-8290932 [TESTBUG] javax/swing/JPopupMenu/4634626/bug4634626.java sometimes failed on mac
JDK-8291787 [TESTBUG] Regression test java/awt/Graphics2D/DrawString/LCDTextSrcEa.java has issues
JDK-8291609 [TESTBUG] Use color tolerance only for XRender in BlitRotateClippedArea test
JDK-8288305 [TESTBUG] Wrong reporting of gc/g1/humongousObjects/TestHeapCounters test.
JDK-8290931 [XRender] the BlitRotateClippedArea test fails on Linux in the XR pipeline
JDK-8289131 aarch64 : guarantee(val < (1ULL << nbits)) failed: Field too big for insn
JDK-8291621 AArch64: CMN should be handled the same way as CMP
JDK-8288032 add extra diagnostics for JDK-8268184
JDK-8288874 AlgorithmConstraints:permits not throwing IllegalArgumentException when 'alg' is null
JDK-8289461 assert(cnt++ < 40) failed: infinite cycle in loop optimization
JDK-8290891 Assorted enhancements to jpackage testing framework
JDK-8288202 Avoid evaluating SSLAlgorithmConstraints twice
JDK-8287016 Bump update version for OpenJDK: jdk-17.0.5
JDK-8289134 C1: Inlining attempt through MH::invokeBasic() with null receiver
JDK-8289123 C2 compilation hits assert(is_dominator(c, n_ctrl)) failed
JDK-8289636 C2 fails with assert(!n->is_Store() && !n->is_LoadStore()) failed: no node with a side effect
JDK-8289130 C2: "failed: non-reduction loop contains reduction nodes" assert failure
JDK-8288876 C2: assert(!requires_atomic_access) failed: can't ensure atomicity
JDK-8289637 C2: assert(tn->in(0) != __null) failed: must have live top node
JDK-8288959 C2: CmpU needs to do more precise over/underflow analysis
JDK-8288196 C2: LCM may prioritize CheckCastPP nodes over projections
JDK-8288200 C2: LCM prioritizes locally dependent CreateEx nodes over projections after 8270090
JDK-8289121 C2: miscompilation of map pattern as a vector reduction
JDK-8288304 C2: segmentation fault in ciMethodBlocks::make_block_at(int)
JDK-8288866 Cache the results of constraint checks
JDK-8289638 CI: ciInstanceKlass::implementor() is not consistent for well-known classes
JDK-8290232 com/sun/management/OperatingSystemMXBean/TestTotalSwap.java: Expected total swap size ... but getTotalSwapSpaceSize returned ...
JDK-8290507 Conflicting jpackage static library name
JDK-8288860 CountedLoopEndNode::stride_con crash in debug build with -XX:+TraceLoopOpts
JDK-8291783 Create a manual test framework class
JDK-8290800 Create a regression test for checking the 'Space' key activation of focused Button
JDK-8290944 Create a regression test for JDK-4330998
JDK-8290798 Create a regression test for JDK-4514331
JDK-8290939 Create a regression test for JDK-4518432
JDK-8290941 Create a regression test for JDK-4532513
JDK-8290799 Create a regression test for JDK-4618767
JDK-8290797 Create a regression test for JDK-4670051
JDK-8288889 Create a regression test for JDK-4699544
JDK-8288951 Create a regression test for JDK-8000326
JDK-8291613 Create a regression test for JRootPane.setDefaultButton() method
JDK-8291682 Create a regression test for RFE 4287690
JDK-8291614 Create a regression test for the JTree usecase of JDK-4618767
JDK-8291677 Create a test for JDK-4529616
JDK-8291780 Create a test for JDK-4670319
JDK-8291617 Create a test for JDK-4715496
JDK-8288857 Create a test for JDK-4740761
JDK-8290946 Create a test or JDK-4715503
JDK-8291673 Create an automated regression test for JDK-4525475
JDK-8289459 Create an automated regression test for RFE 4138746
JDK-8291616 Create an automated regression test for RFE 4231298
JDK-8291833 Create an automated regression test for RFE-4390885
JDK-8291837 Create an automated test for JDK-4170173
JDK-8291838 Create an automated test for JDK-4702199
JDK-8288852 Create tests for Frame.setMinimumSize() method
JDK-8290805 Deadlock in leakprofiler::emit_events during shutdown
JDK-8290792 Debian packaging doesn't work
JDK-8288965 Disable SHA-1 Signed JARs
JDK-8288462 Distrust.java failed with CertificateExpiredException
JDK-8291484 Enhance PassFailJFrame
JDK-8291604 Error: Not a test or directory containing tests: java/awt/print/PrinterJob/XparColor.java
JDK-8290506 Failing jpackage tests with fastdebug/release build
JDK-8291835 Fix java/awt/print/PrinterJob/ImagePrinting/PrintARGBImage.java manual test
JDK-8291782 Fix PrintLatinCJKTest.java test that is failing with Parse Exception
JDK-8288888 Fix typos in security
JDK-8288201 HiDPI, Unity, java/awt/dnd/DropTargetEnterExitTest/MissedDragExitTest.java
JDK-8288963 Improve XPath operators count accuracy
JDK-8290804 Improve XSLT XPath operators count efficiency
JDK-8292013 ISO 4217 Amendment 171 Update
JDK-8292020 ISO 4217 Amendment 172 Update
JDK-8293909 jarsigner prints invalid digest/signature algorithm warnings if keysize is weak/disabled
JDK-8290950 java Robot API did the 'm' keypress and caused /awt/event/KeyEvent/KeyCharTest/KeyCharTest.html is timing out on macOS 12
JDK-8288389 java/util/DoubleStreamSums/CompensatedSums.java fails with expected [true] but found [false]
JDK-8290794 jdk.jpackage/share/native/applauncher/JvmLauncher.cpp fails to build with GCC 6.3.0
JDK-8289133 jdk/incubator/vector/Float128VectorTests.java failed a subtest
JDK-8290437 jpackage --type rpm produces an error: Invalid or unsupported type: [null]
JDK-8291485 jpackage does not work if class file has `$$` in the name on windows
JDK-8290948 jpackage'd launcher reports non-zero exit codes with error prompt
JDK-8288863 jpackageapplauncher build fails intermittently in Tier[45]
JDK-8289135 jtreg test com/sun/jndi/ldap/LdapPoolTimeoutTest.java fails intermittently in nightly run
JDK-8288878 JVM crash: guarantee(sect->end() <= sect->limit()) failed: sanity on AVX512
JDK-8288034 KeyAgreement : generateSecret intermittently not resetting
JDK-8289453 LIR_Opr::vreg_number() and data() can return negative number
JDK-8288977 Make HttpURLConnection default keep alive timeout configurable
JDK-8289122 Memory leak with RepeatCompilation
JDK-8290443 Menu items with submenus in JPopupMenu are not spoken on macOS
JDK-8291607 misc tests failed with "NoClassDefFoundError: Could not initialize class java.util.concurrent.ThreadLocalRandom"
JDK-8290439 Missing ')' in MacResources.properties
JDK-8288958 Missing memory edge when spilling MoveF2I, MoveD2L etc
JDK-8290937 NoResizeEventOnDMChangeTest.java fails because FS Window didn't receive all resizes!
JDK-8288061 RandomGenerator:NextDouble() default behavior non conformant after JDK-8280550 fix
JDK-8288063 RandomGenerator:NextDouble() default behavior partially fixed by JDK-8280950
JDK-8291483 Remove jtreg tag manual=yesno for java/awt/print/PrinterJob/PrintGlyphVectorTest.java and fix test
JDK-8289455 remove memory_operand assert for spilled instructions
JDK-8288957 several compiler/whitebox tests fail with "private compiler.whitebox.SimpleTestCaseHelper(int) must be compiled"
JDK-8288955 Some of the dnd tests time out and fail intermittently
JDK-8288055 SplittableRandom#nextDouble(double,double) can return result >= bound
JDK-8291611 sun/tools/jhsdb/JShellHeapDumpTest.java fails with RuntimeException 'JShellToolProvider' missing from stdout/stderr
JDK-8291488 test fails "assert(init != __null) failed: initialization not found"
JDK-8289119 test/jdk/java/lang/Math/PowTests.java skips testing for non-corner-case values
JDK-8288390 TestStressG1Humongous fails with guarantee(is_range_uncommitted)
JDK-8291480 The NumberFormat for locale sq_XK formats price incorrectly.
JDK-8291487 Trampoline not created for far runtime targets outside small CodeCache
JDK-8290435 Turning off JpAllowDowngrades (or Upgrades)
JDK-8291486 Unreachable loop is not removed from C2 IR, leading to a broken graph
JDK-8291489 Update FreeType to 2.12.1
JDK-8290952 Update HarfBuzz to 4.4.1
JDK-8288962 Update PCSC-Lite for SUSE Linux to 1.9.5
JDK-8291482 Update Visual Studio 2022 to version 17.1.0 for Oracle builds on Windows
JDK-8290508 Update Xerces2 Java to Version 2.12.2
JDK-8288036 Upgrade JQuery to version 3.6.0
JDK-8288960 Upgrade JQueryUI to 1.13.1 from 1.12.1
JDK-8290785 Windows product version issue
JDK-8291674 Write a regression test for CCC4400728
JDK-8291030 Write a regression test for JDK-4164779
JDK-8289457 Write a regression test for JDK-4615365
JDK-8289120 Write a regression test for JDK-4820080
JDK-8288952 Write an automated regression test for RFE 4371575

Jaroslav Bachorík, DataDog

Bug Summary
JDK-8288331 AsyncGetCallTrace may crash JVM on guarantee
JDK-8288884 JFR: Periodic task thread uses period for method sampling events

Jonathan Dowland, Red Hat

Bug Summary
JDK-8289929 [macos] accessibility frame is misplaced on a secondary monitor on macOS
JDK-8289685 System.loadLibrary does not work on Big Sur if JDK is built with macOS SDK 10.15 and earlier

jkratochvil, Azul

Bug Summary
JDK-8291547 CDS cannot archive lamda proxy with useImplMethodHandle
JDK-8289912 CDS VerifyError when calling clone() on object array

Johannes Bechberger, SAP

Bug Summary
JDK-8287931 [x86, aarch64] vmassert(_last_Java_pc == NULL, "already walkable"); fails with async profiler
JDK-8288401 Interval of < 1 ms disables ExecutionSample events
JDK-8288419 JDK-8282306 breaks gtests on zero
JDK-8288417 os::is_first_C_frame(frame*) crashes on invalid link access

Joshua Cao, Amazon

Bug Summary
JDK-8292644 compiler/loopopts/TestOverUnrolling2.java fails with release VMs
JDK-8292571 compiler/loopopts/TestSkeletonPredicateNegation.java times out with -XX:TieredStopAtLevel < 4
JDK-8292776 javax/net/ssl/ServerName/SSLEngineExplorerMatchedSNI.java failed intermittently due to SSLException: Tag mismatch
JDK-8292775 Tests fail with SSLProtocolException: Input record too big

Jiří Vaněk, Red Hat

Bug Summary
JDK-8292651 JFR: Dump on shutdown live-locks in some conditions

Dan Lutker, Amazon

Bug Summary
JDK-8291335 bug in GIFImageReader

Martijn Verburg, Independent

Bug Summary
JDK-8292747 It is not possible to read local computer certificates with the SunMSCAPI provider

Matthias Baesken, SAP

Bug Summary
JDK-8289888 [test] java/lang/ProcessBuilder/Basic.java fails on Alpine/musl
JDK-8287928 [test] show real exception in bomb call in sun/rmi/runtime/Log/checkLogging/CheckLogging.java
JDK-8292527 Build failures with GCC 11, Alpine 3 due to incompatible casts from nullptr
JDK-8289568 Do not use CPU Shares to compute active processor count
JDK-8290424 log events for os::dll_unload
JDK-8289914 MetricsTesterCgroupV2.getLongValueEntryFromFile fails when named value doesn't exist
JDK-8290371 move os::get_default_process_handle and os::dll_lookup to os_posix for POSIX platforms
JDK-8289913 Provide separate event category for dll operations
JDK-8293155 remove os::print_statistics()
JDK-8292529 unify _WIN32_WINNT settings
JDK-8288418 unify os::dir_is_empty across posix platforms
JDK-8290346 unify os::infinite_sleep on posix platforms
JDK-8292528 unify os::message_box across posix platforms

Martin Doerr, SAP

Bug Summary
JDK-8290301 [PPC64] JfrGetCallTrace: assert(_pc != nullptr) failed: must have PC
JDK-8290303 [PPC64] SIGSEGV in C2Compiler::init_c2_runtime() after JDK-8289060
JDK-8290305 [PPC64] ZGC C2 load barrier stub needs to preserve vector registers

Olga Mikhaltcova, Azul

Bug Summary
JDK-8288827 PKCS11 tests fail on CentOS Stream 9

Roland Westrelin, Red Hat

Bug Summary
JDK-8292540 Apache Lucene triggers: DEBUG MESSAGE: duplicated predicate failed which is impossible

Richard Reingruber, SAP

Bug Summary
JDK-8291015 C1: LIR_OpVisitState::maxNumberOfOperands too small

Stephanie Crater, Microsoft

Bug Summary
JDK-8290120 Java launcher can not parse Chinese character when system locale is set to UTF-8

Sergey Bylokhov, Amazon

Bug Summary
JDK-8289034 [macos] libpng build failures with Xcode13.3
JDK-8289102 Build fails on macos aarch64 when using --with-zlib=bundled
JDK-8288095 Change implementation of safeAdd/safeMult in the LCMSImageLayout class
JDK-8288248 javax/swing/JTree/4908142/bug4908142.java The selected index should be "aad"
JDK-8288065 Test AncestorResized.java fails when Windows desktop is scaled.
JDK-8288066 The MTPerLineTransformValidation tests has a typo in the @run tag

Severin Gehwolf, Red Hat

Bug Summary
JDK-8292470 [BACKOUT] JDK-8279219: [REDO] C2 crash when allocating array of size too large
JDK-8292962 [TESTBUG] TestMemoryAwareness.java fails on cgroups v2 and crun
JDK-8288322 Add a regression test for JDK-8287073
JDK-8292469 Bump update version for OpenJDK: jdk-17.0.4.1
JDK-8288100 CgroupSubsystemFactory.setCgroupV2Path asserts with freezer controller
JDK-8288102 Fix of JDK-8287107 (unused cgv1 freezer controller) was incomplete
JDK-8288308 NPE from CgroupV2Subsystem.getInstance()

Aleksey Shipilev, Red Hat

Bug Summary
JDK-8289065 C1: Miscompilation due to broken Class.getModifiers intrinsic
JDK-8289067 GCC 12 fails to build zReferenceProcessor.cpp

Thomas Stuefe, SAP

Bug Summary
JDK-8289990 Build warning in methodData.cpp memset zero-length parameter
JDK-8289915 Memory corruption with CPU_ALLOC, CPU_FREE on muslc

Vladimir Kempik, Independent

Bug Summary
JDK-8290042 buffer overflow in MTLVertexCache.m: MTLVertexCache_AddGlyphQuad
JDK-8289576 Make NMT late-initializable

Zhengyu Gu, Independent

Bug Summary
JDK-8289374 Potential leak awtImageData/color_data when initializes X11GraphicsEnvironment
JDK-8289376 sun.font.FontConfigManager.getFontConfig() leaks charset