PUSHES REPORT: 17.0.6

This report shows who pushed the backports to the given release. This usually shows who did the backporting, testing, and review work.

Report generated: Sun Sep 03 04:35:41 CEST 2023

Distribution by priority

Count Priority
3 P1
14 P2
80 P3
177 P4
2 P5

Distribution by components

Count Component
276 100% Total
128 46.4% hotspot
56 20.3% hotspot/compiler
32 11.6% hotspot/runtime
11 4.0% hotspot/jfr
11 4.0% hotspot/gc
7 2.5% hotspot/svc-agent
5 1.8% hotspot/test
3 1.1% hotspot/jvmti
2 0.7% hotspot
1 0.4% hotspot/svc
63 22.8% client-libs
21 7.6% client-libs/java.awt
12 4.3% client-libs
10 3.6% client-libs/2d
10 3.6% client-libs/javax.accessibility
7 2.5% client-libs/javax.swing
3 1.1% client-libs/javax.sound
27 9.8% core-libs
6 2.2% core-libs/java.time
6 2.2% core-libs/java.util:i18n
3 1.1% core-libs/java.net
2 0.7% core-libs/java.util
2 0.7% core-libs
2 0.7% core-libs/java.text
2 0.7% core-libs/java.lang
1 0.4% core-libs/java.io
1 0.4% core-libs/java.lang:class_loading
1 0.4% core-libs/javax.naming
1 0.4% core-libs/java.nio
26 9.4% security-libs
11 4.0% security-libs/java.security
7 2.5% security-libs/javax.net.ssl
5 1.8% security-libs/javax.crypto:pkcs11
1 0.4% security-libs/javax.security
1 0.4% security-libs/javax.crypto
1 0.4% security-libs
13 4.7% infrastructure
9 3.3% infrastructure/build
2 0.7% infrastructure/release_eng
2 0.7% infrastructure
8 2.9% core-svc
3 1.1% core-svc/debugger
2 0.7% core-svc
1 0.4% core-svc/javax.management
1 0.4% core-svc/java.lang.instrument
1 0.4% core-svc/java.lang.management
8 2.9% tools
4 1.4% tools/javac
3 1.1% tools
1 0.4% tools/javadoc(tool)
3 1.1% xml
2 0.7% xml/jaxp
1 0.4% xml/org.w3c.dom

Distribution by affiliation

This Release Pushes

Original Pushes

Count Committer
276 100% Total
246 89.1% Unknown
108 39.1% goetz
22 8.0% vrudomet
21 7.6% mbaesken
20 7.2% shade
10 3.6% sgehwolf
7 2.5% dchuyko
6 2.2% adinn
5 1.8% clanger
4 1.4% serb
3 1.1% bulasevich
3 1.1% sviswanathan
3 1.1% rmarchenko
3 1.1% jdowland
3 1.1% mdoerr
3 1.1% btaylor
3 1.1% andrew
3 1.1% phh
3 1.1% mbalao
2 0.7% eastigeevich
2 0.7% xliu
2 0.7% stuefe
2 0.7% svkamath
1 0.4% ihse
1 0.4% tsteele
1 0.4% aph
1 0.4% snazarki
1 0.4% lzhai
1 0.4% itakiguchi
1 0.4% roland
1 0.4% wkemper
10 3.6% Amazon
3 1.1% ruiamzn
2 0.7% joshcao
2 0.7% yftsai
2 0.7% alvdavi
1 0.4% lutkerd
5 1.8% Red Hat
5 1.8% zzambers
4 1.4% SAP
2 0.7% johannes.bechberger
2 0.7% christoph.langer
3 1.1% Azul
2 0.7% apavlyutkin
1 0.4% rmarchenko
3 1.1% Intel
3 1.1% scott.gibbons
1 0.4% @fcc-fac.ca
1 0.4% ryan.flegel
1 0.4% @mostlynerdless.de
1 0.4% me
1 0.4% IBM
1 0.4% Gaurav.Chaudhari
1 0.4% JetBrains
1 0.4% nikita.gubarkov
1 0.4% Tencent
1 0.4% bobpengxie
Count Committer
276 100% Total
228 82.6% Unknown
18 6.5% mbaesken
13 4.7% shade
9 3.3% cjplummer
6 2.2% prr
6 2.2% smandalika
6 2.2% mvs
5 1.8% dnsimon
5 1.8% kizune
5 1.8% weijun
5 1.8% dcubed
5 1.8% jiefu
5 1.8% roland
4 1.4% egahlin
4 1.4% aph
4 1.4% rhalade
4 1.4% N/A
4 1.4% stuefe
4 1.4% zgu
4 1.4% ysatowse
4 1.4% azvegint
3 1.1% ihse
3 1.1% ccheung
3 1.1% bulasevich
3 1.1% mdoerr
3 1.1% sspitsyn
3 1.1% aivanov
3 1.1% redestad
3 1.1% joehw
3 1.1% dlong
3 1.1% jdv
3 1.1% erikj
2 0.7% jlahoda
2 0.7% tschatzl
2 0.7% psadhukhan
2 0.7% cgo
2 0.7% dchuyko
2 0.7% lmesnik
2 0.7% djelinski
2 0.7% andrew
2 0.7% serb
2 0.7% iklam
2 0.7% hchao
2 0.7% jdowland
2 0.7% sgehwolf
2 0.7% jpai
2 0.7% asemenov
2 0.7% xuelei
2 0.7% vlivanov
2 0.7% mullan
1 0.4% fgao
1 0.4% achung
1 0.4% eosterlund
1 0.4% myano
1 0.4% rsunderbabu
1 0.4% thartmann
1 0.4% goetz
1 0.4% naoto
1 0.4% chagedorn
1 0.4% zmiao
1 0.4% rkennke
1 0.4% cstein
1 0.4% eliu
1 0.4% mbalao
1 0.4% itakiguchi
1 0.4% pliden
1 0.4% rreddy
1 0.4% kevinw
1 0.4% tsteele
1 0.4% wetmore
1 0.4% jcking
1 0.4% mseledtsov
1 0.4% jfranck
1 0.4% clanger
1 0.4% mikael
1 0.4% dfuchs
1 0.4% emcmanus
1 0.4% lzhai
1 0.4% xlinzheng
1 0.4% phedlin
1 0.4% aturbanov
1 0.4% dholmes
1 0.4% dnguyen
1 0.4% phh
1 0.4% haosun
1 0.4% hseigel
1 0.4% manc
1 0.4% jbhateja
1 0.4% vromero
21 7.6% Oracle
11 4.0% lawrence.andrews
3 1.1% justin.lu
2 0.7% harshitha.onkar
2 0.7% alisen.chung
1 0.4% joe.cherian
1 0.4% emanuel.peter
1 0.4% ravi.ra.gupta
6 2.2% Intel
6 2.2% scott.gibbons
5 1.8% Red Hat
5 1.8% zzambers
5 1.8% SAP
3 1.1% johannes.bechberger
2 0.7% christoph.langer
4 1.4% Independent
1 0.4% AJ-Ferguson
1 0.4% matias
1 0.4% deigue
1 0.4% djelinski1
2 0.7% Amazon
1 0.4% joshcao
1 0.4% alvdavi
2 0.7% Tencent
1 0.4% emoryzheng
1 0.4% casparcwang
1 0.4% Fujitsu
1 0.4% kiriyama.takuya
1 0.4% JetBrains
1 0.4% nikita.gubarkov
1 0.4% Loongson
1 0.4% wanghaomin

Chronological push log:

Days Ago This Release Push By Original Push By Bug Summary
Name Affiliation Name Affiliation
235 christoph.langer SAP christoph.langer SAP JDK-8299392 [17u] Remove designator DEFAULT_PROMOTED_VERSION_PRE=ea for release 17.0.6
236 goetz Unknown dholmes Unknown JDK-8300467 ProblemList java/text/Format/NumberFormat/CurrencyFormat.java
236 goetz Unknown justin.lu Oracle JDK-8300466 java/text/Format/NumberFormat/CurrencyFormat.java fails for hr_HR
243 goetz Unknown justin.lu Oracle JDK-8300465 ISO 4217 Amendment 174 Update
249 goetz Unknown sspitsyn Unknown JDK-8299355 JDI ObjectReference/referringObjects/referringObjects001 fails: assert(env->is_enabled(JVMTI_EVENT_OBJECT_FREE)) failed: checking
253 sgehwolf Unknown mullan Unknown JDK-8299311 Cannot use '-Djava.system.class.loader' with class loader in signed JAR
263 andrew Unknown andrew Unknown JDK-8298689 (tz) Update Timezone Data to 2022g
268 phh Unknown erikj Unknown JDK-8298397 Code signing warnings after JDK-8293550
268 phh Unknown erikj Unknown JDK-8298396 compare.sh fails on macos after JDK-8293550
274 btaylor Unknown erikj Unknown JDK-8298036 Optionally add get-task-allow entitlement to macos binaries
274 aph Unknown aph Unknown JDK-8298028 AArch64: Enable AES/GCM Intrinsics
274 shade Unknown jcking Unknown JDK-8298007 Memory leak in ShenandoahFullGC
275 vrudomet Unknown redestad Unknown JDK-8297983 java.lang.IllegalArgumentException: Negative length on strings concatenation
275 vrudomet Unknown smandalika Unknown JDK-8297961 Create a regression test for JDK-4424517
275 mbaesken Unknown naoto Unknown JDK-8297926 CLDR v42 update for tzdata 2022f
276 serb Unknown serb Unknown JDK-8297913 One more cast in SAFE_SIZE_NEW_ARRAY2
276 serb Unknown kizune Unknown JDK-8297892 Overzealous check in sizecalc.h prevents large memory allocation
276 btaylor Unknown ihse Unknown JDK-8297876 Introduce UTIL_ARG_WITH
277 btaylor Unknown ihse Unknown JDK-8297789 building.md should link to both md and html
278 sgehwolf Unknown sgehwolf Unknown JDK-8297720 [TESTBUG] HotSpotResolvedJavaFieldTest does not run
278 lzhai Unknown lzhai Unknown JDK-8297696 jdk/javadoc/doclet/testJavaFX/TestJavaFxMode.java fail with jfx
281 sgehwolf Unknown dnsimon Unknown JDK-8297658 [JVMCI] rationalize relationship between getCodeSize and getCode in ResolvedJavaMethod
281 sgehwolf Unknown dnsimon Unknown JDK-8297653 [JVMCI] add API for retrieving ConstantValue attributes
281 sgehwolf Unknown dnsimon Unknown JDK-8297651 [JVMCI] HotSpotResolvedJavaFieldImpl.getIndex returns wrong value
281 mbaesken Unknown mbaesken Unknown JDK-8297629 Add cause in a couple of IllegalArgumentException and InvalidParameterException shown by sun/security/pkcs11 tests
281 zzambers Red Hat zzambers Red Hat JDK-8297628 Problemlist existing compiler/rtm tests also on x86
281 shade Unknown cgo Unknown JDK-8297621 ARM32-softfp: Do not load CONSTANT_double using the condy helper methods in the interpreter
281 sgehwolf Unknown dnsimon Unknown JDK-8297620 [JVMCI] list HotSpotConstantPool.loadReferencedType to ConstantPool
281 sgehwolf Unknown dnsimon Unknown JDK-8297616 [JVMCI] Access to j.l.r.Method/Constructor/Field for ResolvedJavaMethod/ResolvedJavaField
281 mbaesken Unknown mbaesken Unknown JDK-8297614 UnexpectedSourceImageSize test times out on slow machines when fastdebug is used
282 vrudomet Unknown jdv Unknown JDK-8297596 sun/java2d/DirectX/OnScreenRenderingResizeTest/OnScreenRenderingResizeTest.java fails again
282 vrudomet Unknown jdv Unknown JDK-8297595 Update sun/java2d/DirectX/OnScreenRenderingResizeTest/OnScreenRenderingResizeTest.java
282 clanger Unknown egahlin Unknown JDK-8297592 JFR: File Read event for RandomAccessFile::write(byte[]) is incorrect
282 shade Unknown shade Unknown JDK-8297577 ARM32: Improve register dump in hs_err
282 zzambers Red Hat zzambers Red Hat JDK-8297576 P11PSSSignature.engineUpdate should not print debug messages during normal operation
282 rmarchenko Unknown xuelei Unknown JDK-8297565 Use fixed certificate validation date in SSLExampleCert template
282 rmarchenko Unknown rhalade Unknown JDK-8297553 EndingDotHostname.java test fails because SSL cert expired
283 rmarchenko Unknown xuelei Unknown JDK-8297516 Trailing dot in hostname causes TLS handshake to fail with SNI disabled
283 mbaesken Unknown mbaesken Unknown JDK-8297483 PublicMethodsTest is slow due to dependency verification with debug builds
284 zzambers Red Hat zzambers Red Hat JDK-8297459 P11Cipher should not throw out of bounds exception during padding
284 vrudomet Unknown jdv Unknown JDK-8297453 sun/java2d/DirectX/OnScreenRenderingResizeTest/OnScreenRenderingResizeTest.java fails
284 shade Unknown shade Unknown JDK-8297403 Zero: Support AsyncGetCallTrace
284 shade Unknown shade Unknown JDK-8297401 ARM32: Default to {ldrexd,strexd} in StubRoutines::atomic_{load|store}_long
284 shade Unknown zgu Unknown JDK-8297400 TestStringDeduplicationAgeThreshold intermittent failures on Shenandoah
284 shade Unknown shade Unknown JDK-8297399 gc/g1/TestShrinkAuxiliaryData30 test fails on large machines
284 shade Unknown rkennke Unknown JDK-8297398 Cleanup resolve() leftovers from BarrierSet et al
284 shade Unknown shade Unknown JDK-8297397 Update JMH devkit to 1.35
285 vrudomet Unknown prr Unknown JDK-8297328 Regression Test CoordinateTruncationBug.java fails on OL8.3
285 vrudomet Unknown prr Unknown JDK-8297327 closed sun/java2d/GdiRendering/ClipShapeRendering.java failed with "Incorrect color ffeeeeee instead of ff0000ff in pixel (100, 100)"
285 vrudomet Unknown kizune Unknown JDK-8297326 javax/sound/midi/Sequencer/MetaCallback.java failed with timeout
285 vrudomet Unknown ravi.ra.gupta Oracle JDK-8297325 Write a test to verify the content change of TextArea sends TextEvent
285 shade Unknown jpai Unknown JDK-8297324 jdk/nio/zipfs/ZipFSOutputStreamTest.java timed out
285 shade Unknown shade Unknown JDK-8297323 Zero: Print warnings when unsupported intrinsics are enabled
285 shade Unknown dchuyko Unknown JDK-8297322 Print error if Shenandoah flags are empty (instead of crashing)
285 shade Unknown kiriyama.takuya Fujitsu JDK-8297321 gc/epsilon/TestMemoryMXBeans.java failed with wrong initial heap size
285 shade Unknown zgu Unknown JDK-8297319 NMT: Correct NMT tag on CollectedHeap
285 shade Unknown zgu Unknown JDK-8297318 Shenandoah: Remove inaccurate comment on SBS::load_reference_barrier()
288 vrudomet Unknown psadhukhan Unknown JDK-8297279 javax/swing/JTree/6263446/bug6263446.java fails intermittently on a VM
288 mbaesken Unknown mbaesken Unknown JDK-8297251 jdk/jfr/event/compiler/TestJitRestart.java failed with "RuntimeException: No JIT restart event found: expected true, was false"
289 andrew Unknown andrew Unknown JDK-8297225 Update CLDR data following tzdata 2022c update
289 dchuyko Unknown shade Unknown JDK-8297212 Improve InterpreterCodelet data footprint
289 mbaesken Unknown egahlin Unknown JDK-8297189 JFR: Change name of jdk.JitRestart
290 mbaesken Unknown mbaesken Unknown JDK-8297140 Add JFR JIT restart event
291 goetz Unknown vromero Unknown JDK-8297049 Raw inner class constructor ref should not perform diamond inference
291 goetz Unknown justin.lu Oracle JDK-8296993 ISO 4217 Amendment 173 Update
292 me @mostlynerdless.de johannes.bechberger SAP JDK-8296940 AsyncGetCallTrace might acquire a lock via JavaThread::thread_from_jni_environment
295 mdoerr Unknown mdoerr Unknown JDK-8296892 [PPC64] JfrGetCallTrace: Need pc == nullptr check before frame constructor
295 goetz Unknown rhalade Unknown JDK-8296868 java/security/cert/pkix/policyChanges/TestPolicy.java is failing
295 goetz Unknown ysatowse Unknown JDK-8296867 (tz) Update Timezone Data to 2022f
295 goetz Unknown aivanov Unknown JDK-8296864 Refactor add/modify notification icon (TrayIcon)
295 goetz Unknown harshitha.onkar Oracle JDK-8296859 System Tray icons get corrupted when Windows scaling changes
295 goetz Unknown lawrence.andrews Oracle JDK-8296858 [macosx] test java/awt/Graphics/TextAAHintsTest.java fails
295 goetz Unknown lawrence.andrews Oracle JDK-8296857 Remove jtreg tag manual=yesno for java/awt/print/Dialog/DialogOrient.java
295 goetz Unknown lawrence.andrews Oracle JDK-8296855 Remove jtreg tag manual=yesno java/awt/print/PrinterJob/PageDialogTest.java
297 scott.gibbons Intel scott.gibbons Intel JDK-8296756 JFR thread sampler SI_KERNEL SEGV in metaspace::VirtualSpaceList::contains
297 scott.gibbons Intel scott.gibbons Intel JDK-8296755 RunThese24H crashes with SEGV in markWord::displaced_mark_helper() after JDK-8268276
297 sviswanathan Unknown jiefu Unknown JDK-8296752 Minimal VM build fails after JDK-8273459
297 sviswanathan Unknown scott.gibbons Intel JDK-8296751 Update code segment alignment to 64 bytes
297 sviswanathan Unknown scott.gibbons Intel JDK-8296750 Base64 Encoding optimization enhancements for x86 using AVX-512
297 scott.gibbons Intel scott.gibbons Intel JDK-8296735 Base64 Decoding optimization for x86 using AVX-512
297 ihse Unknown ihse Unknown JDK-8296732 GHA ::set-output is deprecated and will be removed
297 vrudomet Unknown rhalade Unknown JDK-8296713 BuildEEBasicConstraints.java test fails with SunCertPathBuilderException
297 clanger Unknown rhalade Unknown JDK-8296667 Update test artifacts in QuoVadis CA interop tests
298 goetz Unknown smandalika Unknown JDK-8296540 Create an automated test for JDK-4516019
298 goetz Unknown lawrence.andrews Oracle JDK-8296537 Remove jtreg tag manual=yesno for java/awt/Graphics/LCDTextAndGraphicsState.java & show test instruction
298 shade Unknown shade Unknown JDK-8296536 Linux os::cpu_microcode_revision() stalls cold startup
298 shade Unknown shade Unknown JDK-8296527 x86: Use short jumps in TIG::set_vtos_entry_points
298 shade Unknown shade Unknown JDK-8296526 sun/security/pkcs11/Signature/TestDSAKeyLength.java fails when NSS version detection fails
298 shade Unknown matias Independent JDK-8296522 java_lang_System::allow_security_manager() doesn't set its initialization flag
299 clanger Unknown djelinski Unknown JDK-8296474 Test jdk/sun/security/ssl/SSLSessionImpl/NoInvalidateSocketException.java fails with "tag mismatch"
299 goetz Unknown weijun Unknown JDK-8296465 sspi_bridge.dll not built if BUILD_CRYPTO is false
302 serb Unknown serb Unknown JDK-8296373 Move the "sizecalc.h" to the correct location
303 goetz Unknown kevinw Unknown JDK-8296310 Posix signal handler modification warning triggering incorrectly
303 goetz Unknown manc Unknown JDK-8296309 SIGQUIT and jcmd attaching mechanism does not work with signal chaining library
303 goetz Unknown lmesnik Unknown JDK-8296307 Stress test times out because of long ObjectSynchronizer::monitors_iterate(...) operation
304 ruiamzn Amazon asemenov Unknown JDK-8296259 NSAccessibilityShowMenuAction not working for text editors
304 ruiamzn Amazon mseledtsov Unknown JDK-8296257 Add linux-aarch64 to test-make profiles
304 zzambers Red Hat zzambers Red Hat JDK-8296232 SSLSocketImpl should not use user_canceled workaround when not necessary
304 mbaesken Unknown mbaesken Unknown JDK-8296218 Improve container information
306 vrudomet Unknown cjplummer Unknown JDK-8296146 convert clhsdb "whatis" command from javascript to java
307 joshcao Amazon psadhukhan Unknown JDK-8296105 javax/swing/JMenu/4515762/bug4515762.java fails on macOS 12
307 joshcao Amazon joshcao Amazon JDK-8296103 Some vm_flags tests associate with a wrong BugID
308 vrudomet Unknown azvegint Unknown JDK-8296096 [TESTBUG] DefaultMenuBarTest.java failing on macos
308 vrudomet Unknown mvs Unknown JDK-8296095 Write a regression test for JDK-4659800
309 adinn Unknown sspitsyn Unknown JDK-8296041 com/sun/jdi/ClassUnloadEventTest.java failed with: Wrong number of class unload events: expected 10 got 4
309 adinn Unknown cjplummer Unknown JDK-8296038 com/sun/jdi/ClassUnloadEventTest.java failed due to classes not unloading
309 adinn Unknown cjplummer Unknown JDK-8296034 Improve debuggee logging for com/sun/jdi/ClassUnloadEventTest.java
309 roland Unknown N/A Unknown JDK-8296032 Shenandoah: SIGSEGV in vm maybe related to jit compiling xerces
309 adinn Unknown cjplummer Unknown JDK-8296031 Add delay to ClassUnloadEventTest before exiting to give time for JVM to send all events before VMDeath
309 adinn Unknown sspitsyn Unknown JDK-8296029 misc tests fail: assert(!thread->owns_locks()) failed: must release all locks when leaving VM
309 adinn Unknown zgu Unknown JDK-8296028 Delayed/missed jdwp class unloading events
310 itakiguchi Unknown itakiguchi Unknown JDK-8296015 CustomTzIDCheckDST.java testcase failed on AIX platform
310 vrudomet Unknown prr Unknown JDK-8296008 Problem list 4 jtreg tests which regularly fail on macos-aarch64
310 stuefe Unknown stuefe Unknown JDK-8295983 Stray suffix when starting gtests via GTestWrapper.java
311 mbaesken Unknown mbaesken Unknown JDK-8295943 EncodingSupport_md.c convertUtf8ToPlatformString wrong placing of free
311 mbaesken Unknown mbaesken Unknown JDK-8295942 support latest VS2022 MSC_VER in abstract_vm_version.cpp
311 mbaesken Unknown mbaesken Unknown JDK-8295941 unify Windows 2019 version check in os_windows and java_props_md
311 mbaesken Unknown mbaesken Unknown JDK-8295932 langtools OptionalDependencyTest.java use File.pathSeparator
311 clanger Unknown djelinski1 Independent JDK-8295928 Missing SessionID in TLS1.3 resumption in compatibility mode
312 stuefe Unknown stuefe Unknown JDK-8295888 NMT should print total malloc bytes and invocation count
312 mbaesken Unknown mbaesken Unknown JDK-8295880 jdeps InverseDepsAnalyzer runs into NoSuchElementException: No value present
312 goetz Unknown N/A Unknown JDK-8295878 Update harfbuzz md file
312 goetz Unknown jpai Unknown JDK-8295877 sun/management/jmxremote/bootstrap/RmiBootstrapTest.java#id1 failed with "SSLHandshakeException: Remote host terminated the handshake"
312 goetz Unknown tschatzl Unknown JDK-8295876 gc/g1/mixedgc/TestOldGenCollectionUsage.java (still) assumes that GCs take 1ms minimum
312 goetz Unknown weijun Unknown JDK-8295875 Accept CAs with BasicConstraints without pathLenConstraint
312 goetz Unknown rreddy Unknown JDK-8295874 java/util/zip/CloseInflaterDeflaterTest.java failed with "AssertionError: Expected IOException to be thrown, but nothing was thrown"
312 mbaesken Unknown mbaesken Unknown JDK-8295866 Improve UnsatisfiedLinkError error message to include dlopen error details
313 serb Unknown kizune Unknown JDK-8295852 [macos] VoiceOver : Getting java.lang.IllegalArgumentException: Invalid location on Editable JComboBox
316 ruiamzn Amazon asemenov Unknown JDK-8295805 [macos] Voice over reads the boolean value as null in the JTable
316 shade Unknown shade Unknown JDK-8295770 S390X: Optimized builds are broken
317 mdoerr Unknown mdoerr Unknown JDK-8295733 [PPC64] C2: Missing is_oop information when using disjoint compressed oops mode
318 dchuyko Unknown jiefu Unknown JDK-8295691 Make CodeCacheSegmentSize a product flag
318 goetz Unknown goetz Unknown JDK-8295641 Fix DEFAULT_PROMOTED_VERSION_PRE=ea for -dev
319 andrew Unknown alvdavi Amazon JDK-8295504 (tz) Update Timezone Data to 2022e
319 goetz Unknown aph Unknown JDK-8295484 java -XX:BlockZeroingLowLimit=1 crashes after 8270947
319 goetz Unknown aph Unknown JDK-8295483 compiler/codecache/TestStressCodeBuffers.java crashes with "failed to allocate space for trampoline"
319 goetz Unknown shade Unknown JDK-8295482 AArch64 "core" variant does not build after JDK-8270947
319 goetz Unknown haosun Unknown JDK-8295481 AArch64: C1 build failed after JDK-8270947
319 goetz Unknown aph Unknown JDK-8295480 AArch64: C1: use zero_words to initialize all objects
319 goetz Unknown joe.cherian Oracle JDK-8295479 Change bugs.java.com and bugreport.java.com URL's to https
319 goetz Unknown weijun Unknown JDK-8295478 Code change of JDK-8282730 not updated to reflect CSR update
319 goetz Unknown weijun Unknown JDK-8295474 LdapLoginModule throw NPE from logout method after login failure
319 goetz Unknown hchao Unknown JDK-8295473 keytool does not accurately warn about algorithms that are disabled but have additional constraints
319 goetz Unknown emoryzheng Tencent JDK-8295472 test/hotspot/jtreg/vmTestbase/vm/mlvm/meth/stress/jni/nativeAndMH/Test.java crash with small heap (-Xmx50m)
319 goetz Unknown mvs Unknown JDK-8295467 java/awt/dnd/MissingDragExitEventTest/MissingDragExitEventTest.java fails
320 xliu Unknown dcubed Unknown JDK-8295421 ProblemList runtime/jni/checked/TestPrimitiveArrayCriticalWithBadParam.java on macosx-x64
320 xliu Unknown dcubed Unknown JDK-8295420 ProblemList 7 serviceability/sa tests on macosx-x64
320 sgehwolf Unknown iklam Unknown JDK-8295397 Add cgroups keyword to TestDockerBasic.java
321 goetz Unknown jiefu Unknown JDK-8295386 compiler/c2/cr6865031/Test.java and compiler/runtime/Test6826736.java fails on x86_32
321 goetz Unknown dnguyen Unknown JDK-8295385 Update freetype md file
323 sgehwolf Unknown sgehwolf Unknown JDK-8295352 [Metrics] Incorrectly detected resource limits with additional cgroup fs mounts
323 nikita.gubarkov JetBrains nikita.gubarkov JetBrains JDK-8295349 macOS: SIGSEGV at [CoreFoundation] CFArrayGetCount / sun.font.CFont.getTableBytesNative
323 sgehwolf Unknown casparcwang Tencent JDK-8295347 Incorrect container resource limit detection if manual cgroup fs mounts present
324 svkamath Unknown AJ-Ferguson Independent JDK-8295296 AES-CTR cipher state corruption with AVX-512
324 wkemper Unknown mvs Unknown JDK-8295292 Create a regression test for JDK-4666101
324 mbaesken Unknown aturbanov Unknown JDK-8295279 test/java/io/File/GetXSpace.java fails on Windows with mapped network drives.
325 vrudomet Unknown mvs Unknown JDK-8295235 Create a regression test for JDK-4515999
325 eastigeevich Unknown bulasevich Unknown JDK-8295233 compiler/c2/aarch64/TestFarJump.java fails with "RuntimeException: for CodeHeap < 250MB the far jump is expected to be encoded with a single branch instruction"
326 eastigeevich Unknown bulasevich Unknown JDK-8295147 Reorder code cache segments to improve code density
326 johannes.bechberger SAP johannes.bechberger SAP JDK-8295120 Zero does not build on Mac OS X due to missing os::current_thread_enable_wx implementation
327 vrudomet Unknown harshitha.onkar Oracle JDK-8295084 ChildAlwaysOnTopTest.java fails with "RuntimeException: Failed to unset alwaysOnTop"
327 mbalao Unknown N/A Unknown JDK-8295083 Closed test fails after JDK-8276108 on aarch64
327 vrudomet Unknown kizune Unknown JDK-8295077 Reg test: java/awt/Toolkit/ScreenInsetsTest/ScreenInsetsTest.java fails in Windows
327 christoph.langer SAP christoph.langer SAP JDK-8295635 [17u] Remove designator DEFAULT_PROMOTED_VERSION_PRE=ea for release 17.0.5
327 goetz Unknown roland Unknown JDK-8295042 assert(false) failed: infinite loop in PhaseIterGVN::optimize
327 goetz Unknown hchao Unknown JDK-8295038 Improve "keytool -printcert -jarfile" output
330 mbaesken Unknown mbaesken Unknown JDK-8294981 simplify cleanups in NTLMAuthSequence getCredentialsHandle
331 lutkerd Amazon emcmanus Unknown JDK-8294925 Optional.toString() is unnecessarily expensive
331 johannes.bechberger SAP johannes.bechberger SAP JDK-8294915 FFI_GO_CLOSURES macro not defined but required for zero build on Mac OS X
332 dchuyko Unknown fgao Unknown JDK-8294873 AArch64: Combine shift and negate to a single instruction
332 mbaesken Unknown mbaesken Unknown JDK-8294835 Java_sun_awt_shell_Win32ShellFolder2_getLinkLocation check MultiByteToWideChar return value for failures
332 goetz Unknown rsunderbabu Unknown JDK-8294833 vmTestbase/gc/gctests/LoadUnloadGC2/LoadUnloadGC2.java fails intermittently with exit code 1
332 goetz Unknown ysatowse Unknown JDK-8294832 (tz) Update Timezone Data to 2022d
332 goetz Unknown roland Unknown JDK-8294831 Assertion in PhaseIdealLoop::skeleton_predicate_has_opaque after JDK-8289127
332 goetz Unknown vlivanov Unknown JDK-8294830 CI: ciBytecodeStream::get_klass() is not consistent
332 goetz Unknown vlivanov Unknown JDK-8294828 C1: Missing access check on non-accessible class
332 goetz Unknown dlong Unknown JDK-8294827 assert(ctrl == kit.control()) failed: Control flow was added although the intrinsic bailed out
332 goetz Unknown roland Unknown JDK-8294826 C2: assert(BoolTest(btest).is_canonical()) failure
332 goetz Unknown roland Unknown JDK-8294824 Incorrect result when switching to C2 OSR compilation from C1
332 goetz Unknown chagedorn Unknown JDK-8294822 C2: assert(r != __null && r->is_Region()) failed: this phi must have a region
333 goetz Unknown hseigel Unknown JDK-8294804 JVM crash with GenerateOopMap::error_work(char const*, __va_list_tag*)
333 goetz Unknown achung Unknown JDK-8294803 [macosx] Aqua: java/awt/image/multiresolution/MultiresolutionIconTest.java
333 goetz Unknown thartmann Unknown JDK-8294801 StringConcat::validate_mem_flow asserts with "unexpected user: StoreI"
333 goetz Unknown cjplummer Unknown JDK-8294800 serviceability/sa/TestClassDump.java could leave files owned by root on macOS
333 goetz Unknown ccheung Unknown JDK-8294799 Some custom loader tests failed due to symbol refcount not decremented
333 goetz Unknown ccheung Unknown JDK-8294798 CDS test HelloUnload.java should not use literal string as ClassLoader name
333 vrudomet Unknown roland Unknown JDK-8294791 Segfault at PhaseIdealLoop::clone_loop_handle_data_uses
333 mdoerr Unknown mdoerr Unknown JDK-8294756 [PPC64] JfrGetCallTrace: assert(_pc != nullptr) failed: must have PC
334 yftsai Amazon eliu Unknown JDK-8294737 AArch64: Incorrect replicate2L_zero rule
334 zzambers Red Hat zzambers Red Hat JDK-8294736 Fix race condition in pkcs11 SessionManager
334 vrudomet Unknown jlahoda Unknown JDK-8294732 Duplicate ldc generated by javac
337 rmarchenko Azul mikael Unknown JDK-8294674 Uninitialized warning in check_code.c with GCC 11.2
338 vrudomet Unknown joehw Unknown JDK-8294614 Document.normalizeDocument() produces different results
338 goetz Unknown djelinski Unknown JDK-8294572 sun/net/www/http/KeepAliveCache/KeepAliveProperty.java failed with "RuntimeException: Failed in server"
338 goetz Unknown lawrence.andrews Oracle JDK-8294571 java/awt/a11y/AccessibleJPopupMenuTest.java test fails with java.lang.NullPointerException
339 dchuyko Unknown xlinzheng Unknown JDK-8294532 Remove unnecessary register push for MacroAssembler::check_klass_subtype_slow_path
339 mbaesken Unknown mbaesken Unknown JDK-8294531 mscapi destroyKeyContainer enhance KeyStoreException: Access is denied exception
339 mbaesken Unknown mbaesken Unknown JDK-8294524 Adjust PKCS11Exception and handle more PKCS11 error codes
339 goetz Unknown smandalika Unknown JDK-8294508 Create a Regression test for JDK-4515031
339 goetz Unknown mvs Unknown JDK-8294507 java/awt/dnd/DropTargetInInternalFrameTest/DropTargetInInternalFrameTest.html times out and fails in Windows
339 goetz Unknown aivanov Unknown JDK-8294506 Resolve IDE warnings in WTrayIconPeer and SystemTray
339 goetz Unknown smandalika Unknown JDK-8294505 Create an automated test for JDK-4495286
339 goetz Unknown jiefu Unknown JDK-8294504 javax/accessibility/4702233/AccessiblePropertiesTest.java fails to compile
339 goetz Unknown smandalika Unknown JDK-8294503 Create an automated test for JDK-4702233
339 goetz Unknown smandalika Unknown JDK-8294502 Create a regression test for JDK-4702690
339 goetz Unknown prr Unknown JDK-8294501 Some jtreg sound tests should be marked with sound keyword
339 goetz Unknown lawrence.andrews Oracle JDK-8294500 Remove jtreg tag manual=yesno for java/awt/print/PrinterJob/PageRangesDlgTest.java
339 goetz Unknown wanghaomin Loongson JDK-8294499 The array length of testSmallConstArray should be small and const
339 goetz Unknown alisen.chung Oracle JDK-8294498 [TESTBUG] DoubleClickTitleBarTest.java fails on macOs
341 goetz Unknown lawrence.andrews Oracle JDK-8294352 Remove jtreg tag manual=yesno for java/awt/print/PrinterJob/ImagePrinting/ClippedImages.java
341 goetz Unknown ccheung Unknown JDK-8294351 JDK-8286460 causes tests to fail to compile in Tier2
341 goetz Unknown cstein Unknown JDK-8294344 Remove dependence on JAR filename in CDS tests
341 goetz Unknown lawrence.andrews Oracle JDK-8294343 java/awt/GraphicsDevice/DisplayModes/CycleDMImage.java is entered twice in ProblemList
341 tsteele Unknown tsteele Unknown JDK-8294341 GPL Classpath exception missing from assemblyprefix.h
343 Gaurav.Chaudhari IBM deigue Independent JDK-8294318 [REDO] DST not applying properly with zone id offset set with TZ env variable
345 alvdavi Amazon ysatowse Unknown JDK-8294493 (tz) Update Timezone Data to 2022c
345 vrudomet Unknown phh Unknown JDK-8294257 JFR: jfr/event/oldobject/TestClassLoaderLeak.java still fails when GC cycles are not happening
345 goetz Unknown mvs Unknown JDK-8294233 Create a test to check the focus stealing of JPopupMenu from JComboBox
345 goetz Unknown lmesnik Unknown JDK-8294232 Test vmTestbase/nsk/stress/except/except010.java times out with -Xcomp -XX:+DeoptimizeALot
345 goetz Unknown dlong Unknown JDK-8294231 compiler/c1/TestPinnedIntrinsics.java failed with "RuntimeException: testCurrentTimeMillis failed with -3"
345 goetz Unknown azvegint Unknown JDK-8294230 [TEST_BUG] Test java/awt/Robot/RobotWheelTest/RobotWheelTest.java fails
345 goetz Unknown azvegint Unknown JDK-8294225 [TEST_BUG] java/awt/Modal/ModalInternalFrameTest/ModalInternalFrameTest.java
345 goetz Unknown dfuchs Unknown JDK-8294223 java/net/httpclient/http2/TLSConnection.java fails intermittently
345 goetz Unknown wetmore Unknown JDK-8294222 sun.security.ssl.SSLEngineImpl.closeInbound also has similar error of JDK-8253368
345 goetz Unknown prr Unknown JDK-8294221 Problem list failing two Robot Screen Capture tests
345 goetz Unknown N/A Unknown JDK-8294220 Add Tests to verify single iteration loops are properly optimized
345 goetz Unknown cjplummer Unknown JDK-8294219 serviceability/sa/ClhsdbScanOops.java can fail due to unexpected GC
345 goetz Unknown cjplummer Unknown JDK-8294218 resourcehogs/serviceability/sa/ClhsdbRegionDetailsScanOopsForG1.java can fail if GC is triggered
345 goetz Unknown cjplummer Unknown JDK-8294214 serviceability/sa/TestObjectMonitorIterate.java is failing due to ObjectMonitor referencing a null Object
345 goetz Unknown emanuel.peter Oracle JDK-8294209 compiler/intrinsics/bmi/verifycode/BzhiTestI2L.java fails with "fatal error: Not compilable at tier 3: CodeBuffer overflow"
345 mbaesken Unknown mbaesken Unknown JDK-8294207 enhance round_up_power_of_2 assertion output
345 goetz Unknown myano Unknown JDK-8294204 java/awt/Graphics2D/CopyAreaOOB.java fails
345 goetz Unknown cjplummer Unknown JDK-8294203 serviceability/sa/TestJhsdbJstackLock.java fails to find '^\s+- waiting to lock <0x[0-9a-f]+> \(a java\.lang\.Class ...'
345 goetz Unknown prr Unknown JDK-8294200 Update or Problem List tests which may fail with uiScale=2 on macOS
346 svkamath Unknown scott.gibbons Intel JDK-8294139 Accelerate CRC32-C
348 goetz Unknown egahlin Unknown JDK-8294026 jdk/jfr/api/recording/time/TestTimeMultiple.java failed with "RuntimeException: getStopTime() > afterStop"
348 goetz Unknown egahlin Unknown JDK-8294023 jdk/jfr/api/consumer/streaming/TestLatestEvent.java times out
348 goetz Unknown weijun Unknown JDK-8294022 entries.remove(entry) is useless in PKCS12KeyStore
348 goetz Unknown stuefe Unknown JDK-8294021 TestMetaspaceAllocationMT2.java#ndebug-default fails with "RuntimeException: Committed seems high: NNNN expected at most MMMM"
348 goetz Unknown pliden Unknown JDK-8294019 ZGC: runtime/InternalApi/ThreadCpuTimesDeadlock.java#id1 failed with "OutOfMemoryError: Java heap space"
348 goetz Unknown alisen.chung Oracle JDK-8294018 [TESTBUG] WindowOwnedByEmbeddedFrameTest.java fails on macos
348 goetz Unknown stuefe Unknown JDK-8294017 Metaspace: test repeated deallocations
348 apavlyutkin Azul jfranck Unknown JDK-8294005 AssertionError in Annotate.fromAnnotations with -Xdoclint
351 goetz Unknown azvegint Unknown JDK-8293912 java/awt/Window/ShapedAndTranslucentWindows/Common.java delay is too high
351 goetz Unknown lawrence.andrews Oracle JDK-8293911 Remove jtreg tag manual=yesno for java/awt/print/PrinterJob/ImagePrinting/ImageTypes.java & show test UI
351 goetz Unknown mullan Unknown JDK-8294105 jarsigner prints invalid digest/signature algorithm warnings if keysize is weak/disabled
351 goetz Unknown lawrence.andrews Oracle JDK-8293908 [TESTBUG] java/awt/print/Dialog/DialogCopies.java does not show instruction
351 goetz Unknown aivanov Unknown JDK-8293907 [TEST_BUG] Automate NimbusJTreeSelTextColor.java
351 goetz Unknown lawrence.andrews Oracle JDK-8293906 TEST_BUG: closed/javax/sound/midi/Synthesizer/Receiver/bug6186488.java fails
351 goetz Unknown iklam Unknown JDK-8293905 Split cds/SharedBaseAddress.java test into smaller parts
351 goetz Unknown cgo Unknown JDK-8293904 compiler/codegen/TestCharVect2.java fails for client VMs
351 goetz Unknown dcubed Unknown JDK-8293903 ProblemList applications/jcstress/acqrel.java on linux-aarch64
351 goetz Unknown dcubed Unknown JDK-8293902 ProblemList compiler/onSpinWait/TestOnSpinWaitAArch64DefaultFlags.java on linux-aarch64
351 goetz Unknown dcubed Unknown JDK-8293901 ProblemList runtime/ErrorHandling/CreateCoredumpOnCrash.java on macosx-X64
351 goetz Unknown joehw Unknown JDK-8293900 jcup.md missing additional text
351 goetz Unknown joehw Unknown JDK-8293898 Missing notice in dom.md
352 mbalao Unknown tschatzl Unknown JDK-8293882 Fix compilation on macosx-aarch64 after 8276108
352 alvdavi Amazon ysatowse Unknown JDK-8294104 Add legacy tz tests to OpenJDK
352 mbalao Unknown phedlin Unknown JDK-8293878 Wrong instruction generation in aarch64 backend
352 dchuyko Unknown dchuyko Unknown JDK-8293866 AArch64: Use ZR for integer zero immediate volatile stores
352 apavlyutkin Azul jlahoda Unknown JDK-8293854 NullPointerException not reported
353 phh Unknown shade Unknown JDK-8293825 jfr/event/oldobject/TestClassLoaderLeak.java fails when GC cycles are not happening
354 dchuyko Unknown eosterlund Unknown JDK-8293750 C2 fast_unlock intrinsic on AArch64 has unnecessary ownership check
354 bulasevich Unknown redestad Unknown JDK-8293706 Reduce branches decoding latin-1 chars from UTF-8 encoded bytes
354 bulasevich Unknown redestad Unknown JDK-8293705 AARCH64: Untaken branch in has_negatives stub
354 bulasevich Unknown jbhateja Unknown JDK-8293704 Redundant unsafe opmask register allocation in some instruction patterns.
355 dchuyko Unknown zmiao Unknown JDK-8293671 AArch64: Merge LDR instructions to improve C1 OSR performance
355 ryan.flegel @fcc-fac.ca mbalao Unknown JDK-8293664 Retrying a failed authentication on multiple LDAP servers can lead to users blocked
360 jdowland Unknown kizune Unknown JDK-8293505 [macos] a11y : Screen magnifier shows extra characters (0) at the end JButton accessibility name
361 bobpengxie Tencent jiefu Unknown JDK-8293463 [C2 cleanup] Remove unused other_path arg in Parse::adjust_map_after_if
361 jdowland Unknown jdowland Unknown JDK-8293447 [Metrics] Reported memory limit may exceed physical machine memory
361 yftsai Amazon dlong Unknown JDK-8293442 AArch64: C2 compilation fails with guarantee(!true || (true && (shift != 0))) failed: impossible encoding
361 mbaesken Unknown mbaesken Unknown JDK-8293401 containers/docker/TestMemoryWithCgroupV1.java fails on linux ppc64le machine with missing Memory and Swap Limit output
365 snazarki Unknown bulasevich Unknown JDK-8293312 ARM32: missing LIR_Assembler::cmove metadata type support
366 jdowland Unknown jdowland Unknown JDK-8293199 Detected container memory limit may exceed physical machine memory
366 clanger Unknown clanger Unknown JDK-8292888 Bump update version for OpenJDK: jdk-17.0.6

No changesets log

Committer push log

Gaurav.Chaudhari, IBM

Bug Summary
JDK-8294318 [REDO] DST not applying properly with zone id offset set with TZ env variable

adinn, Unknown

Bug Summary
JDK-8296031 Add delay to ClassUnloadEventTest before exiting to give time for JVM to send all events before VMDeath
JDK-8296038 com/sun/jdi/ClassUnloadEventTest.java failed due to classes not unloading
JDK-8296041 com/sun/jdi/ClassUnloadEventTest.java failed with: Wrong number of class unload events: expected 10 got 4
JDK-8296028 Delayed/missed jdwp class unloading events
JDK-8296034 Improve debuggee logging for com/sun/jdi/ClassUnloadEventTest.java
JDK-8296029 misc tests fail: assert(!thread->owns_locks()) failed: must release all locks when leaving VM

alvdavi, Amazon

Bug Summary
JDK-8294493 (tz) Update Timezone Data to 2022c
JDK-8294104 Add legacy tz tests to OpenJDK

andrew, Unknown

Bug Summary
JDK-8295504 (tz) Update Timezone Data to 2022e
JDK-8298689 (tz) Update Timezone Data to 2022g
JDK-8297225 Update CLDR data following tzdata 2022c update

apavlyutkin, Azul

Bug Summary
JDK-8294005 AssertionError in Annotate.fromAnnotations with -Xdoclint
JDK-8293854 NullPointerException not reported

aph, Unknown

Bug Summary
JDK-8298028 AArch64: Enable AES/GCM Intrinsics

bobpengxie, Tencent

Bug Summary
JDK-8293463 [C2 cleanup] Remove unused other_path arg in Parse::adjust_map_after_if

btaylor, Unknown

Bug Summary
JDK-8297789 building.md should link to both md and html
JDK-8297876 Introduce UTIL_ARG_WITH
JDK-8298036 Optionally add get-task-allow entitlement to macos binaries

bulasevich, Unknown

Bug Summary
JDK-8293705 AARCH64: Untaken branch in has_negatives stub
JDK-8293706 Reduce branches decoding latin-1 chars from UTF-8 encoded bytes
JDK-8293704 Redundant unsafe opmask register allocation in some instruction patterns.

christoph.langer, SAP

Bug Summary
JDK-8295635 [17u] Remove designator DEFAULT_PROMOTED_VERSION_PRE=ea for release 17.0.5
JDK-8299392 [17u] Remove designator DEFAULT_PROMOTED_VERSION_PRE=ea for release 17.0.6

clanger, Unknown

Bug Summary
JDK-8292888 Bump update version for OpenJDK: jdk-17.0.6
JDK-8297592 JFR: File Read event for RandomAccessFile::write(byte[]) is incorrect
JDK-8295928 Missing SessionID in TLS1.3 resumption in compatibility mode
JDK-8296474 Test jdk/sun/security/ssl/SSLSessionImpl/NoInvalidateSocketException.java fails with "tag mismatch"
JDK-8296667 Update test artifacts in QuoVadis CA interop tests

dchuyko, Unknown

Bug Summary
JDK-8294873 AArch64: Combine shift and negate to a single instruction
JDK-8293671 AArch64: Merge LDR instructions to improve C1 OSR performance
JDK-8293866 AArch64: Use ZR for integer zero immediate volatile stores
JDK-8293750 C2 fast_unlock intrinsic on AArch64 has unnecessary ownership check
JDK-8297212 Improve InterpreterCodelet data footprint
JDK-8295691 Make CodeCacheSegmentSize a product flag
JDK-8294532 Remove unnecessary register push for MacroAssembler::check_klass_subtype_slow_path

eastigeevich, Unknown

Bug Summary
JDK-8295233 compiler/c2/aarch64/TestFarJump.java fails with "RuntimeException: for CodeHeap < 250MB the far jump is expected to be encoded with a single branch instruction"
JDK-8295147 Reorder code cache segments to improve code density

goetz, Unknown

Bug Summary
JDK-8294832 (tz) Update Timezone Data to 2022d
JDK-8296867 (tz) Update Timezone Data to 2022f
JDK-8294803 [macosx] Aqua: java/awt/image/multiresolution/MultiresolutionIconTest.java
JDK-8296858 [macosx] test java/awt/Graphics/TextAAHintsTest.java fails
JDK-8293907 [TEST_BUG] Automate NimbusJTreeSelTextColor.java
JDK-8294225 [TEST_BUG] java/awt/Modal/ModalInternalFrameTest/ModalInternalFrameTest.java
JDK-8294230 [TEST_BUG] Test java/awt/Robot/RobotWheelTest/RobotWheelTest.java fails
JDK-8294498 [TESTBUG] DoubleClickTitleBarTest.java fails on macOs
JDK-8293908 [TESTBUG] java/awt/print/Dialog/DialogCopies.java does not show instruction
JDK-8294018 [TESTBUG] WindowOwnedByEmbeddedFrameTest.java fails on macos
JDK-8295482 AArch64 "core" variant does not build after JDK-8270947
JDK-8295481 AArch64: C1 build failed after JDK-8270947
JDK-8295480 AArch64: C1: use zero_words to initialize all objects
JDK-8295875 Accept CAs with BasicConstraints without pathLenConstraint
JDK-8294220 Add Tests to verify single iteration loops are properly optimized
JDK-8294827 assert(ctrl == kit.control()) failed: Control flow was added although the intrinsic bailed out
JDK-8295042 assert(false) failed: infinite loop in PhaseIterGVN::optimize
JDK-8294831 Assertion in PhaseIdealLoop::skeleton_predicate_has_opaque after JDK-8289127
JDK-8294828 C1: Missing access check on non-accessible class
JDK-8294826 C2: assert(BoolTest(btest).is_canonical()) failure
JDK-8294822 C2: assert(r != __null && r->is_Region()) failed: this phi must have a region
JDK-8294798 CDS test HelloUnload.java should not use literal string as ClassLoader name
JDK-8295479 Change bugs.java.com and bugreport.java.com URL's to https
JDK-8294830 CI: ciBytecodeStream::get_klass() is not consistent
JDK-8295478 Code change of JDK-8282730 not updated to reflect CSR update
JDK-8294231 compiler/c1/TestPinnedIntrinsics.java failed with "RuntimeException: testCurrentTimeMillis failed with -3"
JDK-8295386 compiler/c2/cr6865031/Test.java and compiler/runtime/Test6826736.java fails on x86_32
JDK-8295483 compiler/codecache/TestStressCodeBuffers.java crashes with "failed to allocate space for trampoline"
JDK-8293904 compiler/codegen/TestCharVect2.java fails for client VMs
JDK-8294209 compiler/intrinsics/bmi/verifycode/BzhiTestI2L.java fails with "fatal error: Not compilable at tier 3: CodeBuffer overflow"
JDK-8294508 Create a Regression test for JDK-4515031
JDK-8294502 Create a regression test for JDK-4702690
JDK-8294233 Create a test to check the focus stealing of JPopupMenu from JComboBox
JDK-8294505 Create an automated test for JDK-4495286
JDK-8296540 Create an automated test for JDK-4516019
JDK-8294503 Create an automated test for JDK-4702233
JDK-8294022 entries.remove(entry) is useless in PKCS12KeyStore
JDK-8295641 Fix DEFAULT_PROMOTED_VERSION_PRE=ea for -dev
JDK-8295876 gc/g1/mixedgc/TestOldGenCollectionUsage.java (still) assumes that GCs take 1ms minimum
JDK-8295038 Improve "keytool -printcert -jarfile" output
JDK-8294824 Incorrect result when switching to C2 OSR compilation from C1
JDK-8296993 ISO 4217 Amendment 173 Update
JDK-8300465 ISO 4217 Amendment 174 Update
JDK-8294105 jarsigner prints invalid digest/signature algorithm warnings if keysize is weak/disabled
JDK-8295484 java -XX:BlockZeroingLowLimit=1 crashes after 8270947
JDK-8294571 java/awt/a11y/AccessibleJPopupMenuTest.java test fails with java.lang.NullPointerException
JDK-8294507 java/awt/dnd/DropTargetInInternalFrameTest/DropTargetInInternalFrameTest.html times out and fails in Windows
JDK-8295467 java/awt/dnd/MissingDragExitEventTest/MissingDragExitEventTest.java fails
JDK-8294204 java/awt/Graphics2D/CopyAreaOOB.java fails
JDK-8294343 java/awt/GraphicsDevice/DisplayModes/CycleDMImage.java is entered twice in ProblemList
JDK-8293912 java/awt/Window/ShapedAndTranslucentWindows/Common.java delay is too high
JDK-8294223 java/net/httpclient/http2/TLSConnection.java fails intermittently
JDK-8296868 java/security/cert/pkix/policyChanges/TestPolicy.java is failing
JDK-8300466 java/text/Format/NumberFormat/CurrencyFormat.java fails for hr_HR
JDK-8295874 java/util/zip/CloseInflaterDeflaterTest.java failed with "AssertionError: Expected IOException to be thrown, but nothing was thrown"
JDK-8294504 javax/accessibility/4702233/AccessiblePropertiesTest.java fails to compile
JDK-8293900 jcup.md missing additional text
JDK-8299355 JDI ObjectReference/referringObjects/referringObjects001 fails: assert(env->is_enabled(JVMTI_EVENT_OBJECT_FREE)) failed: checking
JDK-8294351 JDK-8286460 causes tests to fail to compile in Tier2
JDK-8294023 jdk/jfr/api/consumer/streaming/TestLatestEvent.java times out
JDK-8294026 jdk/jfr/api/recording/time/TestTimeMultiple.java failed with "RuntimeException: getStopTime() > afterStop"
JDK-8294804 JVM crash with GenerateOopMap::error_work(char const*, __va_list_tag*)
JDK-8295473 keytool does not accurately warn about algorithms that are disabled but have additional constraints
JDK-8295474 LdapLoginModule throw NPE from logout method after login failure
JDK-8294017 Metaspace: test repeated deallocations
JDK-8293898 Missing notice in dom.md
JDK-8296310 Posix signal handler modification warning triggering incorrectly
JDK-8294221 Problem list failing two Robot Screen Capture tests
JDK-8293903 ProblemList applications/jcstress/acqrel.java on linux-aarch64
JDK-8293902 ProblemList compiler/onSpinWait/TestOnSpinWaitAArch64DefaultFlags.java on linux-aarch64
JDK-8300467 ProblemList java/text/Format/NumberFormat/CurrencyFormat.java
JDK-8293901 ProblemList runtime/ErrorHandling/CreateCoredumpOnCrash.java on macosx-X64
JDK-8297049 Raw inner class constructor ref should not perform diamond inference
JDK-8296864 Refactor add/modify notification icon (TrayIcon)
JDK-8294344 Remove dependence on JAR filename in CDS tests
JDK-8296855 Remove jtreg tag manual=yesno java/awt/print/PrinterJob/PageDialogTest.java
JDK-8296537 Remove jtreg tag manual=yesno for java/awt/Graphics/LCDTextAndGraphicsState.java & show test instruction
JDK-8296857 Remove jtreg tag manual=yesno for java/awt/print/Dialog/DialogOrient.java
JDK-8294352 Remove jtreg tag manual=yesno for java/awt/print/PrinterJob/ImagePrinting/ClippedImages.java
JDK-8293911 Remove jtreg tag manual=yesno for java/awt/print/PrinterJob/ImagePrinting/ImageTypes.java & show test UI
JDK-8294500 Remove jtreg tag manual=yesno for java/awt/print/PrinterJob/PageRangesDlgTest.java
JDK-8294506 Resolve IDE warnings in WTrayIconPeer and SystemTray
JDK-8294218 resourcehogs/serviceability/sa/ClhsdbRegionDetailsScanOopsForG1.java can fail if GC is triggered
JDK-8294219 serviceability/sa/ClhsdbScanOops.java can fail due to unexpected GC
JDK-8294800 serviceability/sa/TestClassDump.java could leave files owned by root on macOS
JDK-8294203 serviceability/sa/TestJhsdbJstackLock.java fails to find '^\s+- waiting to lock <0x[0-9a-f]+> \(a java\.lang\.Class ...'
JDK-8294214 serviceability/sa/TestObjectMonitorIterate.java is failing due to ObjectMonitor referencing a null Object
JDK-8296309 SIGQUIT and jcmd attaching mechanism does not work with signal chaining library
JDK-8294799 Some custom loader tests failed due to symbol refcount not decremented
JDK-8294501 Some jtreg sound tests should be marked with sound keyword
JDK-8293905 Split cds/SharedBaseAddress.java test into smaller parts
JDK-8296465 sspi_bridge.dll not built if BUILD_CRYPTO is false
JDK-8296307 Stress test times out because of long ObjectSynchronizer::monitors_iterate(...) operation
JDK-8294801 StringConcat::validate_mem_flow asserts with "unexpected user: StoreI"
JDK-8294222 sun.security.ssl.SSLEngineImpl.closeInbound also has similar error of JDK-8253368
JDK-8295877 sun/management/jmxremote/bootstrap/RmiBootstrapTest.java#id1 failed with "SSLHandshakeException: Remote host terminated the handshake"
JDK-8294572 sun/net/www/http/KeepAliveCache/KeepAliveProperty.java failed with "RuntimeException: Failed in server"
JDK-8296859 System Tray icons get corrupted when Windows scaling changes
JDK-8294232 Test vmTestbase/nsk/stress/except/except010.java times out with -Xcomp -XX:+DeoptimizeALot
JDK-8295472 test/hotspot/jtreg/vmTestbase/vm/mlvm/meth/stress/jni/nativeAndMH/Test.java crash with small heap (-Xmx50m)
JDK-8293906 TEST_BUG: closed/javax/sound/midi/Synthesizer/Receiver/bug6186488.java fails
JDK-8294021 TestMetaspaceAllocationMT2.java#ndebug-default fails with "RuntimeException: Committed seems high: NNNN expected at most MMMM"
JDK-8294499 The array length of testSmallConstArray should be small and const
JDK-8295385 Update freetype md file
JDK-8295878 Update harfbuzz md file
JDK-8294200 Update or Problem List tests which may fail with uiScale=2 on macOS
JDK-8294833 vmTestbase/gc/gctests/LoadUnloadGC2/LoadUnloadGC2.java fails intermittently with exit code 1
JDK-8294019 ZGC: runtime/InternalApi/ThreadCpuTimesDeadlock.java#id1 failed with "OutOfMemoryError: Java heap space"

ihse, Unknown

Bug Summary
JDK-8296732 GHA ::set-output is deprecated and will be removed

itakiguchi, Unknown

Bug Summary
JDK-8296015 CustomTzIDCheckDST.java testcase failed on AIX platform

jdowland, Unknown

Bug Summary
JDK-8293505 [macos] a11y : Screen magnifier shows extra characters (0) at the end JButton accessibility name
JDK-8293447 [Metrics] Reported memory limit may exceed physical machine memory
JDK-8293199 Detected container memory limit may exceed physical machine memory

johannes.bechberger, SAP

Bug Summary
JDK-8294915 FFI_GO_CLOSURES macro not defined but required for zero build on Mac OS X
JDK-8295120 Zero does not build on Mac OS X due to missing os::current_thread_enable_wx implementation

joshcao, Amazon

Bug Summary
JDK-8296105 javax/swing/JMenu/4515762/bug4515762.java fails on macOS 12
JDK-8296103 Some vm_flags tests associate with a wrong BugID

lutkerd, Amazon

Bug Summary
JDK-8294925 Optional.toString() is unnecessarily expensive

lzhai, Unknown

Bug Summary
JDK-8297696 jdk/javadoc/doclet/testJavaFX/TestJavaFxMode.java fail with jfx

mbaesken, Unknown

Bug Summary
JDK-8297629 Add cause in a couple of IllegalArgumentException and InvalidParameterException shown by sun/security/pkcs11 tests
JDK-8297140 Add JFR JIT restart event
JDK-8294524 Adjust PKCS11Exception and handle more PKCS11 error codes
JDK-8297926 CLDR v42 update for tzdata 2022f
JDK-8293401 containers/docker/TestMemoryWithCgroupV1.java fails on linux ppc64le machine with missing Memory and Swap Limit output
JDK-8295943 EncodingSupport_md.c convertUtf8ToPlatformString wrong placing of free
JDK-8294207 enhance round_up_power_of_2 assertion output
JDK-8296218 Improve container information
JDK-8295866 Improve UnsatisfiedLinkError error message to include dlopen error details
JDK-8294835 Java_sun_awt_shell_Win32ShellFolder2_getLinkLocation check MultiByteToWideChar return value for failures
JDK-8295880 jdeps InverseDepsAnalyzer runs into NoSuchElementException: No value present
JDK-8297251 jdk/jfr/event/compiler/TestJitRestart.java failed with "RuntimeException: No JIT restart event found: expected true, was false"
JDK-8297189 JFR: Change name of jdk.JitRestart
JDK-8295932 langtools OptionalDependencyTest.java use File.pathSeparator
JDK-8294531 mscapi destroyKeyContainer enhance KeyStoreException: Access is denied exception
JDK-8297483 PublicMethodsTest is slow due to dependency verification with debug builds
JDK-8294981 simplify cleanups in NTLMAuthSequence getCredentialsHandle
JDK-8295942 support latest VS2022 MSC_VER in abstract_vm_version.cpp
JDK-8295279 test/java/io/File/GetXSpace.java fails on Windows with mapped network drives.
JDK-8297614 UnexpectedSourceImageSize test times out on slow machines when fastdebug is used
JDK-8295941 unify Windows 2019 version check in os_windows and java_props_md

mbalao, Unknown

Bug Summary
JDK-8295083 Closed test fails after JDK-8276108 on aarch64
JDK-8293882 Fix compilation on macosx-aarch64 after 8276108
JDK-8293878 Wrong instruction generation in aarch64 backend

mdoerr, Unknown

Bug Summary
JDK-8295733 [PPC64] C2: Missing is_oop information when using disjoint compressed oops mode
JDK-8294756 [PPC64] JfrGetCallTrace: assert(_pc != nullptr) failed: must have PC
JDK-8296892 [PPC64] JfrGetCallTrace: Need pc == nullptr check before frame constructor

me, @mostlynerdless.de

Bug Summary
JDK-8296940 AsyncGetCallTrace might acquire a lock via JavaThread::thread_from_jni_environment

nikita.gubarkov, JetBrains

Bug Summary
JDK-8295349 macOS: SIGSEGV at [CoreFoundation] CFArrayGetCount / sun.font.CFont.getTableBytesNative

phh, Unknown

Bug Summary
JDK-8298397 Code signing warnings after JDK-8293550
JDK-8298396 compare.sh fails on macos after JDK-8293550
JDK-8293825 jfr/event/oldobject/TestClassLoaderLeak.java fails when GC cycles are not happening

rmarchenko, Unknown

Bug Summary
JDK-8297553 EndingDotHostname.java test fails because SSL cert expired
JDK-8297516 Trailing dot in hostname causes TLS handshake to fail with SNI disabled
JDK-8297565 Use fixed certificate validation date in SSLExampleCert template

rmarchenko, Azul

Bug Summary
JDK-8294674 Uninitialized warning in check_code.c with GCC 11.2

roland, Unknown

Bug Summary
JDK-8296032 Shenandoah: SIGSEGV in vm maybe related to jit compiling xerces

ruiamzn, Amazon

Bug Summary
JDK-8295805 [macos] Voice over reads the boolean value as null in the JTable
JDK-8296257 Add linux-aarch64 to test-make profiles
JDK-8296259 NSAccessibilityShowMenuAction not working for text editors

ryan.flegel, @fcc-fac.ca

Bug Summary
JDK-8293664 Retrying a failed authentication on multiple LDAP servers can lead to users blocked

scott.gibbons, Intel

Bug Summary
JDK-8296735 Base64 Decoding optimization for x86 using AVX-512
JDK-8296756 JFR thread sampler SI_KERNEL SEGV in metaspace::VirtualSpaceList::contains
JDK-8296755 RunThese24H crashes with SEGV in markWord::displaced_mark_helper() after JDK-8268276

serb, Unknown

Bug Summary
JDK-8295852 [macos] VoiceOver : Getting java.lang.IllegalArgumentException: Invalid location on Editable JComboBox
JDK-8296373 Move the "sizecalc.h" to the correct location
JDK-8297913 One more cast in SAFE_SIZE_NEW_ARRAY2
JDK-8297892 Overzealous check in sizecalc.h prevents large memory allocation

sgehwolf, Unknown

Bug Summary
JDK-8297616 [JVMCI] Access to j.l.r.Method/Constructor/Field for ResolvedJavaMethod/ResolvedJavaField
JDK-8297653 [JVMCI] add API for retrieving ConstantValue attributes
JDK-8297651 [JVMCI] HotSpotResolvedJavaFieldImpl.getIndex returns wrong value
JDK-8297620 [JVMCI] list HotSpotConstantPool.loadReferencedType to ConstantPool
JDK-8297658 [JVMCI] rationalize relationship between getCodeSize and getCode in ResolvedJavaMethod
JDK-8295352 [Metrics] Incorrectly detected resource limits with additional cgroup fs mounts
JDK-8297720 [TESTBUG] HotSpotResolvedJavaFieldTest does not run
JDK-8295397 Add cgroups keyword to TestDockerBasic.java
JDK-8299311 Cannot use '-Djava.system.class.loader' with class loader in signed JAR
JDK-8295347 Incorrect container resource limit detection if manual cgroup fs mounts present

shade, Unknown

Bug Summary
JDK-8297621 ARM32-softfp: Do not load CONSTANT_double using the condy helper methods in the interpreter
JDK-8297401 ARM32: Default to {ldrexd,strexd} in StubRoutines::atomic_{load|store}_long
JDK-8297577 ARM32: Improve register dump in hs_err
JDK-8297398 Cleanup resolve() leftovers from BarrierSet et al
JDK-8297321 gc/epsilon/TestMemoryMXBeans.java failed with wrong initial heap size
JDK-8297399 gc/g1/TestShrinkAuxiliaryData30 test fails on large machines
JDK-8296522 java_lang_System::allow_security_manager() doesn't set its initialization flag
JDK-8297324 jdk/nio/zipfs/ZipFSOutputStreamTest.java timed out
JDK-8296536 Linux os::cpu_microcode_revision() stalls cold startup
JDK-8298007 Memory leak in ShenandoahFullGC
JDK-8297319 NMT: Correct NMT tag on CollectedHeap
JDK-8297322 Print error if Shenandoah flags are empty (instead of crashing)
JDK-8295770 S390X: Optimized builds are broken
JDK-8297318 Shenandoah: Remove inaccurate comment on SBS::load_reference_barrier()
JDK-8296526 sun/security/pkcs11/Signature/TestDSAKeyLength.java fails when NSS version detection fails
JDK-8297400 TestStringDeduplicationAgeThreshold intermittent failures on Shenandoah
JDK-8297397 Update JMH devkit to 1.35
JDK-8296527 x86: Use short jumps in TIG::set_vtos_entry_points
JDK-8297323 Zero: Print warnings when unsupported intrinsics are enabled
JDK-8297403 Zero: Support AsyncGetCallTrace

snazarki, Unknown

Bug Summary
JDK-8293312 ARM32: missing LIR_Assembler::cmove metadata type support

stuefe, Unknown

Bug Summary
JDK-8295888 NMT should print total malloc bytes and invocation count
JDK-8295983 Stray suffix when starting gtests via GTestWrapper.java

sviswanathan, Unknown

Bug Summary
JDK-8296750 Base64 Encoding optimization enhancements for x86 using AVX-512
JDK-8296752 Minimal VM build fails after JDK-8273459
JDK-8296751 Update code segment alignment to 64 bytes

svkamath, Unknown

Bug Summary
JDK-8294139 Accelerate CRC32-C
JDK-8295296 AES-CTR cipher state corruption with AVX-512

tsteele, Unknown

Bug Summary
JDK-8294341 GPL Classpath exception missing from assemblyprefix.h

vrudomet, Unknown

Bug Summary
JDK-8296096 [TESTBUG] DefaultMenuBarTest.java failing on macos
JDK-8296713 BuildEEBasicConstraints.java test fails with SunCertPathBuilderException
JDK-8295084 ChildAlwaysOnTopTest.java fails with "RuntimeException: Failed to unset alwaysOnTop"
JDK-8297327 closed sun/java2d/GdiRendering/ClipShapeRendering.java failed with "Incorrect color ffeeeeee instead of ff0000ff in pixel (100, 100)"
JDK-8296146 convert clhsdb "whatis" command from javascript to java
JDK-8297961 Create a regression test for JDK-4424517
JDK-8295235 Create a regression test for JDK-4515999
JDK-8294614 Document.normalizeDocument() produces different results
JDK-8294732 Duplicate ldc generated by javac
JDK-8297983 java.lang.IllegalArgumentException: Negative length on strings concatenation
JDK-8297326 javax/sound/midi/Sequencer/MetaCallback.java failed with timeout
JDK-8297279 javax/swing/JTree/6263446/bug6263446.java fails intermittently on a VM
JDK-8294257 JFR: jfr/event/oldobject/TestClassLoaderLeak.java still fails when GC cycles are not happening
JDK-8296008 Problem list 4 jtreg tests which regularly fail on macos-aarch64
JDK-8295077 Reg test: java/awt/Toolkit/ScreenInsetsTest/ScreenInsetsTest.java fails in Windows
JDK-8297328 Regression Test CoordinateTruncationBug.java fails on OL8.3
JDK-8294791 Segfault at PhaseIdealLoop::clone_loop_handle_data_uses
JDK-8297453 sun/java2d/DirectX/OnScreenRenderingResizeTest/OnScreenRenderingResizeTest.java fails
JDK-8297596 sun/java2d/DirectX/OnScreenRenderingResizeTest/OnScreenRenderingResizeTest.java fails again
JDK-8297595 Update sun/java2d/DirectX/OnScreenRenderingResizeTest/OnScreenRenderingResizeTest.java
JDK-8296095 Write a regression test for JDK-4659800
JDK-8297325 Write a test to verify the content change of TextArea sends TextEvent

wkemper, Unknown

Bug Summary
JDK-8295292 Create a regression test for JDK-4666101

xliu, Unknown

Bug Summary
JDK-8295420 ProblemList 7 serviceability/sa tests on macosx-x64
JDK-8295421 ProblemList runtime/jni/checked/TestPrimitiveArrayCriticalWithBadParam.java on macosx-x64

yftsai, Amazon

Bug Summary
JDK-8293442 AArch64: C2 compilation fails with guarantee(!true || (true && (shift != 0))) failed: impossible encoding
JDK-8294737 AArch64: Incorrect replicate2L_zero rule

zzambers, Red Hat

Bug Summary
JDK-8294736 Fix race condition in pkcs11 SessionManager
JDK-8297459 P11Cipher should not throw out of bounds exception during padding
JDK-8297576 P11PSSSignature.engineUpdate should not print debug messages during normal operation
JDK-8297628 Problemlist existing compiler/rtm tests also on x86
JDK-8296232 SSLSocketImpl should not use user_canceled workaround when not necessary