PUSHES REPORT: 17.0.7

This report shows who pushed the backports to the given release. This usually shows who did the backporting, testing, and review work.

Report generated: Wed Apr 03 06:06:08 CEST 2024

Distribution by priority

Count Priority
1 P1
9 P2
68 P3
164 P4
9 P5

Distribution by components

Count Component
251 100% Total
96 38.2% hotspot
47 18.7% hotspot/compiler
26 10.4% hotspot/runtime
10 4.0% hotspot/svc-agent
7 2.8% hotspot/jfr
2 0.8% hotspot/jvmti
2 0.8% hotspot/svc
1 0.4% hotspot/gc
1 0.4% hotspot/other
48 19.1% core-libs
17 6.8% core-libs/java.net
5 2.0% core-libs/java.util:i18n
4 1.6% core-libs
4 1.6% core-libs/java.lang
3 1.2% core-libs/java.nio
2 0.8% core-libs/java.util.logging
2 0.8% core-libs/java.time
2 0.8% core-libs/java.text
2 0.8% core-libs/java.util.jar
1 0.4% core-libs/java.sql
1 0.4% core-libs/java.util.concurrent
1 0.4% core-libs/java.util
1 0.4% core-libs/java.lang.invoke
1 0.4% core-libs/java.util.stream
1 0.4% core-libs/java.util.regex
1 0.4% core-libs/java.io
35 13.9% client-libs
12 4.8% client-libs/java.awt
9 3.6% client-libs/2d
6 2.4% client-libs/javax.swing
4 1.6% client-libs/javax.accessibility
2 0.8% client-libs
1 0.4% client-libs/java.beans
1 0.4% client-libs/javax.imageio
20 8.0% infrastructure
15 6.0% infrastructure/build
3 1.2% infrastructure
2 0.8% infrastructure/release_eng
19 7.6% security-libs
11 4.4% security-libs/java.security
2 0.8% security-libs/javax.net.ssl
2 0.8% security-libs/javax.crypto
1 0.4% security-libs/jdk.security
1 0.4% security-libs/javax.crypto:pkcs11
1 0.4% security-libs/org.ietf.jgss
1 0.4% security-libs
14 5.6% core-svc
5 2.0% core-svc/debugger
3 1.2% core-svc/java.lang.instrument
3 1.2% core-svc/java.lang.management
2 0.8% core-svc/tools
1 0.4% core-svc/javax.management
11 4.4% tools
4 1.6% tools/javac
3 1.2% tools/javadoc(tool)
1 0.4% tools/jpackage
1 0.4% tools/jshell
1 0.4% tools/jar
1 0.4% tools
7 2.8% xml
6 2.4% xml/jaxp
1 0.4% xml
1 0.4% globalization
1 0.4% globalization/translation

Distribution by affiliation

This Release Pushes

Original Pushes

Count Committer
251 100% Total
168 66.9% SAP
137 54.6% Goetz Lindenmaier
17 6.8% Matthias Baesken
10 4.0% Christoph Langer
2 0.8% Martin Doerr
2 0.8% Richard Reingruber
33 13.1% Amazon
12 4.8% Sergey Bylokhov
9 3.6% Victor Rudometov
5 2.0% Aleksey Shipilev
2 0.8% Paul Hohensee
2 0.8% Ben Taylor
2 0.8% Dan Lutker
1 0.4% Elif Aslan
21 8.4% Red Hat
14 5.6% Thomas Stuefe
6 2.4% Severin Gehwolf
1 0.4% Andrew Hughes
9 3.6% Azul
3 1.2% Ekaterina Vergizova
3 1.2% Radim Vansa
1 0.4% Yuri Nesterenko
1 0.4% Roman Marchenko
1 0.4% Anton Kozlov
3 1.2% Fujitsu
2 0.8% Masanori Yano
1 0.4% nagata.haruhito
3 1.2% IBM
2 0.8% Shruthi Acharya
1 0.4% Ichiroh Takiguchi
3 1.2% NTT DATA
3 1.2% Yasumasa Suenaga
3 1.2% Oracle
1 0.4% Adam Sotona
1 0.4% Alan Bateman
1 0.4% Johan Sjölen
2 0.8% Independent
1 0.4% yifan.tsai
1 0.4% Chris Hegarty
2 0.8% Intel
1 0.4% Scott Gibbons
1 0.4% Jatin Bhateja
1 0.4% Alibaba
1 0.4% Denghui Dong
1 0.4% Ampere
1 0.4% Patrick Zhang
1 0.4% BellSoft
1 0.4% Aleksei Voitylov
1 0.4% Microsoft
1 0.4% George Adams
Count Committer
251 100% Total
145 57.8% Oracle
11 4.4% Christian Hagedorn
10 4.0% Chris Plummer
7 2.8% Emanuel Peter
7 2.8% Daniel Jelinski
6 2.4% Daniel Fuchs
6 2.4% Bill Huang
4 1.6% Roberto Castaneda Lozano
4 1.6% Sean Coffey
4 1.6% Erik Joelsson
4 1.6% Jaikiran Pai
4 1.6% Justin Lu
3 1.2% Tobias Hartmann
3 1.2% Dean Long
3 1.2% Prasanta Sadhukhan
3 1.2% Ravi Gupta
3 1.2% Philip Race
2 0.8% Harshitha Onkar
2 0.8% Alan Bateman
2 0.8% Douglas Simon
2 0.8% Kevin Walls
2 0.8% Alex Menkov
2 0.8% Daniel Daugherty
2 0.8% Magnus Ihse Bursie
2 0.8% Lawrence Andrews
2 0.8% Srinivas Mandalika
2 0.8% David Holmes
2 0.8% Mikhailo Seledtsov
2 0.8% Igor Veresov
2 0.8% Rajan Halade
2 0.8% Naoto Sato
2 0.8% Alisen Chung
1 0.4% Weijun Wang
1 0.4% Markus Grönlund
1 0.4% Sibabrata Sahoo
1 0.4% Brian Burkhalter
1 0.4% Sean Mullan
1 0.4% Srikanth Adayapalam
1 0.4% Jayathirth D V
1 0.4% Tobias Holenstein
1 0.4% Stefan Karlsson
1 0.4% Alexander Zvegintsev
1 0.4% Adam Sotona
1 0.4% Kim Barrett
1 0.4% Rajat Mahajan
1 0.4% Thomas Schatzl
1 0.4% Raffaello Giulietti
1 0.4% Joakim Nordström
1 0.4% Conor Cleary
1 0.4% Angelos Bimpoudis
1 0.4% Ryan Wallace
1 0.4% Erik Gahlin
1 0.4% Hannes Wallnoefer
1 0.4% Alexey Semenyuk
1 0.4% Vicente Arturo Romero Zaldivar
1 0.4% Ioi Lam
1 0.4% Lance Andersen
1 0.4% Coleen Phillimore
1 0.4% Johan Sjölen
1 0.4% Vladimir Kozlov
1 0.4% Jonathan Gibbons
1 0.4% Joe Darcy
1 0.4% Manukumar V S
1 0.4% Mikael Vidstedt
1 0.4% Serguei Spitsyn
30 12.0% SAP
15 6.0% Matthias Baesken
8 3.2% Christoph Langer
3 1.2% Goetz Lindenmaier
2 0.8% Martin Doerr
2 0.8% Richard Reingruber
22 8.8% Red Hat
12 4.8% Thomas Stuefe
3 1.2% Severin Gehwolf
3 1.2% Roland Westrelin
1 0.4% Andrew Haley
1 0.4% karm
1 0.4% Jonathan Dowland
1 0.4% Andrew Hughes
18 7.2% Independent
2 0.8% Zhengyu Gu
2 0.8% Andrey Turbanov
2 0.8% ruprabhu25
1 0.4% yifan.tsai
1 0.4% Julian Waters
1 0.4% Dmitriy Samersoff
1 0.4% Lin Zang
1 0.4% Ryan Ernst
1 0.4% Quan Anh Mai
1 0.4% Chris Hegarty
1 0.4% Fei Yang
1 0.4% Bo Zhang
1 0.4% vikeytk
1 0.4% yuantj1999
1 0.4% Thejasvi Voniadka
14 5.6% Amazon
7 2.8% Sergey Bylokhov
5 2.0% Aleksey Shipilev
1 0.4% Dan Lutker
1 0.4% Roman Kennke
6 2.4% NTT DATA
5 2.0% Yasumasa Suenaga
1 0.4% Koichi Sakata
3 1.2% Azul
1 0.4% Yuri Nesterenko
1 0.4% Roman Marchenko
1 0.4% Ekaterina Vergizova
2 0.8% Fujitsu
1 0.4% Takuya Kiriyama
1 0.4% Masanori Yano
2 0.8% IBM
1 0.4% Ichiroh Takiguchi
1 0.4% Shruthi Acharya
2 0.8% Intel
2 0.8% Jatin Bhateja
2 0.8% Tencent
2 0.8% Jie Fu
1 0.4% ARM
1 0.4% Bhavana Kilambi
1 0.4% Ampere
1 0.4% Patrick Zhang
1 0.4% BellSoft
1 0.4% Dmitry Kulikov
1 0.4% Microsoft
1 0.4% George Adams
1 0.4% Skymatic
1 0.4% Sebastian Stenzel

Chronological push log:

UTC Time This Release Push By Original Push By Bug Summary
Name Affiliation Name Affiliation
2023/04/12 22:11 Christoph Langer SAP (same) (same) JDK-8299597 [17u] Remove designator DEFAULT_PROMOTED_VERSION_PRE=ea for release 17.0.7
2023/04/03 12:18 Severin Gehwolf Red Hat (same) (same) JDK-8305449 Use default visibility for static library builds
2023/03/03 09:03 Goetz Lindenmaier SAP Bill Huang Oracle JDK-8303561 Improve test coverage for XPath Axes: child
2023/03/03 08:58 Goetz Lindenmaier SAP Srinivas Mandalika Oracle JDK-8303560 Create an automated test for JDK-4422362
2023/03/03 08:52 Goetz Lindenmaier SAP Srinivas Mandalika Oracle JDK-8303559 Create an automated test for JDK-4422535
2023/03/03 08:50 Goetz Lindenmaier SAP Alex Menkov Oracle JDK-8303558 JDB tests do not update source path after doing a redefine class
2023/03/03 08:45 Goetz Lindenmaier SAP Coleen Phillimore Oracle JDK-8303556 NoClassDefFoundError omits original ExceptionInInitializerError
2023/03/01 14:47 Goetz Lindenmaier SAP Brian Burkhalter Oracle JDK-8303461 test/jdk/java/nio/file/Files/probeContentType/Basic.java fails on some systems for the ".rar" extension
2023/02/28 15:26 Masanori Yano Fujitsu Prasanta Sadhukhan Oracle JDK-8303360 Test javax/swing/border/TestTitledBorderLeak.java fails
2023/02/28 11:40 Goetz Lindenmaier SAP Chris Plummer Oracle JDK-8303332 Problem list SA core file tests on macosx-x64 due to JDK-8294316
2023/02/27 10:57 George Adams Microsoft (same) (same) JDK-8303235 doc/building.md update link to jtreg builds
2023/02/27 10:33 Adam Sotona Oracle (same) (same) JDK-8303233 Review running times of jshell regression tests
2023/02/24 22:15 Scott Gibbons Intel Sebastian Stenzel Skymatic JDK-8303205 CipherCore.doFinal(...) causes potentially massive byte[] allocations during decryption
2023/02/24 22:06 Anton Kozlov Azul Angelos Bimpoudis Oracle JDK-8303204 AssertionError during annotation processing of record related tests
2023/02/24 21:32 Shruthi Acharya IBM Masanori Yano Fujitsu JDK-8303199 duplicate property key in java.sql.rowset resource bundle
2023/02/24 21:07 Shruthi Acharya IBM (same) (same) JDK-8300751 [17u] Remove duplicate entry in javac.properties
2023/02/24 19:58 Goetz Lindenmaier SAP Rajan Halade Oracle JDK-8303192 Add Certigna Root CA
2023/02/24 19:53 Goetz Lindenmaier SAP Andrew Haley Red Hat JDK-8303190 Undefined Behavior in C2 regalloc with null references
2023/02/24 19:52 Goetz Lindenmaier SAP Harshitha Onkar Oracle JDK-8303189 [macosx] The text "big" is truncated in JTabbedPane
2023/02/24 15:03 Radim Vansa Azul Takuya Kiriyama Fujitsu JDK-8303164 Resolving URI relative path with no / may lead to incorrect toString
2023/02/21 16:39 Victor Rudometov Amazon Emanuel Peter Oracle JDK-8303011 Speed up compiler/arraycopy/TestArrayCopyConjoint.java
2023/02/21 15:29 Patrick Zhang Ampere (same) (same) JDK-8303003 AArch64: Detect Ampere-1 and Ampere-1A CPUs and set default options
2023/02/20 18:45 Victor Rudometov Amazon Emanuel Peter Oracle JDK-8302901 Speed up tests with infinite loops, sleep less
2023/02/20 18:44 Victor Rudometov Amazon Andrey Turbanov Independent JDK-8302900 Prefer ArrayList to LinkedList in LayoutComparator
2023/02/17 09:58 Goetz Lindenmaier SAP Daniel Daugherty Oracle JDK-8302717 Tier1 validate-source fails after 8279614
2023/02/17 09:57 Christoph Langer SAP (same) (same) JDK-8302692 [17u] Update GHA Boot JDK to 17.0.6
2023/02/16 10:51 Ekaterina Vergizova Azul (same) (same) JDK-8302648 JFR: increase checkpoint event size for stacktrace and string pool
2023/02/15 15:51 Roman Marchenko Azul (same) (same) JDK-8302593 javadoc cannot link to old docs (with old style anchors)
2023/02/15 14:55 Goetz Lindenmaier SAP Rajat Mahajan Oracle JDK-8302588 Rendering Issues with Borders on Windows High-DPI systems
2023/02/15 14:53 Goetz Lindenmaier SAP Daniel Jelinski Oracle JDK-8302587 java/net/httpclient/ConnectExceptionTest.java should not rely on system resolver
2023/02/15 14:51 Goetz Lindenmaier SAP Daniel Jelinski Oracle JDK-8302586 java/net/httpclient/ConnectTimeout tests are slow
2023/02/15 14:49 Goetz Lindenmaier SAP Alisen Chung Oracle JDK-8302584 The left line of the TitledBorder is not painted on 150 scale factor
2023/02/15 13:58 Goetz Lindenmaier SAP Alexey Semenyuk Oracle JDK-8302580 Test jdk/tools/jpackage/windows/WinInstallerIconTest always fails on Windows 11
2023/02/15 10:18 Matthias Baesken SAP (same) (same) JDK-8302541 Detect Virtualization on Linux aarch64
2023/02/14 20:06 Goetz Lindenmaier SAP Manukumar V S Oracle JDK-8302501 java/awt/PopupMenu/PopupMenuLocation.java is unstable in MacOS machines
2023/02/14 15:12 Matthias Baesken SAP (same) (same) JDK-8302466 Swing test bug8078268 make latch timeout configurable
2023/02/14 15:10 Matthias Baesken SAP (same) (same) JDK-8302465 Enhance error logging in instrument coding with additional jplis_assert_msg
2023/02/14 09:30 Goetz Lindenmaier SAP Emanuel Peter Oracle JDK-8302450 Speed up compiler/intrinsics/string/TestStringLatin1IndexOfChar.java
2023/02/13 14:42 Goetz Lindenmaier SAP Daniel Fuchs Oracle JDK-8302334 java/net/httpclient/HttpsTunnelAuthTest.java fails with java.io.IOException: HTTP/1.1 header parser received no bytes
2023/02/13 14:41 Goetz Lindenmaier SAP Ravi Gupta Oracle JDK-8302333 Modify TextAreaTextEventTest.java as to verify the content change of TextComponent sends TextEvent
2023/02/13 14:39 Goetz Lindenmaier SAP Daniel Fuchs Oracle JDK-8302332 sun/net/www/http/HttpClient/MultiThreadTest.java sometimes detect threads+1 connections
2023/02/13 14:35 Goetz Lindenmaier SAP Daniel Jelinski Oracle JDK-8302329 Speed up test sun/net/www/protocol/https/HttpsClient/ProxyAuthTest.java
2023/02/12 19:08 Goetz Lindenmaier SAP Ravi Gupta Oracle JDK-8302287 Write a test to verify List sends ItemEvent/ActionEvent
2023/02/12 19:07 Goetz Lindenmaier SAP Justin Lu Oracle JDK-8302285 java/util/Formatter/Basic test cleanup
2023/02/10 08:41 Goetz Lindenmaier SAP Weijun Wang Oracle JDK-8302200 Exclude linux-aarch64 in NSS tests
2023/02/10 08:40 Goetz Lindenmaier SAP Lawrence Andrews Oracle JDK-8302199 AccessibleActionsTest.java test instruction for show popup on JLabel did not specify shift key
2023/02/10 08:39 Goetz Lindenmaier SAP Daniel Fuchs Oracle JDK-8302198 sun/util/logging/PlatformLoggerTest.java failed with "RuntimeException: Retrieved backing PlatformLogger level null is not the expected CONFIG"
2023/02/10 08:37 Goetz Lindenmaier SAP Ioi Lam Oracle JDK-8302197 Avoid JVM crash when containers share the same /tmp dir
2023/02/10 08:35 Goetz Lindenmaier SAP Daniel Fuchs Oracle JDK-8302196 ResponseBodyBeforeError: AssertionError or SSLException: Unsupported or unrecognized SSL message
2023/02/10 08:34 Goetz Lindenmaier SAP Mikhailo Seledtsov Oracle JDK-8302195 [TESTBUG] jps and jcmd -l support for containers is not tested
2023/02/10 07:52 Matthias Baesken SAP (same) (same) JDK-8302193 perfMemory_windows.cpp add free_security_attr to early returns
2023/02/10 07:49 Yuri Nesterenko Azul (same) (same) JDK-8302192 Fix possible leak in SpNegoContext dispose
2023/02/08 16:07 Goetz Lindenmaier SAP Chris Plummer Oracle JDK-8302082 CompressedClassSpaceSizeInJmapHeap.java time out after 8 minutes
2023/02/08 16:07 Goetz Lindenmaier SAP Chris Plummer Oracle JDK-8302080 gc/metaspace/CompressedClassSpaceSizeInJmapHeap.java causes test task timeout on macosx
2023/02/08 16:05 Goetz Lindenmaier SAP Conor Cleary Oracle JDK-8302077 java/net/httpclient/ServerCloseTest.java failed once with ConnectException
2023/02/06 12:39 Radim Vansa Azul Bo Zhang Independent JDK-8301860 jar validator doesn't account for minor class file version
2023/02/06 12:29 Radim Vansa Azul Douglas Simon Oracle JDK-8301857 [JVMCI] BytecodeFrame.equals is broken
2023/02/05 07:48 Thomas Stuefe Red Hat (same) (same) JDK-8301827 chunklevel::MAX_CHUNK_WORD_SIZE too small for some applications
2023/02/04 04:50 Ichiroh Takiguchi IBM (same) (same) JDK-8301816 CustomTzIDCheckDST.java may fail at future date
2023/02/03 19:22 Victor Rudometov Amazon Bill Huang Oracle JDK-8301809 Improve test coverage for XPath functions: Number Functions
2023/02/03 19:22 Victor Rudometov Amazon Bill Huang Oracle JDK-8301808 Improve test coverage for XPath functions: Boolean Functions
2023/02/03 19:22 Victor Rudometov Amazon Bill Huang Oracle JDK-8301807 Improve test coverage for XPath functions: String Functions
2023/02/03 18:41 Victor Rudometov Amazon Ravi Gupta Oracle JDK-8301799 Write a test to verify the components selection sends ItemEvent
2023/02/02 20:15 Goetz Lindenmaier SAP Daniel Jelinski Oracle JDK-8301713 jdk/sun/security/tools/jarsigner/compatibility/SignTwice.java slow on Windows
2023/02/02 20:13 Goetz Lindenmaier SAP Chris Plummer Oracle JDK-8301711 Improve com/sun/jdi/TestScaffold error reporting
2023/02/02 20:10 Goetz Lindenmaier SAP Bill Huang Oracle JDK-8301710 Convert TestInputArgument.sh and TestSystemLoadAvg.sh to java version
2023/02/02 20:07 Goetz Lindenmaier SAP Aleksey Shipilev Amazon JDK-8301708 Weak CAS VarHandle/Unsafe tests should test always-failing cases
2023/02/02 20:05 Goetz Lindenmaier SAP Daniel Jelinski Oracle JDK-8301707 java/time/nontestng/java/time/zone/CustomZoneNameTest.java fails if defaultLocale and defaultFormatLocale are different
2023/02/02 20:04 Goetz Lindenmaier SAP Alex Menkov Oracle JDK-8301706 com/sun/jdi/RedefineCrossEvent.java failed with 1 threads completed while VM suspended
2023/02/02 20:01 Goetz Lindenmaier SAP Ryan Ernst Independent JDK-8301705 ShortResponseBody could be made more resilient to rogue connections
2023/02/01 16:44 Victor Rudometov Amazon Bill Huang Oracle JDK-8301629 Improve test coverage for XPath functions: Node Set Functions
2023/02/01 09:27 Goetz Lindenmaier SAP Kevin Walls Oracle JDK-8301591 Remove vmTestbase/nsk/monitoring/MemoryPoolMBean/isCollectionUsageThresholdExceeded/isexceeded003 from ProblemList.txt
2023/02/01 09:25 Goetz Lindenmaier SAP Thejasvi Voniadka Independent JDK-8301590 Change java/util/zip/ZipFile/DeleteTempJar.java to stop HttpServer cleanly in case of exceptions
2023/02/01 09:22 Goetz Lindenmaier SAP Sibabrata Sahoo Oracle JDK-8301588 Test to cover CodeSource.getCodeSigners()
2023/02/01 09:15 Goetz Lindenmaier SAP Rajan Halade Oracle JDK-8301586 AmazonCA.java interop test fails
2023/02/01 09:14 Goetz Lindenmaier SAP Naoto Sato Oracle JDK-8301585 Fix 3rd party notices in test files
2023/02/01 09:08 Goetz Lindenmaier SAP Kevin Walls Oracle JDK-8301582 Wrong defect ID in the code of test LocalRMIServerSocketFactoryTest.java
2023/01/31 13:53 Ekaterina Vergizova Azul Erik Gahlin Oracle JDK-8301547 JFR: RemoteRecordingStream support for checkpoint event sizes beyond u4
2023/01/31 10:58 Thomas Stuefe Red Hat Zhengyu Gu Independent JDK-8301490 NMT: Remove NMT shutdown capability
2023/01/31 10:08 Ekaterina Vergizova Azul Markus Grönlund Oracle JDK-8301476 Let checkpoint event sizes grow beyond u4 limit
2023/01/31 09:28 Christoph Langer SAP (same) (same) JDK-8301397 [11u, 17u] Bump jtreg to fix issue with build JDK 11.0.18
2023/01/30 16:32 Elif Aslan Amazon Bhavana Kilambi ARM JDK-8301369 Enable Neoverse N1 optimizations for Arm Neoverse V1 & N2
2023/01/30 09:13 Goetz Lindenmaier SAP Dean Long Oracle JDK-8301335 misc crash dump improvements
2023/01/30 09:12 Goetz Lindenmaier SAP ruprabhu25 Independent JDK-8301334 maxOutputSize, instead of javatest.maxOutputSize, should be used in TEST.properties
2023/01/30 09:10 Goetz Lindenmaier SAP Christian Hagedorn Oracle JDK-8301333 TestScenarios.java does not check for "" correctly
2023/01/30 08:58 Goetz Lindenmaier SAP Daniel Jelinski Oracle JDK-8301329 Improve websocket test execution time
2023/01/30 08:53 Goetz Lindenmaier SAP Christian Hagedorn Oracle JDK-8301328 [IR Framework] Compilation is not found due to rare safepoint while dumping PrintIdeal/PrintOptoAssembly
2023/01/30 06:53 Thomas Stuefe Red Hat (same) (same) JDK-8301323 Metaspace::contains() should be threadsafe
2023/01/30 06:52 Thomas Stuefe Red Hat (same) (same) JDK-8301322 Increase size of metaspace mappings
2023/01/27 20:14 Ben Taylor Amazon Julian Waters Independent JDK-8301276 Partially fix string expansion issues in UTIL_DEFUN_NAMED and related macros
2023/01/27 17:15 Sergey Bylokhov Amazon Philip Race Oracle JDK-8301257 Regression test java/awt/font/TextLayout/CombiningPerf.java fails
2023/01/27 16:55 Dan Lutker Amazon (same) (same) JDK-8301256 GCC 12 reports some compiler warnings in bundled freetype
2023/01/27 16:04 Dan Lutker Amazon Yasumasa Suenaga NTT DATA JDK-8301253 Incorrect argument processing in java launcher
2023/01/27 13:11 Thomas Stuefe Red Hat (same) (same) JDK-8301242 Don't purge metaspace mapping lists
2023/01/27 13:10 Thomas Stuefe Red Hat (same) (same) JDK-8301241 libjsig should ignore non-modifying sigaction calls
2023/01/27 12:55 Thomas Stuefe Red Hat (same) (same) JDK-8301240 Signal Handlers printout should show signal block state
2023/01/26 20:45 Johan Sjölen Oracle (same) (same) JDK-8301198 converting a defined BasicType value to a string should not crash the VM
2023/01/26 15:48 Thomas Stuefe Red Hat Zhengyu Gu Independent JDK-8299846 NMT: Remove VM.native_memory shutdown jcmd command option
2023/01/26 14:02 Sergey Bylokhov Amazon Mikael Vidstedt Oracle JDK-8301157 Missing comma in copyright header
2023/01/26 12:58 Goetz Lindenmaier SAP Daniel Daugherty Oracle JDK-8301152 JDI tc02x004 failed again due to wrong # of breakpoints
2023/01/26 12:56 Goetz Lindenmaier SAP Lawrence Andrews Oracle JDK-8301151 Create test case for JDK-8262981
2023/01/26 12:52 Goetz Lindenmaier SAP Kim Barrett Oracle JDK-8301150 CloneableReference subtest should not throw CloneNotSupportedException
2023/01/25 18:10 Masanori Yano Fujitsu Alexander Zvegintsev Oracle JDK-8301107 [macosx] test java/awt/Frame/ShapeNotSetSometimes/ShapeNotSetSometimes.java fails (again)
2023/01/25 17:32 Yasumasa Suenaga NTT DATA (same) (same) JDK-8301104 compiler/jvmci/errors/TestInvalidDebugInfo.java fails new assert: assert((uint)t < T_CONFLICT + 1) failed: invalid type #
2023/01/25 17:30 Sergey Bylokhov Amazon (same) (same) JDK-8301103 sRGB-ColorSpace to sRGB-ColorSpace Conversion
2023/01/25 17:24 Sergey Bylokhov Amazon Raffaello Giulietti Oracle JDK-8301102 Disable an assertion in test/jdk/java/util/DoubleStreamSums/CompensatedSums.java
2023/01/25 17:19 Yasumasa Suenaga NTT DATA (same) (same) JDK-8301101 GCC 12 reports some compiler warnings
2023/01/25 17:06 Victor Rudometov Amazon yuantj1999 Independent JDK-8301100 Usage of constructors of primitive wrapper classes should be avoided in java.desktop API docs
2023/01/25 09:04 Goetz Lindenmaier SAP (same) (same) JDK-8300773 Address the inconsistency between the constant array and pool size
2023/01/25 08:51 Goetz Lindenmaier SAP Alan Bateman Oracle JDK-8301053 File.listRoots performance degradation
2023/01/25 08:47 Goetz Lindenmaier SAP Harshitha Onkar Oracle JDK-8301051 Update Libpng to 1.6.38
2023/01/24 09:07 Goetz Lindenmaier SAP Christian Hagedorn Oracle JDK-8300961 C2: Cast node is not processed again in CCP and keeps a wrong too narrow type which is later replaced by top
2023/01/24 09:04 Goetz Lindenmaier SAP Justin Lu Oracle JDK-8300960 Update IANA Language Subtag Registry to Version 2022-08-08
2023/01/24 08:54 Goetz Lindenmaier SAP Sean Coffey Oracle JDK-8300959 Move jdk.X509Certificate event logic to JCA layer
2023/01/23 22:05 Yasumasa Suenaga NTT DATA (same) (same) JDK-8300936 GCC 12 reports use-after-free potential bugs
2023/01/23 11:22 Goetz Lindenmaier SAP Erik Joelsson Oracle JDK-8300860 Update jib GNU make dependency on Windows to latest cygwin build
2023/01/23 10:52 Severin Gehwolf Red Hat Jonathan Dowland Red Hat JDK-8300859 CgroupMetrics.getTotalMemorySize0() can report invalid results on 32 bit systems
2023/01/23 10:44 Goetz Lindenmaier SAP Thomas Schatzl Oracle JDK-8300858 Reference discovery is confused about atomicity and degree of parallelism
2023/01/20 10:28 Christoph Langer SAP (same) (same) JDK-8300749 Spaces in name of MacOS Code Signing Identity are not correctly handled after JDK-8293550
2023/01/19 19:40 Goetz Lindenmaier SAP (same) (same) JDK-8300642 [17u,11u] Fix DEFAULT_PROMOTED_VERSION_PRE=ea for -dev
2023/01/19 06:46 Christoph Langer SAP Magnus Ihse Bursie Oracle JDK-8300629 Remove debug printout from JDK-8285093
2023/01/18 13:04 Aleksey Shipilev Amazon Quan Anh Mai Independent JDK-8300525 Objects.requireNonNull should be ForceInline
2023/01/18 13:01 Aleksey Shipilev Amazon Erik Joelsson Oracle JDK-8300524 JDK-8285093 changed the default for --with-output-sync
2023/01/18 08:22 Matthias Baesken SAP (same) (same) JDK-8300445 sun/tools/jhsdb/SAGetoptTest.java fails after 8299470
2023/01/18 08:18 Matthias Baesken SAP (same) (same) JDK-8300444 sun/jvm/hotspot/SALauncher.java handling of negative rmiport args
2023/01/18 08:14 Goetz Lindenmaier SAP Andrey Turbanov Independent JDK-8300441 java/nio/file/Files/probeContentType/Basic.java fails on Windows 11
2023/01/17 15:52 Goetz Lindenmaier SAP Daniel Fuchs Oracle JDK-8300277 java/util/logging/CheckZombieLockTest.java failing intermittently
2023/01/17 07:31 Goetz Lindenmaier SAP Chris Plummer Oracle JDK-8300233 vmTestbase/nsk/jdi/ThreadStartEvent/thread/thread001 failed due to SocketTimeoutException
2023/01/16 18:03 Goetz Lindenmaier SAP Fei Yang Independent JDK-8300221 Fastdebug build fails after JDK-8296389
2023/01/16 18:03 Goetz Lindenmaier SAP Emanuel Peter Oracle JDK-8300220 C2: PhaseCFG::convert_NeverBranch_to_Goto must handle both orders of successors
2023/01/16 17:55 Goetz Lindenmaier SAP Emanuel Peter Oracle JDK-8300219 PhaseIdealLoop::only_has_infinite_loops must detect all loops that never lead to termination
2023/01/16 17:51 Goetz Lindenmaier SAP Christian Hagedorn Oracle JDK-8300218 C2: create_new_if_for_predicate() does not clone pinned phi input nodes resulting in a broken graph
2023/01/16 17:47 Goetz Lindenmaier SAP Jaikiran Pai Oracle JDK-8300215 Enable debug logging in java/net/DatagramSocket/SendDatagramToBadAddress.java
2023/01/16 17:45 Goetz Lindenmaier SAP Jonathan Gibbons Oracle JDK-8300214 Provide a JavadocTester method for non-overlapping, unordered output matching
2023/01/16 17:42 Goetz Lindenmaier SAP Jaikiran Pai Oracle JDK-8300213 javax/xml/crypto/dsig/LogParameters.java failed with "RuntimeException: Unexpected log output:"
2023/01/16 09:17 Severin Gehwolf Red Hat Magnus Ihse Bursie Oracle JDK-8300191 Fix autoconf 2.71 warning "AC_CHECK_HEADERS: you should use literals"
2023/01/16 08:40 Matthias Baesken SAP Yasumasa Suenaga NTT DATA JDK-8300186 [TESTBUG] SADebugDTest.java does not handle "Address already in use" error
2023/01/15 07:00 Sergey Bylokhov Amazon (same) (same) JDK-8300175 Compilation of gtest causes build to fail if runtime libraries are in different dirs
2023/01/13 07:43 Matthias Baesken SAP (same) (same) JDK-8300104 containers/docker/TestMemoryWithCgroupV1.java fails on SLES12 ppc64le when testing Memory and Swap Limit
2023/01/13 07:35 Richard Reingruber SAP (same) (same) JDK-8300103 com/sun/jdi/EATests.java fails with compiler flag -XX:+StressReflectiveCode
2023/01/12 14:15 Matthias Baesken SAP (same) (same) JDK-8300049 TestPrintXML.java output error messages in case compare fails
2023/01/12 14:08 Goetz Lindenmaier SAP Christian Hagedorn Oracle JDK-8300048 C2: assert(dead->outcnt() == 0 && !dead->is_top()) failed: node must be dead
2023/01/12 14:06 Goetz Lindenmaier SAP Christian Hagedorn Oracle JDK-8300047 C2: Create skeleton predicates for all If nodes in loop predication
2023/01/12 14:04 Matthias Baesken SAP (same) (same) JDK-8300045 java/util/regex/NegativeArraySize.java fails on Alpine and sometimes Windows
2023/01/12 14:00 Goetz Lindenmaier SAP Hannes Wallnoefer Oracle JDK-8300044 Upgrade jQuery to 3.6.1
2023/01/12 13:57 Goetz Lindenmaier SAP Joakim Nordström Oracle JDK-8300043 JFR: Don't commit JFR internal jdk.JavaMonitorWait events
2023/01/12 13:50 Goetz Lindenmaier SAP Naoto Sato Oracle JDK-8300041 Update IANA Language Subtag Registry to Version 2022-03-02
2023/01/12 09:28 Goetz Lindenmaier SAP Roland Westrelin Red Hat JDK-8300029 C2 compilation hits "assert((mode == ControlAroundStripMined && use == sfpt) || !use->is_reachable_from_root()) failed: missed a node"
2023/01/12 08:10 Thomas Stuefe Red Hat (same) (same) JDK-8300023 Add pid to process reaper thread name
2023/01/12 07:50 Thomas Stuefe Red Hat (same) (same) JDK-8300020 Print active locale settings in hs_err reports and in VM.info
2023/01/11 10:58 Thomas Stuefe Red Hat (same) (same) JDK-8299955 Show stack dimensions in UL logging when attaching threads
2023/01/11 07:45 Matthias Baesken SAP (same) (same) JDK-8299939 Various GetPrimitiveArrayCritical miss result - NULL check
2023/01/10 17:47 Aleksey Shipilev Amazon Stefan Karlsson Oracle JDK-8299905 VM_Cleanup unnecessarily processes all thread oops
2023/01/10 15:37 Goetz Lindenmaier SAP Alisen Chung Oracle JDK-8299897 Update LCMS to 2.14
2023/01/10 14:21 Christoph Langer SAP (same) (same) JDK-8300511 [17u] Remove designator DEFAULT_PROMOTED_VERSION_PRE=ea for release 17.0.6
2023/01/10 12:20 Thomas Stuefe Red Hat (same) (same) JDK-8299868 Remove debug-only heap overrun checks in os::malloc and friends
2023/01/10 09:19 Severin Gehwolf Red Hat (same) (same) JDK-8299866 java/security/SignedJar/spi-calendar-provider/TestSPISigned.java failing on Windows
2023/01/09 16:30 Goetz Lindenmaier SAP Douglas Simon Oracle JDK-8299823 [JVMCI] HotSpotJVMCIRuntime.encodeThrowable should not throw an exception
2023/01/09 16:28 Goetz Lindenmaier SAP Jaikiran Pai Oracle JDK-8299820 URLPermission constructor throws IllegalArgumentException: Invalid characters in hostname after JDK-8294378
2023/01/09 16:24 Goetz Lindenmaier SAP Tobias Hartmann Oracle JDK-8299818 C2: CreateExNode::Identity fails with assert(i < _max) failed: oob: i=1, _max=1
2023/01/09 16:20 Goetz Lindenmaier SAP Tobias Hartmann Oracle JDK-8299816 CheckCastPP with raw oop input floats below a safepoint
2023/01/09 14:39 Goetz Lindenmaier SAP David Holmes Oracle JDK-8299810 ProblemList java/text/Format/NumberFormat/CurrencyFormat.java
2023/01/09 14:39 Goetz Lindenmaier SAP Justin Lu Oracle JDK-8299809 java/text/Format/NumberFormat/CurrencyFormat.java fails for hr_HR
2023/01/09 11:09 Thomas Stuefe Red Hat (same) (same) JDK-8299800 Unify C-heap buffer overrun checks into NMT
2023/01/09 11:09 Thomas Stuefe Red Hat (same) (same) JDK-8299799 NMT should perform buffer overrun checks
2023/01/09 10:46 Severin Gehwolf Red Hat (same) (same) JDK-8299797 Add a regression test for JDK-8297684
2023/01/07 15:31 Goetz Lindenmaier SAP Tobias Hartmann Oracle JDK-8299770 C2: assert(is_valid_AArch64_address(dest.target())) failed: bad address
2023/01/04 20:41 Goetz Lindenmaier SAP Vladimir Kozlov Oracle JDK-8299626 SIGSEGV in PhaseIdealLoop::build_loop_late_post_work
2023/01/04 20:39 Goetz Lindenmaier SAP Sean Coffey Oracle JDK-8299625 InitialSecurityProperty JFR event
2023/01/04 09:43 Goetz Lindenmaier SAP Christian Hagedorn Oracle JDK-8299587 Assert in PhaseIdealLoop::dump_real_LCA is too strong
2023/01/04 09:41 Goetz Lindenmaier SAP Dmitriy Samersoff Independent JDK-8299586 Use 64bit atomics in patch_verified_entry on x86_64
2023/01/04 09:39 Goetz Lindenmaier SAP Roland Westrelin Red Hat JDK-8299585 Assertion failure: parsing found no loops but there are some
2023/01/04 09:38 Goetz Lindenmaier SAP Srikanth Adayapalam Oracle JDK-8299584 TYPE_USE annotations on generic type arguments of record components discarded
2023/01/04 09:36 Goetz Lindenmaier SAP Dean Long Oracle JDK-8299583 missing is_unloading() check in SharedRuntime::fixup_callers_callsite()
2023/01/04 09:35 Goetz Lindenmaier SAP Dean Long Oracle JDK-8299582 [Aarch64] C2: assert(false) failed: bad AD file
2023/01/04 09:33 Goetz Lindenmaier SAP Daniel Fuchs Oracle JDK-8299581 LineBodyHandlerTest.java creates and discards too many clients
2023/01/04 09:20 Goetz Lindenmaier SAP Chris Plummer Oracle JDK-8299579 resourcehogs/serviceability/sa/TestHeapDumpForLargeArray.java can fail if GC occurs
2023/01/04 09:18 Goetz Lindenmaier SAP Joe Darcy Oracle JDK-8299578 Make floating-point test infrastructure more lambda and method reference friendly
2023/01/04 09:15 Goetz Lindenmaier SAP David Holmes Oracle JDK-8299577 [TESTBUG] vmTestbase/nsk/stress/jni/ native code cleanup
2023/01/03 20:55 Sergey Bylokhov Amazon (same) (same) JDK-8299556 Random crashes while the UI code is executed
2023/01/03 17:27 Aleksey Shipilev Amazon Jie Fu Tencent JDK-8299550 Zero: Fix _fast_{i,f}access_0 bytecodes handling
2023/01/03 17:17 Aleksey Shipilev Amazon (same) (same) JDK-8299549 Zero: Implement fast bytecodes
2023/01/03 09:08 Matthias Baesken SAP (same) (same) JDK-8299514 Provide better descriptions for JIT compiler JFR events
2023/01/03 01:04 Sergey Bylokhov Amazon (same) (same) JDK-8299484 Incorrect comparator com.sun.beans.introspect.MethodInfo.MethodOrder
2023/01/02 21:08 Goetz Lindenmaier SAP Igor Veresov Oracle JDK-8299480 Folding of loads is broken in C2 after JDK-8242115
2023/01/02 20:24 Goetz Lindenmaier SAP Igor Veresov Oracle JDK-8299477 C2 SATB barriers are not safepoint-safe
2023/01/02 13:51 Goetz Lindenmaier SAP Ryan Wallace Oracle JDK-8299473 URLPermission constructor exception when using tr locale
2023/01/02 13:49 Goetz Lindenmaier SAP Justin Lu Oracle JDK-8299472 ISO 4217 Amendment 174 Update
2023/01/02 13:46 Goetz Lindenmaier SAP Roman Kennke Amazon JDK-8299469 Use correct register in aarch64_enc_fast_unlock()
2023/01/02 13:45 Goetz Lindenmaier SAP Jatin Bhateja Intel JDK-8299468 C2: some vectorapi tests fail assert "Not monotonic" with flag -XX:TypeProfileLevel=222
2023/01/02 13:08 Goetz Lindenmaier SAP Roberto Castaneda Lozano Oracle JDK-8299467 C2 compilation fails with assert "non-reduction loop contains reduction nodes"
2023/01/02 13:07 Goetz Lindenmaier SAP Roland Westrelin Red Hat JDK-8299466 misc tests failed "assert(false) failed: graph should be schedulable"
2023/01/02 12:59 Goetz Lindenmaier SAP Emanuel Peter Oracle JDK-8299465 C2: fix and simplify IdealLoopTree::do_remove_empty_loop
2023/01/02 12:49 Goetz Lindenmaier SAP Roberto Castaneda Lozano Oracle JDK-8299463 ZGC: C2 late barrier analysis uses invalid dominator information
2023/01/02 12:32 Goetz Lindenmaier SAP Sean Coffey Oracle JDK-8299462 Fix up loading of override java.security properties file
2023/01/02 12:29 Goetz Lindenmaier SAP Christian Hagedorn Oracle JDK-8299461 [IR Framework] Cleanup IR matching code in preparation for JDK-8280378
2023/01/02 12:27 Goetz Lindenmaier SAP Aleksey Shipilev Amazon JDK-8299460 java/lang/instrument/GetObjectSizeIntrinsicsTest.java fails with -XX:-UseCompressedOops
2023/01/02 11:34 Goetz Lindenmaier SAP Aleksey Shipilev Amazon JDK-8299451 Extend java/lang/instrument/GetObjectSizeIntrinsicsTest.java test cases
2023/01/02 11:32 Goetz Lindenmaier SAP Chris Plummer Oracle JDK-8299450 serviceability/sa/TestJmapCore.java timed out on macOS 10.13.6
2023/01/02 11:29 Goetz Lindenmaier SAP Tobias Holenstein Oracle JDK-8299447 Add "randomness" and "stress" keys to JTreg tests which use StressGCM, StressLCM and/or StressIGVN
2023/01/02 07:52 Matthias Baesken SAP (same) (same) JDK-8299432 sun/security/ssl/SSLSessionImpl/ResumptionUpdateBoundValues.java fails intermittent
2023/01/02 07:49 Matthias Baesken SAP (same) (same) JDK-8299431 improve cleanup and error handling of awt_parseColorModel in awt_parseImage.c
2022/12/31 11:49 Martin Doerr SAP (same) (same) JDK-8299428 compiler/codecache/MHIntrinsicAllocFailureTest.java fails intermittently
2022/12/31 11:49 Martin Doerr SAP (same) (same) JDK-8299427 VirtualMachineError: Out of space in CodeCache for method handle intrinsic
2022/12/30 09:00 Matthias Baesken SAP (same) (same) JDK-8299422 Provide better descriptions for some Operating System JFR events
2022/12/30 08:54 Matthias Baesken SAP (same) (same) JDK-8299421 GetPrimitiveArrayCritical in imageioJPEG misses result - NULL check
2022/12/29 21:29 Sergey Bylokhov Amazon (same) (same) JDK-8299417 getLocalGraphicsEnvironment() on for multi-screen setups throws exception NPE
2022/12/29 15:38 yifan.tsai Independent (same) (same) JDK-8299413 Improve MD5 intrinsic for x86_64
2022/12/29 09:44 Goetz Lindenmaier SAP Lance Andersen Oracle JDK-8299407 Update Zlib Data Compression Library to Version 1.2.13
2022/12/29 09:41 Goetz Lindenmaier SAP Jie Fu Tencent JDK-8299406 testlibrary_tests/ir_framework/tests/TestCheckedTests.java fails after JDK-8274911
2022/12/29 09:36 Goetz Lindenmaier SAP Emanuel Peter Oracle JDK-8299405 C2: PhaseCCP: remove not visited nodes, prevent type inconsistency
2022/12/29 09:35 Goetz Lindenmaier SAP Prasanta Sadhukhan Oracle JDK-8299404 [macosx] javax/swing/Popup/TaskbarPositionTest.java fails because Popup is one pixel off
2022/12/29 09:31 Goetz Lindenmaier SAP Christian Hagedorn Oracle JDK-8299403 IR verification framework fails with "Should find method name in validIrRulesMap"
2022/12/29 02:40 Sergey Bylokhov Amazon Jayathirth D V Oracle JDK-8299401 Remove SCCS id's from awt jtreg tests
2022/12/29 02:33 Sergey Bylokhov Amazon Prasanta Sadhukhan Oracle JDK-8299400 AWT test TestSinhalaChar.java has old SCCS markings
2022/12/27 10:15 Goetz Lindenmaier SAP Daniel Jelinski Oracle JDK-8299372 KeepAliveCache Blocks Threads while Closing Connections
2022/12/27 10:13 Goetz Lindenmaier SAP ruprabhu25 Independent JDK-8299370 Improve test coverage for XPath Axes: ancestor, ancestor-or-self, preceding, and preceding-sibling
2022/12/27 10:09 Goetz Lindenmaier SAP Roberto Castaneda Lozano Oracle JDK-8299369 C2: blocks made unreachable by NeverBranch-to-Goto conversion are removed incorrectly
2022/12/27 10:05 Goetz Lindenmaier SAP Aleksey Shipilev Amazon JDK-8299368 java/util/concurrent/atomic/Serial.java uses {Double,Long}Accumulator incorrectly
2022/12/27 10:02 Goetz Lindenmaier SAP Roberto Castaneda Lozano Oracle JDK-8299367 C2: remove unreachable block after NeverBranch-to-Goto conversion
2022/12/27 09:58 Goetz Lindenmaier SAP Sean Coffey Oracle JDK-8299366 Throw error if default java.security file is missing
2022/12/27 09:30 Goetz Lindenmaier SAP Vicente Arturo Romero Zaldivar Oracle JDK-8299364 compiler error with AP and explicit record accessor
2022/12/27 09:28 Goetz Lindenmaier SAP Philip Race Oracle JDK-8299363 JNI exception pending in awt_GraphicsEnv.c:1432
2022/12/27 09:25 Goetz Lindenmaier SAP Philip Race Oracle JDK-8299362 ICC_Profile.setData(int, byte[]) invalidates the profile
2022/12/27 09:22 Goetz Lindenmaier SAP Chris Plummer Oracle JDK-8299361 src/jdk.hotspot.agent/doc/index.html file contains references to scripts that no longer exist
2022/12/27 09:18 Goetz Lindenmaier SAP Christian Hagedorn Oracle JDK-8299360 testlibrary_tests/ir_framework/tests/TestIRMatching.java fails with "java.lang.RuntimeException: Should have thrown exception"
2022/12/27 09:07 Goetz Lindenmaier SAP Chris Plummer Oracle JDK-8299359 convert clhsdb "mem" command from javascript to java
2022/12/27 09:04 Goetz Lindenmaier SAP Chris Plummer Oracle JDK-8299358 Remove javascript references from clhsdb.html
2022/12/27 09:01 Goetz Lindenmaier SAP Lin Zang Independent JDK-8299357 resourcehogs/serviceability/sa/TestHeapDumpForLargeArray.java timed out
2022/12/27 08:58 Goetz Lindenmaier SAP Christian Hagedorn Oracle JDK-8299356 [IR Framework] Rare occurrence of "" in PrintIdeal/PrintOptoAssembly can let tests fail
2022/12/27 08:52 Goetz Lindenmaier SAP Serguei Spitsyn Oracle JDK-8299390 JDI ObjectReference/referringObjects/referringObjects001 fails: assert(env->is_enabled(JVMTI_EVENT_OBJECT_FREE)) failed: checking
2022/12/26 19:30 Chris Hegarty Independent (same) (same) JDK-8299353 Ensure that HttpResponse.BodySubscribers.ofFile writes all bytes
2022/12/25 07:14 nagata.haruhito Fujitsu vikeytk Independent JDK-8299346 Tests may fail with zh locale on MacOS
2022/12/23 10:32 Severin Gehwolf Red Hat Sean Mullan Oracle JDK-8299389 Cannot use '-Djava.system.class.loader' with class loader in signed JAR
2022/12/22 10:17 Aleksei Voitylov BellSoft Dmitry Kulikov BellSoft JDK-8299264 HotSpot build with disabled PCH fails for Windows AArch64
2022/12/22 10:10 Christoph Langer SAP (same) (same) JDK-8299263 Cygwin's uname -m returns different string than before
2022/12/22 09:58 Christoph Langer SAP karm Red Hat JDK-8299262 WebSockets: HandshakeUrlEncodingTest unnecessarily depends on a response body
2022/12/21 16:14 Alan Bateman Oracle (same) (same) JDK-8299221 (fs) Change PollingWatchService to record last modified time as FileTime rather than milliseconds
2022/12/21 12:56 Matthias Baesken SAP Mikhailo Seledtsov Oracle JDK-8299206 Problemlist several sun/security tests until JDK-8295343 is resolved
2022/12/21 06:29 Denghui Dong Alibaba Koichi Sakata NTT DATA JDK-8299174 jdeprscan --help causes an exception when the locale is ja, zh_CN or de
2022/12/19 14:01 Jatin Bhateja Intel (same) (same) JDK-8299029 Optimize Vector.rearrange over byte vectors for AVX512BW targets.
2022/12/19 08:19 Sergey Bylokhov Amazon (same) (same) JDK-8299010 java/lang/String/StringRepeat.java test requests too much heap on windows x86
2022/12/15 08:21 Richard Reingruber SAP (same) (same) JDK-8298844 frame::interpreter_frame_print_on() crashes if free BasicObjectLock exists in frame
2022/12/14 16:20 Christoph Langer SAP (same) (same) JDK-8298787 Fix msys2 linking and handling out of tree build directory for source zip creation
2022/12/13 18:32 Andrew Hughes Red Hat (same) (same) JDK-8299180 (tz) Update Timezone Data to 2022g
2022/12/12 08:27 Sergey Bylokhov Amazon (same) (same) JDK-8298534 Document Filter attached to JPasswordField and setText("") is not cleared instead inserted characters replaced with unicode null characters
2022/12/09 17:02 Christoph Langer SAP (same) (same) JDK-8298490 Improve handling of macos xcode toolchain
2022/12/08 15:39 Paul Hohensee Amazon Erik Joelsson Oracle JDK-8298395 Code signing warnings after JDK-8293550
2022/12/08 15:35 Paul Hohensee Amazon Erik Joelsson Oracle JDK-8298394 compare.sh fails on macos after JDK-8293550
2022/12/07 18:45 Ben Taylor Amazon Jaikiran Pai Oracle JDK-8298309 Expensive fillInStackTrace operation in HttpURLConnection.getOutputStream0 when no content-length in response
2022/12/07 08:48 Goetz Lindenmaier SAP (same) (same) JDK-8297259 Bump update version for OpenJDK: jdk-17.0.7

No changesets log

Committer push log

Shruthi Acharya, IBM

Bug Summary
JDK-8300751 [17u] Remove duplicate entry in javac.properties
JDK-8303199 duplicate property key in java.sql.rowset resource bundle

Anton Kozlov, Azul

Bug Summary
JDK-8303204 AssertionError during annotation processing of record related tests

Alan Bateman, Oracle

Bug Summary
JDK-8299221 (fs) Change PollingWatchService to record last modified time as FileTime rather than milliseconds

Andrew Hughes, Red Hat

Bug Summary
JDK-8299180 (tz) Update Timezone Data to 2022g

Adam Sotona, Oracle

Bug Summary
JDK-8303233 Review running times of jshell regression tests

Aleksei Voitylov, BellSoft

Bug Summary
JDK-8299264 HotSpot build with disabled PCH fails for Windows AArch64

Ben Taylor, Amazon

Bug Summary
JDK-8298309 Expensive fillInStackTrace operation in HttpURLConnection.getOutputStream0 when no content-length in response
JDK-8301276 Partially fix string expansion issues in UTIL_DEFUN_NAMED and related macros

Chris Hegarty, Independent

Bug Summary
JDK-8299353 Ensure that HttpResponse.BodySubscribers.ofFile writes all bytes

Christoph Langer, SAP

Bug Summary
JDK-8300511 [17u] Remove designator DEFAULT_PROMOTED_VERSION_PRE=ea for release 17.0.6

Christoph Langer, SAP

Bug Summary
JDK-8301397 [11u, 17u] Bump jtreg to fix issue with build JDK 11.0.18
JDK-8299597 [17u] Remove designator DEFAULT_PROMOTED_VERSION_PRE=ea for release 17.0.7
JDK-8302692 [17u] Update GHA Boot JDK to 17.0.6
JDK-8299263 Cygwin's uname -m returns different string than before
JDK-8298787 Fix msys2 linking and handling out of tree build directory for source zip creation
JDK-8298490 Improve handling of macos xcode toolchain
JDK-8300629 Remove debug printout from JDK-8285093
JDK-8300749 Spaces in name of MacOS Code Signing Identity are not correctly handled after JDK-8293550
JDK-8299262 WebSockets: HandshakeUrlEncodingTest unnecessarily depends on a response body

Denghui Dong, Alibaba

Bug Summary
JDK-8299174 jdeprscan --help causes an exception when the locale is ja, zh_CN or de

Elif Aslan, Amazon

Bug Summary
JDK-8301369 Enable Neoverse N1 optimizations for Arm Neoverse V1 & N2

Ekaterina Vergizova, Azul

Bug Summary
JDK-8302648 JFR: increase checkpoint event size for stacktrace and string pool
JDK-8301547 JFR: RemoteRecordingStream support for checkpoint event sizes beyond u4
JDK-8301476 Let checkpoint event sizes grow beyond u4 limit

George Adams, Microsoft

Bug Summary
JDK-8303235 doc/building.md update link to jtreg builds

Goetz Lindenmaier, SAP

Bug Summary
JDK-8300642 [17u,11u] Fix DEFAULT_PROMOTED_VERSION_PRE=ea for -dev
JDK-8299582 [Aarch64] C2: assert(false) failed: bad AD file
JDK-8299461 [IR Framework] Cleanup IR matching code in preparation for JDK-8280378
JDK-8301328 [IR Framework] Compilation is not found due to rare safepoint while dumping PrintIdeal/PrintOptoAssembly
JDK-8299356 [IR Framework] Rare occurrence of "" in PrintIdeal/PrintOptoAssembly can let tests fail
JDK-8299823 [JVMCI] HotSpotJVMCIRuntime.encodeThrowable should not throw an exception
JDK-8299404 [macosx] javax/swing/Popup/TaskbarPositionTest.java fails because Popup is one pixel off
JDK-8303189 [macosx] The text "big" is truncated in JTabbedPane
JDK-8302195 [TESTBUG] jps and jcmd -l support for containers is not tested
JDK-8299577 [TESTBUG] vmTestbase/nsk/stress/jni/ native code cleanup
JDK-8302199 AccessibleActionsTest.java test instruction for show popup on JLabel did not specify shift key
JDK-8299447 Add "randomness" and "stress" keys to JTreg tests which use StressGCM, StressLCM and/or StressIGVN
JDK-8303192 Add Certigna Root CA
JDK-8300773 Address the inconsistency between the constant array and pool size
JDK-8301586 AmazonCA.java interop test fails
JDK-8299587 Assert in PhaseIdealLoop::dump_real_LCA is too strong
JDK-8299585 Assertion failure: parsing found no loops but there are some
JDK-8302197 Avoid JVM crash when containers share the same /tmp dir
JDK-8297259 Bump update version for OpenJDK: jdk-17.0.7
JDK-8299467 C2 compilation fails with assert "non-reduction loop contains reduction nodes"
JDK-8300029 C2 compilation hits "assert((mode == ControlAroundStripMined && use == sfpt) || !use->is_reachable_from_root()) failed: missed a node"
JDK-8299477 C2 SATB barriers are not safepoint-safe
JDK-8300048 C2: assert(dead->outcnt() == 0 && !dead->is_top()) failed: node must be dead
JDK-8299770 C2: assert(is_valid_AArch64_address(dest.target())) failed: bad address
JDK-8299369 C2: blocks made unreachable by NeverBranch-to-Goto conversion are removed incorrectly
JDK-8300961 C2: Cast node is not processed again in CCP and keeps a wrong too narrow type which is later replaced by top
JDK-8300047 C2: Create skeleton predicates for all If nodes in loop predication
JDK-8300218 C2: create_new_if_for_predicate() does not clone pinned phi input nodes resulting in a broken graph
JDK-8299818 C2: CreateExNode::Identity fails with assert(i < _max) failed: oob: i=1, _max=1
JDK-8299465 C2: fix and simplify IdealLoopTree::do_remove_empty_loop
JDK-8299405 C2: PhaseCCP: remove not visited nodes, prevent type inconsistency
JDK-8300220 C2: PhaseCFG::convert_NeverBranch_to_Goto must handle both orders of successors
JDK-8299367 C2: remove unreachable block after NeverBranch-to-Goto conversion
JDK-8299468 C2: some vectorapi tests fail assert "Not monotonic" with flag -XX:TypeProfileLevel=222
JDK-8301590 Change java/util/zip/ZipFile/DeleteTempJar.java to stop HttpServer cleanly in case of exceptions
JDK-8299816 CheckCastPP with raw oop input floats below a safepoint
JDK-8301150 CloneableReference subtest should not throw CloneNotSupportedException
JDK-8301706 com/sun/jdi/RedefineCrossEvent.java failed with 1 threads completed while VM suspended
JDK-8299364 compiler error with AP and explicit record accessor
JDK-8302082 CompressedClassSpaceSizeInJmapHeap.java time out after 8 minutes
JDK-8299359 convert clhsdb "mem" command from javascript to java
JDK-8301710 Convert TestInputArgument.sh and TestSystemLoadAvg.sh to java version
JDK-8303560 Create an automated test for JDK-4422362
JDK-8303559 Create an automated test for JDK-4422535
JDK-8301151 Create test case for JDK-8262981
JDK-8300215 Enable debug logging in java/net/DatagramSocket/SendDatagramToBadAddress.java
JDK-8302200 Exclude linux-aarch64 in NSS tests
JDK-8299451 Extend java/lang/instrument/GetObjectSizeIntrinsicsTest.java test cases
JDK-8300221 Fastdebug build fails after JDK-8296389
JDK-8301053 File.listRoots performance degradation
JDK-8301585 Fix 3rd party notices in test files
JDK-8299462 Fix up loading of override java.security properties file
JDK-8299480 Folding of loads is broken in C2 after JDK-8242115
JDK-8302080 gc/metaspace/CompressedClassSpaceSizeInJmapHeap.java causes test task timeout on macosx
JDK-8299362 ICC_Profile.setData(int, byte[]) invalidates the profile
JDK-8301711 Improve com/sun/jdi/TestScaffold error reporting
JDK-8299370 Improve test coverage for XPath Axes: ancestor, ancestor-or-self, preceding, and preceding-sibling
JDK-8303561 Improve test coverage for XPath Axes: child
JDK-8301329 Improve websocket test execution time
JDK-8299625 InitialSecurityProperty JFR event
JDK-8299403 IR verification framework fails with "Should find method name in validIrRulesMap"
JDK-8299472 ISO 4217 Amendment 174 Update
JDK-8302501 java/awt/PopupMenu/PopupMenuLocation.java is unstable in MacOS machines
JDK-8299460 java/lang/instrument/GetObjectSizeIntrinsicsTest.java fails with -XX:-UseCompressedOops
JDK-8302587 java/net/httpclient/ConnectExceptionTest.java should not rely on system resolver
JDK-8302586 java/net/httpclient/ConnectTimeout tests are slow
JDK-8302334 java/net/httpclient/HttpsTunnelAuthTest.java fails with java.io.IOException: HTTP/1.1 header parser received no bytes
JDK-8302077 java/net/httpclient/ServerCloseTest.java failed once with ConnectException
JDK-8300441 java/nio/file/Files/probeContentType/Basic.java fails on Windows 11
JDK-8299809 java/text/Format/NumberFormat/CurrencyFormat.java fails for hr_HR
JDK-8301707 java/time/nontestng/java/time/zone/CustomZoneNameTest.java fails if defaultLocale and defaultFormatLocale are different
JDK-8299368 java/util/concurrent/atomic/Serial.java uses {Double,Long}Accumulator incorrectly
JDK-8302285 java/util/Formatter/Basic test cleanup
JDK-8300277 java/util/logging/CheckZombieLockTest.java failing intermittently
JDK-8300213 javax/xml/crypto/dsig/LogParameters.java failed with "RuntimeException: Unexpected log output:"
JDK-8303558 JDB tests do not update source path after doing a redefine class
JDK-8299390 JDI ObjectReference/referringObjects/referringObjects001 fails: assert(env->is_enabled(JVMTI_EVENT_OBJECT_FREE)) failed: checking
JDK-8301152 JDI tc02x004 failed again due to wrong # of breakpoints
JDK-8301713 jdk/sun/security/tools/jarsigner/compatibility/SignTwice.java slow on Windows
JDK-8300043 JFR: Don't commit JFR internal jdk.JavaMonitorWait events
JDK-8299363 JNI exception pending in awt_GraphicsEnv.c:1432
JDK-8299372 KeepAliveCache Blocks Threads while Closing Connections
JDK-8299581 LineBodyHandlerTest.java creates and discards too many clients
JDK-8299578 Make floating-point test infrastructure more lambda and method reference friendly
JDK-8301334 maxOutputSize, instead of javatest.maxOutputSize, should be used in TEST.properties
JDK-8301335 misc crash dump improvements
JDK-8299466 misc tests failed "assert(false) failed: graph should be schedulable"
JDK-8299583 missing is_unloading() check in SharedRuntime::fixup_callers_callsite()
JDK-8302333 Modify TextAreaTextEventTest.java as to verify the content change of TextComponent sends TextEvent
JDK-8300959 Move jdk.X509Certificate event logic to JCA layer
JDK-8303556 NoClassDefFoundError omits original ExceptionInInitializerError
JDK-8300219 PhaseIdealLoop::only_has_infinite_loops must detect all loops that never lead to termination
JDK-8303332 Problem list SA core file tests on macosx-x64 due to JDK-8294316
JDK-8299810 ProblemList java/text/Format/NumberFormat/CurrencyFormat.java
JDK-8300214 Provide a JavadocTester method for non-overlapping, unordered output matching
JDK-8300858 Reference discovery is confused about atomicity and degree of parallelism
JDK-8299358 Remove javascript references from clhsdb.html
JDK-8301591 Remove vmTestbase/nsk/monitoring/MemoryPoolMBean/isCollectionUsageThresholdExceeded/isexceeded003 from ProblemList.txt
JDK-8302588 Rendering Issues with Borders on Windows High-DPI systems
JDK-8299579 resourcehogs/serviceability/sa/TestHeapDumpForLargeArray.java can fail if GC occurs
JDK-8299357 resourcehogs/serviceability/sa/TestHeapDumpForLargeArray.java timed out
JDK-8302196 ResponseBodyBeforeError: AssertionError or SSLException: Unsupported or unrecognized SSL message
JDK-8299450 serviceability/sa/TestJmapCore.java timed out on macOS 10.13.6
JDK-8301705 ShortResponseBody could be made more resilient to rogue connections
JDK-8299626 SIGSEGV in PhaseIdealLoop::build_loop_late_post_work
JDK-8302450 Speed up compiler/intrinsics/string/TestStringLatin1IndexOfChar.java
JDK-8302329 Speed up test sun/net/www/protocol/https/HttpsClient/ProxyAuthTest.java
JDK-8299361 src/jdk.hotspot.agent/doc/index.html file contains references to scripts that no longer exist
JDK-8302332 sun/net/www/http/HttpClient/MultiThreadTest.java sometimes detect threads+1 connections
JDK-8302198 sun/util/logging/PlatformLoggerTest.java failed with "RuntimeException: Retrieved backing PlatformLogger level null is not the expected CONFIG"
JDK-8302580 Test jdk/tools/jpackage/windows/WinInstallerIconTest always fails on Windows 11
JDK-8301588 Test to cover CodeSource.getCodeSigners()
JDK-8303461 test/jdk/java/nio/file/Files/probeContentType/Basic.java fails on some systems for the ".rar" extension
JDK-8299406 testlibrary_tests/ir_framework/tests/TestCheckedTests.java fails after JDK-8274911
JDK-8299360 testlibrary_tests/ir_framework/tests/TestIRMatching.java fails with "java.lang.RuntimeException: Should have thrown exception"
JDK-8301333 TestScenarios.java does not check for "" correctly
JDK-8302584 The left line of the TitledBorder is not painted on 150 scale factor
JDK-8299366 Throw error if default java.security file is missing
JDK-8302717 Tier1 validate-source fails after 8279614
JDK-8299584 TYPE_USE annotations on generic type arguments of record components discarded
JDK-8303190 Undefined Behavior in C2 regalloc with null references
JDK-8300041 Update IANA Language Subtag Registry to Version 2022-03-02
JDK-8300960 Update IANA Language Subtag Registry to Version 2022-08-08
JDK-8300860 Update jib GNU make dependency on Windows to latest cygwin build
JDK-8299897 Update LCMS to 2.14
JDK-8301051 Update Libpng to 1.6.38
JDK-8299407 Update Zlib Data Compression Library to Version 1.2.13
JDK-8300044 Upgrade jQuery to 3.6.1
JDK-8299473 URLPermission constructor exception when using tr locale
JDK-8299820 URLPermission constructor throws IllegalArgumentException: Invalid characters in hostname after JDK-8294378
JDK-8299586 Use 64bit atomics in patch_verified_entry on x86_64
JDK-8299469 Use correct register in aarch64_enc_fast_unlock()
JDK-8300233 vmTestbase/nsk/jdi/ThreadStartEvent/thread/thread001 failed due to SocketTimeoutException
JDK-8301708 Weak CAS VarHandle/Unsafe tests should test always-failing cases
JDK-8302287 Write a test to verify List sends ItemEvent/ActionEvent
JDK-8301582 Wrong defect ID in the code of test LocalRMIServerSocketFactoryTest.java
JDK-8299463 ZGC: C2 late barrier analysis uses invalid dominator information

Ichiroh Takiguchi, IBM

Bug Summary
JDK-8301816 CustomTzIDCheckDST.java may fail at future date

Jatin Bhateja, Intel

Bug Summary
JDK-8299029 Optimize Vector.rearrange over byte vectors for AVX512BW targets.

Johan Sjölen, Oracle

Bug Summary
JDK-8301198 converting a defined BasicType value to a string should not crash the VM

Dan Lutker, Amazon

Bug Summary
JDK-8301256 GCC 12 reports some compiler warnings in bundled freetype
JDK-8301253 Incorrect argument processing in java launcher

Matthias Baesken, SAP

Bug Summary
JDK-8300186 [TESTBUG] SADebugDTest.java does not handle "Address already in use" error
JDK-8300104 containers/docker/TestMemoryWithCgroupV1.java fails on SLES12 ppc64le when testing Memory and Swap Limit
JDK-8302541 Detect Virtualization on Linux aarch64
JDK-8302465 Enhance error logging in instrument coding with additional jplis_assert_msg
JDK-8299421 GetPrimitiveArrayCritical in imageioJPEG misses result - NULL check
JDK-8299431 improve cleanup and error handling of awt_parseColorModel in awt_parseImage.c
JDK-8300045 java/util/regex/NegativeArraySize.java fails on Alpine and sometimes Windows
JDK-8302193 perfMemory_windows.cpp add free_security_attr to early returns
JDK-8299206 Problemlist several sun/security tests until JDK-8295343 is resolved
JDK-8299514 Provide better descriptions for JIT compiler JFR events
JDK-8299422 Provide better descriptions for some Operating System JFR events
JDK-8300444 sun/jvm/hotspot/SALauncher.java handling of negative rmiport args
JDK-8299432 sun/security/ssl/SSLSessionImpl/ResumptionUpdateBoundValues.java fails intermittent
JDK-8300445 sun/tools/jhsdb/SAGetoptTest.java fails after 8299470
JDK-8302466 Swing test bug8078268 make latch timeout configurable
JDK-8300049 TestPrintXML.java output error messages in case compare fails
JDK-8299939 Various GetPrimitiveArrayCritical miss result - NULL check

Martin Doerr, SAP

Bug Summary
JDK-8299428 compiler/codecache/MHIntrinsicAllocFailureTest.java fails intermittently
JDK-8299427 VirtualMachineError: Out of space in CodeCache for method handle intrinsic

Masanori Yano, Fujitsu

Bug Summary
JDK-8301107 [macosx] test java/awt/Frame/ShapeNotSetSometimes/ShapeNotSetSometimes.java fails (again)
JDK-8303360 Test javax/swing/border/TestTitledBorderLeak.java fails

nagata.haruhito, Fujitsu

Bug Summary
JDK-8299346 Tests may fail with zh locale on MacOS

Paul Hohensee, Amazon

Bug Summary
JDK-8298395 Code signing warnings after JDK-8293550
JDK-8298394 compare.sh fails on macos after JDK-8293550

Patrick Zhang, Ampere

Bug Summary
JDK-8303003 AArch64: Detect Ampere-1 and Ampere-1A CPUs and set default options

Roman Marchenko, Azul

Bug Summary
JDK-8302593 javadoc cannot link to old docs (with old style anchors)

Richard Reingruber, SAP

Bug Summary
JDK-8300103 com/sun/jdi/EATests.java fails with compiler flag -XX:+StressReflectiveCode
JDK-8298844 frame::interpreter_frame_print_on() crashes if free BasicObjectLock exists in frame

Radim Vansa, Azul

Bug Summary
JDK-8301857 [JVMCI] BytecodeFrame.equals is broken
JDK-8301860 jar validator doesn't account for minor class file version
JDK-8303164 Resolving URI relative path with no / may lead to incorrect toString

Sergey Bylokhov, Amazon

Bug Summary
JDK-8299400 AWT test TestSinhalaChar.java has old SCCS markings
JDK-8300175 Compilation of gtest causes build to fail if runtime libraries are in different dirs
JDK-8301102 Disable an assertion in test/jdk/java/util/DoubleStreamSums/CompensatedSums.java
JDK-8298534 Document Filter attached to JPasswordField and setText("") is not cleared instead inserted characters replaced with unicode null characters
JDK-8299417 getLocalGraphicsEnvironment() on for multi-screen setups throws exception NPE
JDK-8299484 Incorrect comparator com.sun.beans.introspect.MethodInfo.MethodOrder
JDK-8299010 java/lang/String/StringRepeat.java test requests too much heap on windows x86
JDK-8301157 Missing comma in copyright header
JDK-8299556 Random crashes while the UI code is executed
JDK-8301257 Regression test java/awt/font/TextLayout/CombiningPerf.java fails
JDK-8299401 Remove SCCS id's from awt jtreg tests
JDK-8301103 sRGB-ColorSpace to sRGB-ColorSpace Conversion

Severin Gehwolf, Red Hat

Bug Summary
JDK-8299797 Add a regression test for JDK-8297684
JDK-8299389 Cannot use '-Djava.system.class.loader' with class loader in signed JAR
JDK-8300859 CgroupMetrics.getTotalMemorySize0() can report invalid results on 32 bit systems
JDK-8300191 Fix autoconf 2.71 warning "AC_CHECK_HEADERS: you should use literals"
JDK-8299866 java/security/SignedJar/spi-calendar-provider/TestSPISigned.java failing on Windows
JDK-8305449 Use default visibility for static library builds

Scott Gibbons, Intel

Bug Summary
JDK-8303205 CipherCore.doFinal(...) causes potentially massive byte[] allocations during decryption

Aleksey Shipilev, Amazon

Bug Summary
JDK-8300524 JDK-8285093 changed the default for --with-output-sync
JDK-8300525 Objects.requireNonNull should be ForceInline
JDK-8299905 VM_Cleanup unnecessarily processes all thread oops
JDK-8299550 Zero: Fix _fast_{i,f}access_0 bytecodes handling
JDK-8299549 Zero: Implement fast bytecodes

Thomas Stuefe, Red Hat

Bug Summary
JDK-8300023 Add pid to process reaper thread name
JDK-8301827 chunklevel::MAX_CHUNK_WORD_SIZE too small for some applications
JDK-8301242 Don't purge metaspace mapping lists
JDK-8301322 Increase size of metaspace mappings
JDK-8301241 libjsig should ignore non-modifying sigaction calls
JDK-8301323 Metaspace::contains() should be threadsafe
JDK-8299799 NMT should perform buffer overrun checks
JDK-8301490 NMT: Remove NMT shutdown capability
JDK-8299846 NMT: Remove VM.native_memory shutdown jcmd command option
JDK-8300020 Print active locale settings in hs_err reports and in VM.info
JDK-8299868 Remove debug-only heap overrun checks in os::malloc and friends
JDK-8299955 Show stack dimensions in UL logging when attaching threads
JDK-8301240 Signal Handlers printout should show signal block state
JDK-8299800 Unify C-heap buffer overrun checks into NMT

Victor Rudometov, Amazon

Bug Summary
JDK-8301808 Improve test coverage for XPath functions: Boolean Functions
JDK-8301629 Improve test coverage for XPath functions: Node Set Functions
JDK-8301809 Improve test coverage for XPath functions: Number Functions
JDK-8301807 Improve test coverage for XPath functions: String Functions
JDK-8302900 Prefer ArrayList to LinkedList in LayoutComparator
JDK-8303011 Speed up compiler/arraycopy/TestArrayCopyConjoint.java
JDK-8302901 Speed up tests with infinite loops, sleep less
JDK-8301100 Usage of constructors of primitive wrapper classes should be avoided in java.desktop API docs
JDK-8301799 Write a test to verify the components selection sends ItemEvent

Yuri Nesterenko, Azul

Bug Summary
JDK-8302192 Fix possible leak in SpNegoContext dispose

yifan.tsai, Independent

Bug Summary
JDK-8299413 Improve MD5 intrinsic for x86_64

Yasumasa Suenaga, NTT DATA

Bug Summary
JDK-8301104 compiler/jvmci/errors/TestInvalidDebugInfo.java fails new assert: assert((uint)t < T_CONFLICT + 1) failed: invalid type #
JDK-8301101 GCC 12 reports some compiler warnings
JDK-8300936 GCC 12 reports use-after-free potential bugs