PUSHES REPORT: 17.0.9

This report shows who pushed the backports to the given release. This usually shows who did the backporting, testing, and review work.

Report generated: Fri May 03 07:18:42 CEST 2024

Distribution by priority

Count Priority
1 P1
15 P2
68 P3
269 P4
13 P5

Distribution by components

Count Component
366 100% Total
209 57.1% hotspot
89 24.3% hotspot/compiler
70 19.1% hotspot/runtime
23 6.3% hotspot/gc
11 3.0% hotspot/jfr
6 1.6% hotspot/svc
5 1.4% hotspot/test
3 0.8% hotspot/other
1 0.3% hotspot/jvmti
1 0.3% hotspot/svc-agent
56 15.3% client-libs
27 7.4% client-libs/java.awt
12 3.3% client-libs/2d
9 2.5% client-libs
6 1.6% client-libs/javax.swing
1 0.3% client-libs/javax.sound
1 0.3% client-libs/java.beans
39 10.7% infrastructure
32 8.7% infrastructure/build
5 1.4% infrastructure
2 0.5% infrastructure/release_eng
24 6.6% security-libs
12 3.3% security-libs/java.security
3 0.8% security-libs/jdk.security
3 0.8% security-libs
2 0.5% security-libs/javax.net.ssl
1 0.3% security-libs/javax.smartcardio
1 0.3% security-libs/javax.xml.crypto
1 0.3% security-libs/javax.security
1 0.3% security-libs/javax.crypto:pkcs11
21 5.7% core-libs
6 1.6% core-libs/java.net
2 0.5% core-libs/java.nio
2 0.5% core-libs/java.lang
2 0.5% core-libs/java.util.jar
1 0.3% core-libs/java.util.concurrent
1 0.3% core-libs/java.io:serialization
1 0.3% core-libs/java.util
1 0.3% core-libs/java.lang.invoke
1 0.3% core-libs/java.io
1 0.3% core-libs/java.text
1 0.3% core-libs/java.time
1 0.3% core-libs/java.util:i18n
1 0.3% core-libs/javax.naming
10 2.7% tools
4 1.1% tools/javadoc(tool)
2 0.5% tools/javac
2 0.5% tools/launcher
1 0.3% tools/jpackage
1 0.3% tools/javap
4 1.1% core-svc
2 0.5% core-svc/debugger
1 0.3% core-svc/tools
1 0.3% core-svc/java.lang.management
3 0.8% xml
3 0.8% xml/jaxp

Distribution by affiliation

This Release Pushes

Original Pushes

Count Committer
365 100% Total
152 41.6% SAP
80 21.9% Goetz Lindenmaier
48 13.2% Martin Doerr
13 3.6% Matthias Baesken
5 1.4% Christoph Langer
4 1.1% Andrew Lu
2 0.5% Ralf Schmelter
97 26.6% Amazon
67 18.4% Aleksey Shipilev
7 1.9% Ben Taylor
5 1.4% Sergey Bylokhov
4 1.1% William Kemper
4 1.1% Chad Rakoczy
3 0.8% Jenny Shivayogi
3 0.8% Oli Gillespie
2 0.5% Roman Kennke
1 0.3% Xin Liu
1 0.3% Dan Lutker
86 23.6% Independent
81 22.2% Fei Yang
1 0.3% yifan.tsai
1 0.3% Andrey Turbanov
1 0.3% Gui Cao
1 0.3% Dingli Zhang
1 0.3% kirill
9 2.5% Azul
5 1.4% Sergey Nazarkin
2 0.5% Yuri Nesterenko
1 0.3% Alexey Bakhtin
1 0.3% Roman Marchenko
6 1.6% Red Hat
2 0.5% Frederic Thevenet
1 0.3% Andrew Leonard
1 0.3% Sonia Zaldana Calles
1 0.3% Andrew Hughes
1 0.3% Zdenek Zambersky
3 0.8% Fujitsu
2 0.5% nagata.haruhito
1 0.3% Kimura Yukihiro
3 0.8% Huawei
3 0.8% Feilong Jiang
2 0.5% BellSoft
2 0.5% Alexandr Scherbatiy
2 0.5% Microsoft
1 0.3% Dhamoder Nalla
1 0.3% George Adams
1 0.3% ARM
1 0.3% Ningsheng Jian
1 0.3% IBM
1 0.3% Tyler Steele
1 0.3% Intel
1 0.3% Scott Gibbons
1 0.3% Rivos
1 0.3% Robbin Ehn
1 0.3% Syntacore
1 0.3% Vladimir Kempik
Count Committer
365 100% Total
143 39.2% Oracle
11 3.0% Philip Race
5 1.4% Harshitha Onkar
5 1.4% Magnus Ihse Bursie
5 1.4% David Holmes
5 1.4% Alexey Ivanov
4 1.1% Markus Grönlund
4 1.1% Tejesh R
4 1.1% Daniel Daugherty
4 1.1% Alexander Zuev
4 1.1% Rajan Halade
4 1.1% Coleen Phillimore
4 1.1% Alisen Chung
3 0.8% Sibabrata Sahoo
3 0.8% Douglas Simon
3 0.8% Tobias Holenstein
3 0.8% Thomas Schatzl
3 0.8% Emanuel Peter
3 0.8% Hannes Wallnoefer
3 0.8% Ioi Lam
3 0.8% Prasanta Sadhukhan
3 0.8% Claes Redestad
2 0.5% Weijun Wang
2 0.5% Gerard Ziemski
2 0.5% Jayathirth D V
2 0.5% Valerie Peng
2 0.5% Alexander Zvegintsev
2 0.5% Kim Barrett
2 0.5% Erik Gahlin
2 0.5% Chris Plummer
2 0.5% Christian Stein
2 0.5% Renjith Kannath Pariyangad
2 0.5% Jaikiran Pai
2 0.5% Jonathan Gibbons
2 0.5% Justin Lu
1 0.3% Sean Mullan
1 0.3% Albert Yang
1 0.3% Joe Wang
1 0.3% Sean Coffey
1 0.3% Leo Korinth
1 0.3% Poonam Bajaj Parhar
1 0.3% Roger Riggs
1 0.3% Mahendra Chhipa
1 0.3% Tobias Hartmann
1 0.3% Matthew Donovan
1 0.3% Erik Österlund
1 0.3% Eric Nothum
1 0.3% Erik Joelsson
1 0.3% Rajat Mahajan
1 0.3% Damon Fenacci
1 0.3% Lawrence Andrews
1 0.3% Srinivas Mandalika
1 0.3% Alexey Semenyuk
1 0.3% Aleksandre Iline
1 0.3% Leonid Mesnik
1 0.3% Lance Andersen
1 0.3% Aleksej Efimov
1 0.3% Axel Boldt-Christmas
1 0.3% Damon Nguyen
1 0.3% Harold Seigel
1 0.3% Johan Sjölen
1 0.3% Ramkumar Sunderbabu
1 0.3% Mandy Chung
1 0.3% Christian Hagedorn
1 0.3% ivan.bereziuk
1 0.3% Viktor Klang
57 15.6% Independent
20 5.5% Fei Yang
18 4.9% Xiaolin Zheng
6 1.6% Dingli Zhang
4 1.1% Gui Cao
2 0.5% Sergey Tsypanov
1 0.3% yifan.tsai
1 0.3% Julian Waters
1 0.3% Peter Levart
1 0.3% Eirik Bjørsnøs
1 0.3% kirill
1 0.3% Zhengyu Gu
1 0.3% Guoxiong Li
51 14.0% Amazon
30 8.2% Aleksey Shipilev
7 1.9% Roman Kennke
4 1.1% Sergey Bylokhov
3 0.8% Oli Gillespie
2 0.5% Xin Liu
1 0.3% Ben Taylor
1 0.3% Yi-Fan Tsai
1 0.3% Y. Ramakrishna
1 0.3% Dan Lutker
1 0.3% Volker Simonis
27 7.4% SAP
11 3.0% Matthias Baesken
4 1.1% Goetz Lindenmaier
4 1.1% Christoph Langer
3 0.8% Ralf Schmelter
3 0.8% Johannes Bechberger
2 0.5% Martin Doerr
25 6.8% Huawei
21 5.8% Feilong Jiang
3 0.8% Yadong Wang
1 0.3% Yanhong Zhu
20 5.5% Red Hat
8 2.2% Thomas Stuefe
4 1.1% Roland Westrelin
2 0.5% Ashutosh Mehra
2 0.5% Severin Gehwolf
2 0.5% Zdenek Zambersky
1 0.3% Frederic Thevenet
1 0.3% Andrew Hughes
8 2.2% Unknown
8 2.2% N/A
6 1.6% Tencent
4 1.1% Jie Fu
1 0.3% Peng Xie
1 0.3% Xuelei Fan
4 1.1% Syntacore
3 0.8% Vladimir Kempik
1 0.3% ilya.gavrilin
3 0.8% BellSoft
2 0.5% Alexandr Scherbatiy
1 0.3% Dmitry Chuyko
3 0.8% Google
2 0.5% Justin King
1 0.3% Jiangli Zhou
3 0.8% Rivos
2 0.5% Ludovic Henry
1 0.3% Robbin Ehn
2 0.5% ARM
1 0.3% Ningsheng Jian
1 0.3% Pengfei Li
2 0.5% Alibaba
1 0.3% yansendao.ysd
1 0.3% Yi Yang
2 0.5% Fujitsu
1 0.3% Kimura Yukihiro
1 0.3% Takuya Kiriyama
2 0.5% NTT DATA
2 0.5% Yasumasa Suenaga
1 0.3% @proton.me
1 0.3% largeprimes
1 0.3% Azul
1 0.3% Yuri Nesterenko
1 0.3% DataDog
1 0.3% Richard Startin
1 0.3% Intel
1 0.3% Scott Gibbons
1 0.3% Loongson
1 0.3% Sun Guoyun
1 0.3% Microsoft
1 0.3% Dhamoder Nalla
1 0.3% VMWare
1 0.3% Vyom Tewari

Chronological push log:

UTC Time This Release Push By Original Push By Bug Summary
Name Affiliation Name Affiliation
2023/10/09 14:30 Goetz Lindenmaier SAP (same) (same) JDK-8317700 [17u] Undo backport 8317674 of 8316566 which was pushed to wrong repo.
2023/10/06 12:03 Robbin Ehn Rivos (same) (same) JDK-8317674 RISC-V: Zero extended narrow oop passed to Atomic::cmpxchg
2023/10/06 07:31 Christoph Langer SAP (same) (same) JDK-8317643 [17u] Remove designator DEFAULT_PROMOTED_VERSION_PRE=ea for release 17.0.9
2023/09/28 12:00 Yuri Nesterenko Azul (same) (same) JDK-8317040 Exclude cleaner test failing on older releases
2023/09/15 10:47 Goetz Lindenmaier SAP Alexey Ivanov Oracle JDK-8316353 Ideographic characters aren't stretched by AffineTransform.scale(2, 1)
2023/09/05 16:45 Martin Doerr SAP (same) (same) JDK-8315707 C1 compilation crashes in LinearScan::resolve_exception_edge
2023/09/02 08:15 Martin Doerr SAP Rajan Halade Oracle JDK-8315564 Add Certigna Root CA - 2
2023/08/30 05:55 Aleksey Shipilev Amazon Roland Westrelin Red Hat JDK-8315308 C2: Sinking node may cause required cast to be dropped
2023/08/30 05:46 Aleksey Shipilev Amazon (same) (same) JDK-8315307 Print instruction blocks in byte units
2023/08/29 15:10 Oli Gillespie Amazon (same) (same) JDK-8315237 SymbolTable can leak Symbols during cleanup
2023/08/29 15:08 Oli Gillespie Amazon (same) (same) JDK-8315235 JNI NewWeakGlobalRef throws exception for null arg
2023/08/29 07:30 Matthias Baesken SAP (same) (same) JDK-8315212 some tests fail in case ipv6 is disabled on the machine
2023/08/29 02:28 Andrew Hughes Red Hat (same) (same) JDK-8315159 GHA: Use GCC Major Version Dependencies Only
2023/08/28 15:13 Alexandr Scherbatiy BellSoft (same) (same) JDK-8315115 [macos] PrinterJob does not take into account Sides attribute
2023/08/28 05:26 Alexandr Scherbatiy BellSoft (same) (same) JDK-8315077 macOS: Print content cut off when width > height with portrait orientation
2023/08/26 14:32 Kimura Yukihiro Fujitsu (same) (same) JDK-8313815 The exception messages printed by jcmd ManagementAgent.start are corrupted on Japanese Windows
2023/08/25 15:30 Aleksey Shipilev Amazon Thomas Stuefe Red Hat JDK-8315036 runtime/os/TestTrimNative.java is failing on slow machines
2023/08/25 14:30 Aleksey Shipilev Amazon Thomas Stuefe Red Hat JDK-8315032 New test runtime/os/TestTrimNative.java#trimNative is failing: did not see the expected RSS reduction
2023/08/25 13:19 Aleksey Shipilev Amazon Thomas Stuefe Red Hat JDK-8315028 JVM should trim the native heap
2023/08/25 06:57 Matthias Baesken SAP Roger Riggs Oracle JDK-8314992 java/lang/ProcessHandle tests fail with "RuntimeException: Input/output error" in java.lang.ProcessHandleImpl$Info.info0
2023/08/25 06:37 Aleksey Shipilev Amazon (same) (same) JDK-8314989 GHA: Drop libfreetype6-dev transitional package in favor of libfreetype-dev
2023/08/25 06:33 Aleksey Shipilev Amazon (same) (same) JDK-8314987 GHA: RISC-V should use the official repository for bootstrap
2023/08/25 06:22 Aleksey Shipilev Amazon N/A Unknown JDK-8314985 Incorrect description for jtreg-failure-handler option
2023/08/24 17:00 Andrey Turbanov Independent Ralf Schmelter SAP JDK-8314962 Add resolved IP address in connection exception for sockets
2023/08/23 18:42 Dan Lutker Amazon (same) (same) JDK-8314552 Fix javadoc tests to work with jtreg 7
2023/08/23 06:31 Aleksey Shipilev Amazon (same) (same) JDK-8314857 Shenandoah: sun/tools/jhsdb/heapconfig/JMapHeapConfigTest.java fails
2023/08/23 06:30 Aleksey Shipilev Amazon (same) (same) JDK-8314856 hs_err should print more stack in hex dump
2023/08/23 06:28 Aleksey Shipilev Amazon (same) (same) JDK-8314658 [17u] GHA: Sync up debian-version for cross-builds
2023/08/22 15:03 Ben Taylor Amazon (same) (same) JDK-8315222 Bump update version for OpenJDK: jdk-17.0.8.1
2023/08/22 12:39 Fei Yang Independent Feilong Jiang Huawei JDK-8314770 Re-enable locked_create_entry symbol check in runtime/NMT/CheckForProperDetailStackTrace.java for RISC-V
2023/08/22 12:37 Feilong Jiang Huawei (same) (same) JDK-8314769 RISC-V: Incorrect VMReg encoding in RISCV64Frame.java
2023/08/21 09:16 Aleksey Shipilev Amazon Vyom Tewari VMWare JDK-8314640 Socket.setOption(TCP_QUICKACK) uses wrong level
2023/08/21 09:14 Aleksey Shipilev Amazon Gerard Ziemski Oracle JDK-8314639 Early crashes in os::print_context on AArch64
2023/08/21 09:12 Aleksey Shipilev Amazon (same) (same) JDK-8314638 Amend TestLoadIndexedMismatch test to target intrinsic directly
2023/08/21 09:11 Aleksey Shipilev Amazon (same) (same) JDK-8314637 GHA: Cut down cross-compilation sysroots deeper
2023/08/21 09:10 Aleksey Shipilev Amazon (same) (same) JDK-8314636 Update JMH devkit to 1.37
2023/08/20 07:05 Dingli Zhang Independent (same) (same) JDK-8314617 Implement fast-path for ASCII-compatible CharsetEncoders on RISC-V
2023/08/18 17:58 Ralf Schmelter SAP (same) (same) JDK-8314596 jdk/jfr/jvm/TestDumpOnCrash.java fails on Linux ppc64le and Linux aarch64
2023/08/18 16:22 Ben Taylor Amazon Lance Andersen Oracle JDK-8314587 Invalid CEN header (invalid zip64 extra data field size)
2023/08/16 18:15 Ben Taylor Amazon Richard Startin DataDog JDK-8314459 AsyncGetCallTrace crash on unreadable interpreter method pointer
2023/08/16 10:37 Aleksey Shipilev Amazon (same) (same) JDK-8314410 C1: Incorrect LoadIndexed value numbering
2023/08/16 08:39 Aleksey Shipilev Amazon (same) (same) JDK-8314400 GHA: Cut down cross-compilation sysroots
2023/08/16 08:34 Aleksey Shipilev Amazon (same) (same) JDK-8314399 GHA: qemu-debootstrap is deprecated, use the regular one
2023/08/16 08:33 Aleksey Shipilev Amazon Julian Waters Independent JDK-8314398 Minor improvements in MSYS2 Workflow handling
2023/08/16 08:18 Aleksey Shipilev Amazon Claes Redestad Oracle JDK-8314396 Update jib-profiles.js to use JMH 1.34 devkit
2023/08/16 08:18 Aleksey Shipilev Amazon Claes Redestad Oracle JDK-8314395 Update jib-profiles.js to use JMH 1.33 devkit
2023/08/16 08:18 Aleksey Shipilev Amazon Claes Redestad Oracle JDK-8314394 JMH 1.34 and later requires jopt-simple 5.0.4
2023/08/16 08:16 Aleksey Shipilev Amazon Zdenek Zambersky Red Hat JDK-8314393 Add lib-test tier1 testing in GHA
2023/08/14 14:11 Martin Doerr SAP Rajan Halade Oracle JDK-8314223 security/infra/java/security/cert/CertPathValidator/certification/AmazonCA.java fails
2023/08/14 08:19 Aleksey Shipilev Amazon (same) (same) JDK-8314207 Update JMH devkit to 1.36
2023/08/14 08:11 Aleksey Shipilev Amazon (same) (same) JDK-8314206 GHA: Bootstrap sysroots with --variant=minbase
2023/08/14 08:11 Aleksey Shipilev Amazon (same) (same) JDK-8314205 GHA: Bump GCC versions for July 2023 updates
2023/08/14 08:11 Aleksey Shipilev Amazon Magnus Ihse Bursie Oracle JDK-8314204 Run GHA manually with user-specified make and configure arguments
2023/08/14 08:11 Aleksey Shipilev Amazon Magnus Ihse Bursie Oracle JDK-8314203 GHA: dump config.log in case of configure failure
2023/08/14 08:11 Aleksey Shipilev Amazon (same) (same) JDK-8314202 GHA: Harmonize GCC version handling for host and cross builds
2023/08/14 08:11 Aleksey Shipilev Amazon (same) (same) JDK-8314201 GHA: Bump to Ubuntu 22.04
2023/08/11 21:26 Martin Doerr SAP Chris Plummer Oracle JDK-8314178 vmTestbase/nsk/jdb/interrupt/interrupt001/interrupt001.java timed out due to missing prompt
2023/08/11 21:25 Martin Doerr SAP Severin Gehwolf Red Hat JDK-8314177 Add container tests for on-the-fly resource quota updates
2023/08/11 21:25 Martin Doerr SAP Rajan Halade Oracle JDK-8314176 ListKeychainStore.sh fails in some virtualized environments
2023/08/11 21:24 Martin Doerr SAP Chris Plummer Oracle JDK-8314175 nsk/jdb tests don't pass -verbose flag to the debuggee
2023/08/10 18:20 Roman Marchenko Azul Yasumasa Suenaga NTT DATA JDK-8314128 configure script failed on WSL
2023/08/10 10:06 Andrew Leonard Red Hat Ioi Lam Oracle JDK-8314098 Sort classlist in JDK image
2023/08/10 08:38 Martin Doerr SAP Matthew Donovan Oracle JDK-8314090 Missing coverage for javax.xml.crypto.dom.DOMCryptoContext
2023/08/10 08:38 Martin Doerr SAP Justin Lu Oracle JDK-8314089 (cal) Japanese calendar unit test system should avoid multiple static imports
2023/08/10 08:37 Martin Doerr SAP Philip Race Oracle JDK-8314088 Update test java/awt/Choice/DragOffNoSelect.java
2023/08/10 08:34 Martin Doerr SAP Eirik Bjørsnøs Independent JDK-8314087 Update VerifySignedJar to actually exercise and test verification
2023/08/09 16:46 Sergey Bylokhov Amazon Peter Levart Independent JDK-8314057 java/io/ObjectStreamClass/ObjectStreamClassCaching.java fails with various GCs
2023/08/09 14:32 Christoph Langer SAP Weijun Wang Oracle JDK-8314049 Update Public Suffix List to 88467c9
2023/08/09 13:21 Martin Doerr SAP Renjith Kannath Pariyangad Oracle JDK-8314043 Remove UTF-8 character from TaskbarPositionTest.java
2023/08/09 13:19 Martin Doerr SAP largeprimes @proton.me JDK-8314042 Off-by-one bug when searching arrays in AlpnGreaseTest
2023/08/09 13:19 Martin Doerr SAP Jonathan Gibbons Oracle JDK-8314040 T6587786.java failed after JDK-8189997
2023/08/09 13:18 Martin Doerr SAP Takuya Kiriyama Fujitsu JDK-8314039 tools/launcher/I18NArgTest.java fails on Japanese Windows environment
2023/08/08 17:41 Sergey Bylokhov Amazon (same) (same) JDK-8313964 GCC 7 reports compiler warning in bundled freetype 2.13.0
2023/08/02 11:00 Sonia Zaldana Calles Red Hat Aleksey Shipilev Amazon JDK-8313615 Zero: Handle "zero" variant in CommandLineOptionTest.java
2023/08/02 08:20 Aleksey Shipilev Amazon (same) (same) JDK-8313604 Linux: Provide the option to override the timer slack
2023/08/02 01:58 Gui Cao Independent (same) (same) JDK-8313577 TestIRMatching.java fails on RISC-V
2023/08/01 17:06 Tyler Steele IBM Matthias Baesken SAP JDK-8313561 [AIX] Broken build after JDK-8307301
2023/08/01 12:44 Aleksey Shipilev Amazon Erik Joelsson Oracle JDK-8313546 Reconfigure check should include make/conf/version-numbers.conf
2023/07/31 17:24 Ralf Schmelter SAP (same) (same) JDK-8313423 Metadata for regionsRefilled of G1EvacuationStatistics event is wrong
2023/07/26 13:47 Goetz Lindenmaier SAP N/A Unknown JDK-8313188 [JFR] Better handling of tampered JFR repository
2023/07/26 06:58 Goetz Lindenmaier SAP Aleksej Efimov Oracle JDK-8313154 Add exception handler method to the BaseLdapServer
2023/07/26 06:56 Goetz Lindenmaier SAP Justin Lu Oracle JDK-8313152 CurrencySymbols.properties is missing the copyright notice
2023/07/26 06:54 Goetz Lindenmaier SAP yansendao.ysd Alibaba JDK-8313151 [TESTBUG] sun/security/provider/SecureRandom/AbstractDrbg/SpecTest.java intermittently timeout
2023/07/26 06:52 Goetz Lindenmaier SAP Hannes Wallnoefer Oracle JDK-8313150 Verify version numbers in legal files
2023/07/26 06:48 Goetz Lindenmaier SAP Mahendra Chhipa Oracle JDK-8313149 Improve test coverage for XPath Axes: namespace
2023/07/26 06:24 Andrew Lu SAP Lawrence Andrews Oracle JDK-8313146 [TESTBUG] Error: Not a test or directory containing tests: java/awt/print/PrinterJob/InitToBlack.java
2023/07/26 06:17 Andrew Lu SAP Damon Nguyen Oracle JDK-8313145 java/awt/dnd/NoFormatsDropTest/NoFormatsDropTest.java timed out
2023/07/25 14:17 Aleksey Shipilev Amazon Thomas Stuefe Red Hat JDK-8312971 Provide clean, platform-agnostic interface to C-heap trimming
2023/07/25 11:27 Matthias Baesken SAP (same) (same) JDK-8312895 report some fontconfig related environment variables in hs_err file
2023/07/25 10:57 Goetz Lindenmaier SAP Joe Wang Oracle JDK-8312881 Update Commons BCEL to Version 6.7.0
2023/07/25 01:07 Feilong Jiang Huawei (same) (same) JDK-8312511 GHA: Bump cross-compile runner to Ubuntu 22.04
2023/07/23 10:35 nagata.haruhito Fujitsu Hannes Wallnoefer Oracle JDK-8312543 JQuery UI license file not updated
2023/07/23 10:35 nagata.haruhito Fujitsu Hannes Wallnoefer Oracle JDK-8312542 Upgrade jQuery UI to version 1.13.2
2023/07/23 08:43 Goetz Lindenmaier SAP Daniel Daugherty Oracle JDK-8312540 Performance regression in LockSupport.unpark with lots of idle threads
2023/07/23 08:41 Goetz Lindenmaier SAP Weijun Wang Oracle JDK-8312539 Remove BadKeyUsageTest.java from Problem List
2023/07/23 08:39 Goetz Lindenmaier SAP Coleen Phillimore Oracle JDK-8312538 remove test/lib/sun/hotspot
2023/07/23 08:38 Goetz Lindenmaier SAP Jie Fu Tencent JDK-8312537 com/sun/security/auth/module/AllPlatforms.java fails to compile
2023/07/23 08:38 Goetz Lindenmaier SAP Sibabrata Sahoo Oracle JDK-8312536 Cover logout method for several LoginModule
2023/07/21 17:15 Ben Taylor Amazon Roland Westrelin Red Hat JDK-8312517 C2: crash in SubTypeCheckNode::sub() at IGVN split if
2023/07/21 15:46 Roman Kennke Amazon Markus Grönlund Oracle JDK-8312514 jdk/jfr/event/oldobject/TestLargeRootSet.java failed "assert(!contains(edge->reference())) failed: invariant"
2023/07/21 15:33 Roman Kennke Amazon Markus Grönlund Oracle JDK-8312513 Prepare Leak Profiler for Lilliput
2023/07/21 08:29 Martin Doerr SAP Alisen Chung Oracle JDK-8312497 Update FreeType to 2.13.0
2023/07/21 08:11 George Adams Microsoft Jaikiran Pai Oracle JDK-8312496 Bundle zlib by default with JDK on macos aarch64
2023/07/20 10:08 Goetz Lindenmaier SAP Rajan Halade Oracle JDK-8312451 Remove SECOM certificate that is expiring in September 2023
2023/07/20 10:07 Goetz Lindenmaier SAP (same) (same) JDK-8312029 Add CriticalNative tests to ProblemList for 8312028
2023/07/20 10:05 Goetz Lindenmaier SAP Aleksey Shipilev Amazon JDK-8312450 Improve java/util/UUID/UUIDTest.java
2023/07/20 10:03 Goetz Lindenmaier SAP Tobias Holenstein Oracle JDK-8312449 Major performance regression in Math.log on aarch64
2023/07/20 09:55 Goetz Lindenmaier SAP Guoxiong Li Independent JDK-8312448 Adjust delay time and gc log argument in TestAbortOnVMOperationTimeout
2023/07/20 09:52 Goetz Lindenmaier SAP Sibabrata Sahoo Oracle JDK-8312447 java/security/MessageDigest/ThreadSafetyTest.java test times out
2023/07/19 10:15 Goetz Lindenmaier SAP Ioi Lam Oracle JDK-8312381 ProblemList runtime/CompressedOops/CompressedClassPointers.java
2023/07/19 06:41 Goetz Lindenmaier SAP Daniel Daugherty Oracle JDK-8312363 store a JavaThread* in the java.lang.Thread object after the JavaThread* is added to the main ThreadsList
2023/07/19 06:40 Goetz Lindenmaier SAP Daniel Daugherty Oracle JDK-8312362 remove broken EnableThreadSMRExtraValidityChecks option
2023/07/18 20:41 Ben Taylor Amazon Peng Xie Tencent JDK-8312285 Build failure with GCC12 & GCC13
2023/07/18 09:09 Goetz Lindenmaier SAP Philip Race Oracle JDK-8312226 sun/java2d/pipe/InterpolationQualityTest.java fails with D3D basic render driver
2023/07/18 09:07 Goetz Lindenmaier SAP Alexey Ivanov Oracle JDK-8312225 Wrong visible amount in Adjustable of ScrollPane
2023/07/18 09:07 Goetz Lindenmaier SAP Alexey Ivanov Oracle JDK-8312224 ScrollPane insets are incorrect
2023/07/18 09:07 Goetz Lindenmaier SAP Alexey Ivanov Oracle JDK-8312223 java.awt.ScrollPane broken after multiple scroll up/down
2023/07/18 07:41 Vladimir Kempik Syntacore ilya.gavrilin Syntacore JDK-8312219 RISC-V: small improvements to shift immediate instructions
2023/07/15 16:05 Ben Taylor Amazon Kim Barrett Oracle JDK-8312130 [x86] Dangling pointer warning for Assembler::_attributes
2023/07/15 16:04 Ben Taylor Amazon Thomas Stuefe Red Hat JDK-8312129 Fix GCC 12 warnings for adlc output_c.cpp
2023/07/14 14:59 Sergey Nazarkin Azul Thomas Stuefe Red Hat JDK-8312103 Temporary fix for arm32 SafeFetch
2023/07/14 14:59 Sergey Nazarkin Azul N/A Unknown JDK-8312102 arm32 build crashes since JDK-8283326
2023/07/14 14:59 Sergey Nazarkin Azul Thomas Stuefe Red Hat JDK-8312101 [arm32] SafeFetch32 thumb interleaving causes random crashes
2023/07/14 10:49 Sergey Nazarkin Azul Thomas Stuefe Red Hat JDK-8312088 Implement SafeFetch statically
2023/07/14 08:42 Jenny Shivayogi Amazon Prasanta Sadhukhan Oracle JDK-8312079 Open source few AWT Insets related tests
2023/07/14 06:51 Goetz Lindenmaier SAP Eric Nothum Oracle JDK-8312070 C2: assert(final_con == (jlong)final_int) failed: final value should be integer
2023/07/14 06:48 Goetz Lindenmaier SAP (same) (same) JDK-8309119 [17u/11u] Redo JDK-8297951: C2: Create skeleton predicates for all If nodes in loop predication
2023/07/14 06:04 Goetz Lindenmaier SAP Christian Hagedorn Oracle JDK-8312068 Loop Predication should not hoist range checks with trap on success projection by negating their condition
2023/07/13 16:56 Chad Rakoczy Amazon yifan.tsai Independent JDK-8312042 Reduce memory reads in x86 MD5 intrinsic
2023/07/13 11:32 Goetz Lindenmaier SAP Jaikiran Pai Oracle JDK-8312024 Pin msys2/setup-msys2 github action to a specific commit
2023/07/13 06:40 Goetz Lindenmaier SAP Ashutosh Mehra Red Hat JDK-8312000 Error in parsing replay file when staticfield is an array of single dimension
2023/07/13 06:38 Goetz Lindenmaier SAP Justin King Google JDK-8311998 Update GHA XCode to 12.5.1
2023/07/13 05:46 Dhamoder Nalla Microsoft Dhamoder Nalla Microsoft JDK-8311994 Parsing a URI with an underscore goes through a silent exception, negatively impacting performance
2023/07/12 17:32 Xin Liu Amazon (same) (same) JDK-8311959 async logging for stdout and stderr
2023/07/12 09:13 Goetz Lindenmaier SAP Magnus Ihse Bursie Oracle JDK-8311930 JDK-8292716 breaks configure without jtreg
2023/07/12 09:13 Goetz Lindenmaier SAP Magnus Ihse Bursie Oracle JDK-8311929 Configure should check that jtreg is of the required version
2023/07/12 06:30 Goetz Lindenmaier SAP Damon Fenacci Oracle JDK-8311915 Investigate and improve instruction cache flushing during compilation
2023/07/12 06:28 Goetz Lindenmaier SAP Sibabrata Sahoo Oracle JDK-8311914 Convert sun/security/provider/KeyStore/DKSTest.sh to Java Jtreg Test
2023/07/12 06:26 Goetz Lindenmaier SAP Aleksandre Iline Oracle JDK-8311913 sanity/client/SwingSet/src/ToolTipDemoTest.java fails on Windows
2023/07/12 03:08 Fei Yang Independent (same) (same) JDK-8311908 Increase InlineSmallCode default from 1000 to 2500 for RISC-V
2023/07/11 11:23 Feilong Jiang Huawei Ludovic Henry Rivos JDK-8311871 GHA: Add RISC-V build config
2023/07/11 10:46 Andrew Lu SAP Ioi Lam Oracle JDK-8311869 Work around JDK-8305420 in CDSJDITest.java
2023/07/10 20:35 Jenny Shivayogi Amazon Alexander Zvegintsev Oracle JDK-8311841 Open source several clipboard AWT tests
2023/07/10 16:35 Jenny Shivayogi Amazon Prasanta Sadhukhan Oracle JDK-8311838 Open source AWT misc tests
2023/07/10 16:26 Andrew Lu SAP Ramkumar Sunderbabu Oracle JDK-8311835 Disable compiler/c2/Test6905845.java with -XX:TieredStopAtLevel=3
2023/07/10 15:22 yifan.tsai Independent Yi-Fan Tsai Amazon JDK-8311824 Improve MD5 intrinsic on AArch64
2023/07/10 14:53 Goetz Lindenmaier SAP Alexander Zuev Oracle JDK-8311819 Optimize and opensource some old AWT tests
2023/07/10 14:51 Goetz Lindenmaier SAP Jie Fu Tencent JDK-8311818 Several tests in compiler/c2/irTests miss @requires vm.compiler2.enabled
2023/07/10 14:38 Goetz Lindenmaier SAP Tejesh R Oracle JDK-8311816 Open source several AWT ScrollPane related tests
2023/07/10 06:53 Matthias Baesken SAP (same) (same) JDK-8311777 avoid potential leaks in KeystoreImpl.m related to JNU_CHECK_EXCEPTION early returns
2023/07/10 04:37 Alexey Bakhtin Azul Sean Mullan Oracle JDK-8311771 Increase the default TLS Diffie-Hellman group size from 1024-bit to 2048-bit
2023/07/10 02:07 Fei Yang Independent Pengfei Li ARM JDK-8311769 Fix a configure error in RISC-V cross build
2023/07/10 02:07 Fei Yang Independent N/A Unknown JDK-8311768 [riscv-port-jdk17u] Remove unused RoundDoubleModeV C2 node
2023/07/10 02:07 Fei Yang Independent Dingli Zhang Independent JDK-8311767 RISC-V: Sign extend when comparing 32-bit value with zero instead of testing the sign bit
2023/07/10 02:07 Fei Yang Independent Feilong Jiang Huawei JDK-8311766 RISC-V: Improve vectorization of Match.sqrt() on floats
2023/07/10 02:07 Fei Yang Independent Feilong Jiang Huawei JDK-8311765 RISC-V: stringL_indexof_char instruction has wrong format string
2023/07/10 02:07 Fei Yang Independent Feilong Jiang Huawei JDK-8311764 RISC-V: Improve performance of floating point to integer conversion
2023/07/10 02:07 Fei Yang Independent Feilong Jiang Huawei JDK-8311763 RISC-V: Remove remaining StoreLoad barrier with UseCondCardMark for Serial/Parallel GC
2023/07/10 02:07 Fei Yang Independent Xiaolin Zheng Independent JDK-8311762 RISC-V: Fix storeImmN0 matching rule by using zr register
2023/07/10 02:07 Fei Yang Independent Feilong Jiang Huawei JDK-8311761 RISC-V: Use bexti instruction to do single-bit testing
2023/07/10 02:07 Fei Yang Independent N/A Unknown JDK-8311760 RISC-V: Enable RVC extension by default on supported hardware
2023/07/10 02:07 Fei Yang Independent Xiaolin Zheng Independent JDK-8311759 RISC-V: Typo fix for RVC description
2023/07/10 02:07 Fei Yang Independent Dingli Zhang Independent JDK-8311758 RISC-V: Factor out immediate checking functions from assembler_riscv.inline.hpp
2023/07/10 02:07 Fei Yang Independent N/A Unknown JDK-8311757 Use correct register in riscv_enc_fast_unlock()
2023/07/10 02:07 Fei Yang Independent Feilong Jiang Huawei JDK-8311756 RISC-V: JDK-8276799 missed atomic intrinsic support for C1
2023/07/10 02:07 Fei Yang Independent Ludovic Henry Rivos JDK-8311755 RISC-V: Fix typo CSR_INSTERT to CSR_INSTRET
2023/07/10 02:07 Fei Yang Independent Gui Cao Independent JDK-8311754 RISC-V: Use bgez instruction in arraycopy_simple_check when possible
2023/07/10 02:07 Fei Yang Independent Dingli Zhang Independent JDK-8311753 RISC-V: Optimize class atomic when order is memory_order_relaxed
2023/07/10 02:07 Fei Yang Independent Feilong Jiang Huawei JDK-8311752 RISC-V: Several foreign jtreg tests fail with debug build after JDK-8301818
2023/07/10 02:07 Fei Yang Independent Gui Cao Independent JDK-8311751 RISC-V: Factor out function mvw from MacroAssembler
2023/07/10 02:07 Fei Yang Independent Gui Cao Independent JDK-8311750 RISC-V: c2 fix pipeline class for several instructions
2023/07/10 02:07 Fei Yang Independent Feilong Jiang Huawei JDK-8311749 RISC-V: C2: assert(false) failed: bad AD file due to missing match rule
2023/07/10 02:07 Fei Yang Independent Feilong Jiang Huawei JDK-8311748 RISC-V: pipeline class for several instructions is not set correctly
2023/07/10 02:07 Fei Yang Independent (same) (same) JDK-8311747 RISC-V: Factor out functions baseOffset & baseOffset32 from MacroAssembler
2023/07/10 02:07 Fei Yang Independent (same) (same) JDK-8311746 RISC-V: Handle special cases for MinI/MaxI nodes for Zbb
2023/07/10 02:07 Fei Yang Independent (same) (same) JDK-8311745 RISC-V: Improve code generation for MinI/MaxI nodes
2023/07/10 02:07 Fei Yang Independent (same) (same) JDK-8311744 RISC-V: Improve PrintOptoAssembly output of CMoveI/L nodes
2023/07/10 02:07 Fei Yang Independent Xiaolin Zheng Independent JDK-8311743 RISC-V: Fix MachNode size mismatch for MacroAssembler::_verify_oops*
2023/07/10 02:07 Fei Yang Independent (same) (same) JDK-8311742 RISC-V: C2: Use single-bit instructions from the Zbs extension
2023/07/10 02:07 Fei Yang Independent Feilong Jiang Huawei JDK-8311741 RISC-V: better error message when reporting unsupported satp modes
2023/07/10 02:07 Fei Yang Independent Feilong Jiang Huawei JDK-8311740 RISC-V: Add support for SATP mode detection
2023/07/10 02:07 Fei Yang Independent Vladimir Kempik Syntacore JDK-8311739 RISC-V: improve performance of floating Max Min intrinsics
2023/07/10 02:07 Fei Yang Independent (same) (same) JDK-8311738 RISC-V: Move some small macro-assembler functions to header file
2023/07/10 02:07 Fei Yang Independent Xiaolin Zheng Independent JDK-8311737 RISC-V: C2: assert(false) failed: bad AD file
2023/07/10 02:07 Fei Yang Independent Vladimir Kempik Syntacore JDK-8311736 RISC-V: improve performance of copy_memory stub
2023/07/10 02:07 Fei Yang Independent Xiaolin Zheng Independent JDK-8311735 RISC-V: Fix temp usages of heapbase register killed by MacroAssembler::en/decode_klass_not_null
2023/07/10 02:07 Fei Yang Independent Dingli Zhang Independent JDK-8311734 RISC-V: Make the operands order of vrsub_vx/vrsub_vi consistent with RVV 1.0 spec
2023/07/10 02:07 Fei Yang Independent Feilong Jiang Huawei JDK-8311733 RISC-V: Small refactoring for increment/decrement
2023/07/10 02:07 Fei Yang Independent Dingli Zhang Independent JDK-8311732 RISC-V: Rename some assembler intrinsic functions for RVV 1.0
2023/07/10 02:07 Fei Yang Independent Xiaolin Zheng Independent JDK-8311731 RISC-V: C1: Fix LIRGenerator::do_LibmIntrinsic
2023/07/10 02:07 Fei Yang Independent Xiaolin Zheng Independent JDK-8311730 RISC-V: Cleanup useless CompressibleRegions
2023/07/10 02:07 Fei Yang Independent (same) (same) JDK-8311729 RISC-V: Clean up and refactoring for assembler functions
2023/07/10 02:07 Fei Yang Independent Xiaolin Zheng Independent JDK-8311728 RISC-V: Mark out relocations as incompressible
2023/07/10 02:07 Fei Yang Independent (same) (same) JDK-8311727 RISC-V: Misc crash dump improvements
2023/07/10 02:07 Fei Yang Independent Xiaolin Zheng Independent JDK-8311726 RISC-V: Use li instead of patchable movptr at non-patchable callsites
2023/07/10 02:07 Fei Yang Independent (same) (same) JDK-8311725 RISC-V: Small refactoring for movptr_with_offset
2023/07/10 02:07 Fei Yang Independent Xiaolin Zheng Independent JDK-8311724 RISC-V: Partially mark out incompressible regions
2023/07/10 02:07 Fei Yang Independent Xiaolin Zheng Independent JDK-8311723 RISC-V: Unify all relocations for the backend into AbstractAssembler::relocate()
2023/07/10 02:07 Fei Yang Independent Xiaolin Zheng Independent JDK-8311722 RISC-V: RVC: Fix a potential alignment issue and add more alignment assertions for the patchable calls/nops
2023/07/10 02:07 Fei Yang Independent Xiaolin Zheng Independent JDK-8311721 RISC-V: Cleanup InstructionMark usages in the backend
2023/07/10 02:07 Fei Yang Independent (same) (same) JDK-8311720 RISC-V: Minimal build failed with --disable-precompiled-headers
2023/07/10 02:07 Fei Yang Independent Vladimir Kempik Syntacore JDK-8311719 RISC-V: get/put_native_u8 missing the case when address&7 is 6
2023/07/10 02:07 Fei Yang Independent Feilong Jiang Huawei JDK-8311718 RISC-V: Clean up push and pop registers
2023/07/10 02:07 Fei Yang Independent (same) (same) JDK-8311717 RISC-V: Use macro-assembler functions as appropriate
2023/07/10 02:07 Fei Yang Independent (same) (same) JDK-8311716 RISC-V: Unify the way of moving function pointer
2023/07/10 02:07 Fei Yang Independent Xiaolin Zheng Independent JDK-8311715 RISC-V: Need to save and restore callee-saved FloatRegisters in StubGenerator::generate_call_stub
2023/07/10 02:07 Fei Yang Independent (same) (same) JDK-8311714 RISC-V: Remove redundant non-null assertions about macro-assembler
2023/07/10 02:07 Fei Yang Independent Aleksey Shipilev Amazon JDK-8311713 RISC-V: Simplify weak CAS return value handling
2023/07/10 02:07 Fei Yang Independent Yadong Wang Huawei JDK-8311712 riscv: fail to build after JDK-8290840
2023/07/10 02:07 Fei Yang Independent Yadong Wang Huawei JDK-8311711 riscv: remove fence.i used in user space
2023/07/10 02:07 Fei Yang Independent (same) (same) JDK-8311710 riscv: Fix build warnings-as-errors with GCC 11
2023/07/10 02:07 Fei Yang Independent Feilong Jiang Huawei JDK-8311709 compiler/runtime/TestConstantsInError.java fails on riscv
2023/07/10 02:07 Fei Yang Independent (same) (same) JDK-8311708 riscv: small refactoring for add_memory_int32/64
2023/07/10 02:07 Fei Yang Independent Feilong Jiang Huawei JDK-8311707 riscv: jdk/incubator/vector/*VectorTests failing
2023/07/10 02:07 Fei Yang Independent Feilong Jiang Huawei JDK-8311706 riscv: Fix comment typo in li64
2023/07/10 02:07 Fei Yang Independent Xiaolin Zheng Independent JDK-8311705 Remove unnecessary register push for MacroAssembler::check_klass_subtype_slow_path
2023/07/10 02:07 Fei Yang Independent Xiaolin Zheng Independent JDK-8311704 riscv: RVC: Support disassembler show-bytes option
2023/07/10 02:07 Fei Yang Independent Yadong Wang Huawei JDK-8311703 riscv: Provide information when hitting a HaltNode
2023/07/10 02:07 Fei Yang Independent Xiaolin Zheng Independent JDK-8311702 riscv: Fix MachNode size mismatch for MacroAssembler::verify_oops*
2023/07/10 02:07 Fei Yang Independent (same) (same) JDK-8311701 riscv: Remove PRAGMA_NONNULL_IGNORED
2023/07/10 02:07 Fei Yang Independent Magnus Ihse Bursie Oracle JDK-8311700 RISC-V: Compilation error when shenandoah is disabled
2023/07/10 02:07 Fei Yang Independent Xiaolin Zheng Independent JDK-8311699 riscv: Fix correctness issue of MacroAssembler::movptr
2023/07/10 02:07 Fei Yang Independent Feilong Jiang Huawei JDK-8311698 riscv: Incorrect register mask in call_native_base
2023/07/10 02:07 Fei Yang Independent Yanhong Zhu Huawei JDK-8311697 riscv: should not allocate special register for temp
2023/07/10 02:07 Fei Yang Independent (same) (same) JDK-8311696 riscv: should call Atomic::release_store in JavaThread::set_thread_state
2023/07/10 02:07 Fei Yang Independent Feilong Jiang Huawei JDK-8311695 riscv: Break down -XX:+UseRVB into seperate options for each bitmanip extension
2023/07/10 02:07 Fei Yang Independent Johannes Bechberger SAP JDK-8311694 [x86, aarch64] vmassert(_last_Java_pc == NULL, "already walkable"); fails with async profiler
2023/07/10 02:07 Fei Yang Independent Johannes Bechberger SAP JDK-8311693 os::is_first_C_frame(frame*) crashes on invalid link access
2023/07/10 02:07 Fei Yang Independent (same) (same) JDK-8311692 Implementation of JEP 422: Linux/RISC-V Port
2023/07/10 02:07 Fei Yang Independent (same) (same) JDK-8308089 [riscv-port-jdk17u] Intrinsify Unsafe.storeStoreFence
2023/07/08 08:09 Goetz Lindenmaier SAP Philip Race Oracle JDK-8311668 Some client related jtreg problem list entries are malformed
2023/07/07 13:48 Aleksey Shipilev Amazon (same) (same) JDK-8311655 LIR_OpLoadKlass::_info shadows the field of the same name from LIR_Op
2023/07/07 13:22 Aleksey Shipilev Amazon Roman Kennke Amazon JDK-8311652 PPC: Remove duplicate info != NULL check
2023/07/07 09:01 Aleksey Shipilev Amazon Roman Kennke Amazon JDK-8311637 C1 LIR instruction for load-klass
2023/07/07 08:36 Sergey Nazarkin Azul Johannes Bechberger SAP JDK-8311636 AsyncGetCallTrace can cause SIGBUS on M1
2023/07/07 05:35 Goetz Lindenmaier SAP Rajat Mahajan Oracle JDK-8311620 Application freezes when copying an animated gif image to the system clipboard
2023/07/07 05:33 Goetz Lindenmaier SAP Prasanta Sadhukhan Oracle JDK-8311618 Test javax/swing/JTableHeader/6889007/bug6889007.java failed: Wrong type of cursor
2023/07/07 05:28 Goetz Lindenmaier SAP Leonid Mesnik Oracle JDK-8311615 StackWalkTest.java fails after CODETOOLS-7903373
2023/07/06 10:43 Aleksey Shipilev Amazon Oli Gillespie Amazon JDK-8311572 Parallelize heap walk for ObjectCount(AfterGC) JFR event collection
2023/07/06 09:59 Aleksey Shipilev Amazon (same) (same) JDK-8311569 Remove unused MemAllocator::obj_memory_range
2023/07/06 09:58 Aleksey Shipilev Amazon Xin Liu Amazon JDK-8311568 AsyncLogWriter should not overide is_Named_thread()
2023/07/05 18:14 Chad Rakoczy Amazon Alisen Chung Oracle JDK-8311524 Move more DnD tests to open
2023/07/05 18:13 Chad Rakoczy Amazon Alisen Chung Oracle JDK-8311523 Open source some drag and drop tests 3
2023/07/05 18:12 Chad Rakoczy Amazon Tejesh R Oracle JDK-8311522 Open source several AWT Miscellaneous tests
2023/07/05 11:38 Goetz Lindenmaier SAP Renjith Kannath Pariyangad Oracle JDK-8311503 Update javax/swing/Popup/TaskbarPositionTest.java
2023/07/05 11:36 Goetz Lindenmaier SAP Alexander Zuev Oracle JDK-8311502 Opensource and clean up five more AWT Focus related tests
2023/07/05 11:21 Goetz Lindenmaier SAP Jayathirth D V Oracle JDK-8311494 Open source some AWT tests related to datatransfer and Toolkit
2023/07/05 09:11 Christoph Langer SAP (same) (same) JDK-8312350 [17u] Remove designator DEFAULT_PROMOTED_VERSION_PRE=ea for release 17.0.8
2023/07/05 09:05 Aleksey Shipilev Amazon Erik Österlund Oracle JDK-8311485 ParallelObjectIterator freed at the wrong time in VM_HeapDumper
2023/07/05 08:54 Aleksey Shipilev Amazon Roland Westrelin Red Hat JDK-8311484 Shenandoah: Some tests failed with "EA: missing allocation reference path"
2023/07/05 08:49 Aleksey Shipilev Amazon Thomas Schatzl Oracle JDK-8311483 TLAB initialization may cause div by zero
2023/07/05 08:47 Aleksey Shipilev Amazon Mandy Chung Oracle JDK-8311482 Lower the compile threshold and reduce the iterations of warmup loop in VarHandles tests
2023/07/05 08:47 Aleksey Shipilev Amazon Thomas Schatzl Oracle JDK-8311481 Remove -XX:+CheckMemoryInitialization
2023/07/05 07:36 Martin Doerr SAP Tejesh R Oracle JDK-8311478 Screen capture for test JFileChooserSetLocationTest.java, failure case
2023/07/04 09:47 Aleksey Shipilev Amazon Roman Kennke Amazon JDK-8311282 Correct type/array element offset in LibraryCallKit::get_state_from_digest_object()
2023/07/04 09:45 Aleksey Shipilev Amazon Roman Kennke Amazon JDK-8311281 Use acquire semantics in ObjectSynchronizer::read_stable_mark()
2023/07/04 09:44 Aleksey Shipilev Amazon Roman Kennke Amazon JDK-8311280 Avoid loading Klass* twice in TypeArrayKlass::oop_size()
2023/07/04 08:15 Martin Doerr SAP Viktor Klang Oracle JDK-8311277 java/util/concurrent/ConcurrentHashMap/ConcurrentAssociateTest.java fails with internal timeout when executed with TieredCompilation1/3
2023/07/04 08:15 Martin Doerr SAP Alexey Ivanov Oracle JDK-8311276 Provide a reason for PassFailJFrame.forceFail
2023/07/04 08:13 Martin Doerr SAP Philip Race Oracle JDK-8311275 DrawStringWithInfiniteXform.java failed with "RuntimeException: drawString with InfiniteXform transform takes long time"
2023/07/04 07:36 Christoph Langer SAP (same) (same) JDK-8311267 GHA builds/tests won't run manually if disabled from automatic running
2023/07/04 07:25 Matthias Baesken SAP (same) (same) JDK-8311265 enhance logging and some exception in krb5/Config.java
2023/07/03 18:34 Goetz Lindenmaier SAP Alexander Zuev Oracle JDK-8311251 Clean up and open source some AWT tests
2023/07/03 18:34 Goetz Lindenmaier SAP Alexander Zuev Oracle JDK-8311250 Clean up and open source four Dialog related tests
2023/07/03 07:02 Matthias Baesken SAP (same) (same) JDK-8311229 avoid NULL after 8301661
2023/06/30 10:34 Martin Doerr SAP Harshitha Onkar Oracle JDK-8311167 Add new positioning options to PassFailJFrame test framework
2023/06/30 07:57 Goetz Lindenmaier SAP Philip Race Oracle JDK-8311157 Open source a few more AWT Choice tests
2023/06/30 07:54 Goetz Lindenmaier SAP Philip Race Oracle JDK-8311156 Open source several AWT Choice jtreg tests
2023/06/30 07:45 Goetz Lindenmaier SAP Jayathirth D V Oracle JDK-8311152 Open source some AWT tests related to TextComponent and Toolkit
2023/06/30 07:43 Goetz Lindenmaier SAP Philip Race Oracle JDK-8311150 Open source AWT CardLayout and Checkbox tests
2023/06/30 07:41 Goetz Lindenmaier SAP Philip Race Oracle JDK-8311149 Open source some AWT tests relating to Button and a few other classes
2023/06/30 07:39 Goetz Lindenmaier SAP Harshitha Onkar Oracle JDK-8311148 Add manual tests to open
2023/06/30 06:03 Goetz Lindenmaier SAP Johan Sjölen Oracle JDK-8311140 Replace NULL with nullptr in share/opto/
2023/06/29 21:02 Martin Doerr SAP David Holmes Oracle JDK-8311121 Factor out the common code for initializing and starting internal VM JavaThreads
2023/06/29 21:00 Martin Doerr SAP Coleen Phillimore Oracle JDK-8311120 Update Siphash
2023/06/29 18:11 Sergey Bylokhov Amazon (same) (same) JDK-8311107 Unnecessary color conversion during 4BYTE_ABGR_PRE to INT_ARGB_PRE blit
2023/06/29 14:58 Aleksey Shipilev Amazon Markus Grönlund Oracle JDK-8311095 native_thread not protected by TLH
2023/06/29 14:49 Aleksey Shipilev Amazon (same) (same) JDK-8311093 Optimize ResourceArea zapping on ResourceMark release
2023/06/28 23:42 Sergey Bylokhov Amazon (same) (same) JDK-8311072 Skip the "half float" support in LittleCMS during the build
2023/06/28 19:22 Sergey Bylokhov Amazon (same) (same) JDK-8311063 PropertyDescriptor should work with overridden generic getter method
2023/06/28 11:54 Aleksey Shipilev Amazon Tobias Hartmann Oracle JDK-8311037 C1: Missing receiver null check in Reference::get intrinsic
2023/06/28 11:50 Aleksey Shipilev Amazon David Holmes Oracle JDK-8311036 Thread.isAlive0 doesn't need to call into the VM
2023/06/28 08:41 Martin Doerr SAP Harshitha Onkar Oracle JDK-8311028 Refactoring changes to PassFailJFrame Test Framework
2023/06/28 08:41 Martin Doerr SAP Sean Coffey Oracle JDK-8311027 Have -XshowSettings option display tzdata version
2023/06/26 12:57 Martin Doerr SAP Philip Race Oracle JDK-8310895 Add ftcolor.c to imported freetype sources
2023/06/24 06:44 William Kemper Amazon Roland Westrelin Red Hat JDK-8310842 Shenandoah: A couple of virtual thread tests failed with iu mode even without Loom enabled.
2023/06/23 17:54 William Kemper Amazon Roman Kennke Amazon JDK-8310817 Shenandoah: Don't produce new memory state in C2 LRB runtime call
2023/06/23 13:10 Martin Doerr SAP David Holmes Oracle JDK-8310741 Linux os::create_thread() overcounts guardpage size with newer glibc (>=2.27)
2023/06/23 13:09 Martin Doerr SAP Poonam Bajaj Parhar Oracle JDK-8310740 Make thread stacks not use huge pages
2023/06/23 13:09 Martin Doerr SAP Gerard Ziemski Oracle JDK-8310739 RunThese30M.java crashed with assert(early->flag() == current->flag() || early->flag() == mtNone)
2023/06/23 13:08 Martin Doerr SAP Kim Barrett Oracle JDK-8310738 Incorrect value of 'used' jvmstat counter
2023/06/23 13:08 Martin Doerr SAP ivan.bereziuk Oracle JDK-8310737 function isWsl() returns false on WSL2
2023/06/23 13:06 Martin Doerr SAP (same) (same) JDK-8310736 [Windows] hs_err files sometimes miss information about the code containing the error
2023/06/23 10:42 Martin Doerr SAP Dmitry Chuyko BellSoft JDK-8310723 AArch64: Handle special cases for MaxINode & MinINode
2023/06/23 08:23 Aleksey Shipilev Amazon Markus Grönlund Oracle JDK-8310714 Unsafe list operations in JfrStringPool
2023/06/23 07:08 Goetz Lindenmaier SAP Harshitha Onkar Oracle JDK-8310700 Update HarfBuzz to 7.2.0
2023/06/23 07:04 Goetz Lindenmaier SAP Matthias Baesken SAP JDK-8310699 gcc12 based Alpine build broken build after JDK-8307301
2023/06/23 06:52 Goetz Lindenmaier SAP Jie Fu Tencent JDK-8310697 Build with gcc8 is broken after JDK-8307301
2023/06/23 06:50 Goetz Lindenmaier SAP Christian Stein Oracle JDK-8310696 [TESTLIB] Enhance JAXPPolicyManager to setup required permissions for jtreg version 7 jar
2023/06/22 10:42 Martin Doerr SAP Leo Korinth Oracle JDK-8310637 Juggle04/TestDescription.java should be a booleanArr test and not a byteArr one
2023/06/22 10:42 Martin Doerr SAP Valerie Peng Oracle JDK-8310636 Update PCSC-Lite for Suse Linux to 1.9.9 and fix incomplete license wording
2023/06/22 10:41 Martin Doerr SAP Albert Yang Oracle JDK-8310635 vmTestbase/nsk/monitoring/stress/lowmem fails on calling isCollectionUsageThresholdExceeded()
2023/06/22 10:39 Martin Doerr SAP Severin Gehwolf Red Hat JDK-8310634 Refactor TestMemoryAwareness to use WhiteBox api for host values
2023/06/22 10:37 Martin Doerr SAP Douglas Simon Oracle JDK-8310633 show abstract machine code in hs-err for all VM crashes
2023/06/21 15:50 William Kemper Amazon Zhengyu Gu Independent JDK-8310564 gc/stringdedup/TestStringDeduplicationInterned.java fails with Shenandoah
2023/06/21 08:30 Martin Doerr SAP Erik Gahlin Oracle JDK-8310522 jdk/jfr/jvm/TestDumpOnCrash.java timed out
2023/06/21 08:30 Martin Doerr SAP Douglas Simon Oracle JDK-8310521 max code printed in hs-err logs should be configurable
2023/06/21 08:29 Martin Doerr SAP Alexander Zvegintsev Oracle JDK-8310520 jtreg time out of CtrlASCII.java seems to hang the Xserver.
2023/06/21 08:28 Martin Doerr SAP Coleen Phillimore Oracle JDK-8310519 jvmti/RedefineClasses/StressRedefine failed: assert(!is_null(v)) failed: narrow klass value can never be zero
2023/06/20 19:11 Aleksey Shipilev Amazon David Holmes Oracle JDK-8310465 ConstantPool::print_on can crash if _cache is NULL
2023/06/20 19:08 Aleksey Shipilev Amazon (same) (same) JDK-8310464 Shenandoah: Strengthen the mark word check in string dedup
2023/06/20 18:52 Aleksey Shipilev Amazon David Holmes Oracle JDK-8310463 Clarify EXPERIMENTAL flags comment in hotspot/share/runtime/globals.hpp
2023/06/20 18:50 Aleksey Shipilev Amazon Sun Guoyun Loongson JDK-8310462 Some LoadLoad barriers in the interpreter are unnecessary after JDK-8220051
2023/06/20 12:59 Martin Doerr SAP Emanuel Peter Oracle JDK-8310378 [REDO] ByteBufferTest.java: replace endless recursion with RuntimeException in void ck(double x, double y)
2023/06/20 12:58 Martin Doerr SAP Yi Yang Alibaba JDK-8310377 Dubious PrintCompilation output
2023/06/20 12:58 Martin Doerr SAP Aleksey Shipilev Amazon JDK-8310375 runtime/ErrorHandling/MachCodeFramesInErrorFile.java fails when hsdis is present
2023/06/20 12:58 Martin Doerr SAP Douglas Simon Oracle JDK-8310374 emit abstract machine code in hs-err logs
2023/06/20 12:57 Martin Doerr SAP Yasumasa Suenaga NTT DATA JDK-8310373 jfr command hangs when it processes invalid file
2023/06/20 12:57 Martin Doerr SAP Alisen Chung Oracle JDK-8310372 Exception printed to stdout on Windows when storing transparent image in clipboard
2023/06/20 08:03 Aleksey Shipilev Amazon Axel Boldt-Christmas Oracle JDK-8310350 Select num workers for safepoint ParallelCleanupTask
2023/06/19 20:04 William Kemper Amazon Ashutosh Mehra Red Hat JDK-8310339 Shenandoah: ThreadMXBean synchronizer tests crash with aggressive heuristics
2023/06/19 19:06 Frederic Thevenet Red Hat Erik Gahlin Oracle JDK-8310338 JFR: Display N/A for missing data amount
2023/06/19 13:49 Aleksey Shipilev Amazon Jie Fu Tencent JDK-8310319 serviceability/sa/TestObjectAlignment.java fails on x86_32
2023/06/19 13:43 Aleksey Shipilev Amazon (same) (same) JDK-8310318 SA: Allow larger object alignments
2023/06/19 13:14 Aleksey Shipilev Amazon (same) (same) JDK-8310313 Mark word accesses should not use Access API
2023/06/19 13:12 Frederic Thevenet Red Hat (same) (same) JDK-8310312 jdk.jfr.internal.Utils::formatDataAmount method should gracefully handle amounts equal to Long.MIN_VALUE
2023/06/19 11:57 Aleksey Shipilev Amazon Harold Seigel Oracle JDK-8310309 Buffer overrun in reverse_words of sharedRuntime_x86_64.cpp:3517
2023/06/19 07:13 Goetz Lindenmaier SAP Harshitha Onkar Oracle JDK-8310291 Update Libpng to 1.6.39
2023/06/19 07:11 Goetz Lindenmaier SAP Christian Stein Oracle JDK-8310290 Tests should not rely on specific JAR file names (hotspot)
2023/06/19 07:10 Goetz Lindenmaier SAP Alexey Semenyuk Oracle JDK-8310289 Tests should not rely on specific JAR file names (jpackage)
2023/06/19 07:04 Goetz Lindenmaier SAP Jonathan Gibbons Oracle JDK-8310287 clean up use of bad arguments for `@clean` in langtools tests
2023/06/19 07:03 Goetz Lindenmaier SAP Tejesh R Oracle JDK-8310286 Create regression test for verifying setMargin() of JRadioButton
2023/06/19 06:59 Goetz Lindenmaier SAP Thomas Schatzl Oracle JDK-8310283 G1: Full gc mark stack draining should prefer to make work available to other threads
2023/06/19 06:58 Goetz Lindenmaier SAP Aleksey Shipilev Amazon JDK-8310282 Two javac tests have bad jtreg `@clean` tags
2023/06/19 06:55 Goetz Lindenmaier SAP Valerie Peng Oracle JDK-8310281 sun/security/pkcs11/KeyStore/SecretKeysBasic.sh failed with "PKCS11Exception: CKR_ATTRIBUTE_SENSITIVE"
2023/06/19 06:55 Goetz Lindenmaier SAP Daniel Daugherty Oracle JDK-8310280 disable os.release_multi_mappings_vm on macOS-X64
2023/06/19 06:55 Goetz Lindenmaier SAP N/A Unknown JDK-8310279 macos attempt_reserve_memory_at(arg1, arg2, true) failure
2023/06/19 06:52 Goetz Lindenmaier SAP Philip Race Oracle JDK-8310278 Define jtreg jdk_desktop test group time-based sub-tasks for use by headful testing.
2023/06/16 13:00 Scott Gibbons Intel (same) (same) JDK-8310210 Accelerate AVX-512 CRC32C for small buffers
2023/06/16 12:03 Goetz Lindenmaier SAP Tobias Holenstein Oracle JDK-8310208 Compile command in compiler.loopopts.TestRemoveEmptyCountedLoop does not work
2023/06/16 12:03 Goetz Lindenmaier SAP Tobias Holenstein Oracle JDK-8310207 C2 compiled code crashes with SIGFPE with -XX:+StressLCM and -XX:+StressGCM
2023/06/16 11:49 Goetz Lindenmaier SAP Coleen Phillimore Oracle JDK-8310205 migrate tests to use jdk.test.whitebox.WhiteBox
2023/06/16 07:54 Matthias Baesken SAP (same) (same) JDK-8310189 Provide sctpHandleSocketErrorWithMessage
2023/06/15 09:55 Goetz Lindenmaier SAP Emanuel Peter Oracle JDK-8310122 Speed up compiler/codegen/Test7100757.java
2023/06/15 09:55 Goetz Lindenmaier SAP N/A Unknown JDK-8310121 ZGC: vmTestbase/gc/ArrayJuggle/ tests fails intermittently with exit code 97
2023/06/15 09:51 Goetz Lindenmaier SAP Emanuel Peter Oracle JDK-8310120 Speed up compiler/intrinsics/unsafe/DirectByteBufferTest.java and HeapByteBufferTest.java
2023/06/15 09:49 Goetz Lindenmaier SAP Srinivas Mandalika Oracle JDK-8310119 Create a regression test for JDK-8139581
2023/06/15 07:52 Matthias Baesken SAP Jiangli Zhou Google JDK-8310114 Resolve multiple definition of 'handleSocketError' when statically linking with JDK native libraries
2023/06/14 16:17 Zdenek Zambersky Red Hat (same) (same) JDK-8310044 Fix container tests for jdks with symlinked conf dir
2023/06/14 14:33 kirill Independent (same) (same) JDK-8310035 Footprint regression from JDK-8224957
2023/06/14 07:58 Matthias Baesken SAP (same) (same) JDK-8310000 enhance exceptions in MappedMemoryUtils.c
2023/06/14 07:53 Matthias Baesken SAP (same) (same) JDK-8309997 Adjust ShenandoahHeap print_heap_regions_on
2023/06/13 17:19 Aleksey Shipilev Amazon Roman Kennke Amazon JDK-8309952 Add missing STS to Shenandoah
2023/06/13 13:43 Christoph Langer SAP (same) (same) JDK-8309985 KeyStore of type KeychainStore, provider Apple does not show all trusted certificates
2023/06/13 13:12 Matthias Baesken SAP (same) (same) JDK-8309932 VerifyCACerts.java misses blank in error output
2023/06/13 10:10 Ningsheng Jian ARM (same) (same) JDK-8309912 AArch64: Vector registers are clobbered by some macroassemblers
2023/06/13 08:27 Oli Gillespie Amazon Sergey Tsypanov Independent JDK-8309905 Optimize DateTimeFormatterBuilder.ZoneTextPrinterParser.getTree()
2023/06/13 07:21 Matthias Baesken SAP Philip Race Oracle JDK-8309901 javax/sound/sampled/Clip/SetPositionHang.java failed with ArrayIndexOutOfBoundsException: Array index out of range: -4
2023/06/07 07:45 Matthias Baesken SAP Volker Simonis Amazon JDK-8309589 (zipfs) ZipFSOutputStreamTest.testOutputStream should only check inflated bytes
2023/06/02 10:41 Aleksey Shipilev Amazon Justin King Google JDK-8309348 Memory leaks in OopMapCache
2023/05/31 14:11 Aleksey Shipilev Amazon (same) (same) JDK-8309213 Shenandoah: Handle more GCCauses in ShenandoahControlThread::request_gc
2023/05/31 14:09 Aleksey Shipilev Amazon Y. Ramakrishna Amazon JDK-8309212 Shenandoah: HdrSeq asserts "sub-bucket index (512) overflow for value ( 1.00)"
2023/05/30 18:49 Aleksey Shipilev Amazon Sergey Tsypanov Independent JDK-8309131 Improve performance of DataInputStream
2023/05/30 16:27 Goetz Lindenmaier SAP (same) (same) JDK-8309124 Bump update version for OpenJDK: jdk-17.0.9
2023/05/30 16:27 Goetz Lindenmaier SAP (same) (same) JDK-8309107 Bump update version for OpenJDK: jdk-17.0.9
2022/04/28 02:48 Yuri Nesterenko Azul Xuelei Fan Tencent JDK-8318353 Buffer clean in PasswordCallback

No changesets log

Committer push log

Alexey Bakhtin, Azul

Bug Summary
JDK-8311771 Increase the default TLS Diffie-Hellman group size from 1024-bit to 2048-bit

Andrew Leonard, Red Hat

Bug Summary
JDK-8314098 Sort classlist in JDK image

Alexandr Scherbatiy, BellSoft

Bug Summary
JDK-8315115 [macos] PrinterJob does not take into account Sides attribute
JDK-8315077 macOS: Print content cut off when width > height with portrait orientation

Andrew Hughes, Red Hat

Bug Summary
JDK-8315159 GHA: Use GCC Major Version Dependencies Only

Andrew Lu, SAP

Bug Summary
JDK-8313146 [TESTBUG] Error: Not a test or directory containing tests: java/awt/print/PrinterJob/InitToBlack.java
JDK-8311835 Disable compiler/c2/Test6905845.java with -XX:TieredStopAtLevel=3
JDK-8313145 java/awt/dnd/NoFormatsDropTest/NoFormatsDropTest.java timed out
JDK-8311869 Work around JDK-8305420 in CDSJDITest.java

Andrey Turbanov, Independent

Bug Summary
JDK-8314962 Add resolved IP address in connection exception for sockets

Ben Taylor, Amazon

Bug Summary
JDK-8312130 [x86] Dangling pointer warning for Assembler::_attributes
JDK-8314459 AsyncGetCallTrace crash on unreadable interpreter method pointer
JDK-8312285 Build failure with GCC12 & GCC13
JDK-8315222 Bump update version for OpenJDK: jdk-17.0.8.1
JDK-8312517 C2: crash in SubTypeCheckNode::sub() at IGVN split if
JDK-8312129 Fix GCC 12 warnings for adlc output_c.cpp
JDK-8314587 Invalid CEN header (invalid zip64 extra data field size)

Chad Rakoczy, Amazon

Bug Summary
JDK-8311524 Move more DnD tests to open
JDK-8311522 Open source several AWT Miscellaneous tests
JDK-8311523 Open source some drag and drop tests 3
JDK-8312042 Reduce memory reads in x86 MD5 intrinsic

Christoph Langer, SAP

Bug Summary
JDK-8312350 [17u] Remove designator DEFAULT_PROMOTED_VERSION_PRE=ea for release 17.0.8

Christoph Langer, SAP

Bug Summary
JDK-8317643 [17u] Remove designator DEFAULT_PROMOTED_VERSION_PRE=ea for release 17.0.9
JDK-8311267 GHA builds/tests won't run manually if disabled from automatic running
JDK-8309985 KeyStore of type KeychainStore, provider Apple does not show all trusted certificates
JDK-8314049 Update Public Suffix List to 88467c9

Dhamoder Nalla, Microsoft

Bug Summary
JDK-8311994 Parsing a URI with an underscore goes through a silent exception, negatively impacting performance

Dingli Zhang, Independent

Bug Summary
JDK-8314617 Implement fast-path for ASCII-compatible CharsetEncoders on RISC-V

Feilong Jiang, Huawei

Bug Summary
JDK-8311871 GHA: Add RISC-V build config
JDK-8312511 GHA: Bump cross-compile runner to Ubuntu 22.04
JDK-8314769 RISC-V: Incorrect VMReg encoding in RISCV64Frame.java

Frederic Thevenet, Red Hat

Bug Summary
JDK-8310312 jdk.jfr.internal.Utils::formatDataAmount method should gracefully handle amounts equal to Long.MIN_VALUE
JDK-8310338 JFR: Display N/A for missing data amount

Fei Yang, Independent

Bug Summary
JDK-8308089 [riscv-port-jdk17u] Intrinsify Unsafe.storeStoreFence
JDK-8311768 [riscv-port-jdk17u] Remove unused RoundDoubleModeV C2 node
JDK-8311694 [x86, aarch64] vmassert(_last_Java_pc == NULL, "already walkable"); fails with async profiler
JDK-8311709 compiler/runtime/TestConstantsInError.java fails on riscv
JDK-8311769 Fix a configure error in RISC-V cross build
JDK-8311692 Implementation of JEP 422: Linux/RISC-V Port
JDK-8311908 Increase InlineSmallCode default from 1000 to 2500 for RISC-V
JDK-8311693 os::is_first_C_frame(frame*) crashes on invalid link access
JDK-8314770 Re-enable locked_create_entry symbol check in runtime/NMT/CheckForProperDetailStackTrace.java for RISC-V
JDK-8311705 Remove unnecessary register push for MacroAssembler::check_klass_subtype_slow_path
JDK-8311740 RISC-V: Add support for SATP mode detection
JDK-8311741 RISC-V: better error message when reporting unsupported satp modes
JDK-8311731 RISC-V: C1: Fix LIRGenerator::do_LibmIntrinsic
JDK-8311750 RISC-V: c2 fix pipeline class for several instructions
JDK-8311737 RISC-V: C2: assert(false) failed: bad AD file
JDK-8311749 RISC-V: C2: assert(false) failed: bad AD file due to missing match rule
JDK-8311742 RISC-V: C2: Use single-bit instructions from the Zbs extension
JDK-8311729 RISC-V: Clean up and refactoring for assembler functions
JDK-8311718 RISC-V: Clean up push and pop registers
JDK-8311721 RISC-V: Cleanup InstructionMark usages in the backend
JDK-8311730 RISC-V: Cleanup useless CompressibleRegions
JDK-8311700 RISC-V: Compilation error when shenandoah is disabled
JDK-8311760 RISC-V: Enable RVC extension by default on supported hardware
JDK-8311751 RISC-V: Factor out function mvw from MacroAssembler
JDK-8311747 RISC-V: Factor out functions baseOffset & baseOffset32 from MacroAssembler
JDK-8311758 RISC-V: Factor out immediate checking functions from assembler_riscv.inline.hpp
JDK-8311743 RISC-V: Fix MachNode size mismatch for MacroAssembler::_verify_oops*
JDK-8311762 RISC-V: Fix storeImmN0 matching rule by using zr register
JDK-8311735 RISC-V: Fix temp usages of heapbase register killed by MacroAssembler::en/decode_klass_not_null
JDK-8311755 RISC-V: Fix typo CSR_INSTERT to CSR_INSTRET
JDK-8311719 RISC-V: get/put_native_u8 missing the case when address&7 is 6
JDK-8311746 RISC-V: Handle special cases for MinI/MaxI nodes for Zbb
JDK-8311745 RISC-V: Improve code generation for MinI/MaxI nodes
JDK-8311736 RISC-V: improve performance of copy_memory stub
JDK-8311739 RISC-V: improve performance of floating Max Min intrinsics
JDK-8311764 RISC-V: Improve performance of floating point to integer conversion
JDK-8311744 RISC-V: Improve PrintOptoAssembly output of CMoveI/L nodes
JDK-8311766 RISC-V: Improve vectorization of Match.sqrt() on floats
JDK-8311756 RISC-V: JDK-8276799 missed atomic intrinsic support for C1
JDK-8311734 RISC-V: Make the operands order of vrsub_vx/vrsub_vi consistent with RVV 1.0 spec
JDK-8311728 RISC-V: Mark out relocations as incompressible
JDK-8311720 RISC-V: Minimal build failed with --disable-precompiled-headers
JDK-8311727 RISC-V: Misc crash dump improvements
JDK-8311738 RISC-V: Move some small macro-assembler functions to header file
JDK-8311715 RISC-V: Need to save and restore callee-saved FloatRegisters in StubGenerator::generate_call_stub
JDK-8311753 RISC-V: Optimize class atomic when order is memory_order_relaxed
JDK-8311724 RISC-V: Partially mark out incompressible regions
JDK-8311748 RISC-V: pipeline class for several instructions is not set correctly
JDK-8311714 RISC-V: Remove redundant non-null assertions about macro-assembler
JDK-8311763 RISC-V: Remove remaining StoreLoad barrier with UseCondCardMark for Serial/Parallel GC
JDK-8311732 RISC-V: Rename some assembler intrinsic functions for RVV 1.0
JDK-8311722 RISC-V: RVC: Fix a potential alignment issue and add more alignment assertions for the patchable calls/nops
JDK-8311752 RISC-V: Several foreign jtreg tests fail with debug build after JDK-8301818
JDK-8311767 RISC-V: Sign extend when comparing 32-bit value with zero instead of testing the sign bit
JDK-8311713 RISC-V: Simplify weak CAS return value handling
JDK-8311733 RISC-V: Small refactoring for increment/decrement
JDK-8311725 RISC-V: Small refactoring for movptr_with_offset
JDK-8311765 RISC-V: stringL_indexof_char instruction has wrong format string
JDK-8311759 RISC-V: Typo fix for RVC description
JDK-8311723 RISC-V: Unify all relocations for the backend into AbstractAssembler::relocate()
JDK-8311716 RISC-V: Unify the way of moving function pointer
JDK-8311761 RISC-V: Use bexti instruction to do single-bit testing
JDK-8311754 RISC-V: Use bgez instruction in arraycopy_simple_check when possible
JDK-8311726 RISC-V: Use li instead of patchable movptr at non-patchable callsites
JDK-8311717 RISC-V: Use macro-assembler functions as appropriate
JDK-8311695 riscv: Break down -XX:+UseRVB into seperate options for each bitmanip extension
JDK-8311712 riscv: fail to build after JDK-8290840
JDK-8311710 riscv: Fix build warnings-as-errors with GCC 11
JDK-8311706 riscv: Fix comment typo in li64
JDK-8311699 riscv: Fix correctness issue of MacroAssembler::movptr
JDK-8311702 riscv: Fix MachNode size mismatch for MacroAssembler::verify_oops*
JDK-8311698 riscv: Incorrect register mask in call_native_base
JDK-8311707 riscv: jdk/incubator/vector/*VectorTests failing
JDK-8311703 riscv: Provide information when hitting a HaltNode
JDK-8311711 riscv: remove fence.i used in user space
JDK-8311701 riscv: Remove PRAGMA_NONNULL_IGNORED
JDK-8311704 riscv: RVC: Support disassembler show-bytes option
JDK-8311696 riscv: should call Atomic::release_store in JavaThread::set_thread_state
JDK-8311697 riscv: should not allocate special register for temp
JDK-8311708 riscv: small refactoring for add_memory_int32/64
JDK-8311757 Use correct register in riscv_enc_fast_unlock()

Gui Cao, Independent

Bug Summary
JDK-8313577 TestIRMatching.java fails on RISC-V

George Adams, Microsoft

Bug Summary
JDK-8312496 Bundle zlib by default with JDK on macos aarch64

Goetz Lindenmaier, SAP

Bug Summary
JDK-8309119 [17u/11u] Redo JDK-8297951: C2: Create skeleton predicates for all If nodes in loop predication
JDK-8317700 [17u] Undo backport 8317674 of 8316566 which was pushed to wrong repo.
JDK-8313188 [JFR] Better handling of tampered JFR repository
JDK-8313151 [TESTBUG] sun/security/provider/SecureRandom/AbstractDrbg/SpecTest.java intermittently timeout
JDK-8310696 [TESTLIB] Enhance JAXPPolicyManager to setup required permissions for jtreg version 7 jar
JDK-8312029 Add CriticalNative tests to ProblemList for 8312028
JDK-8313154 Add exception handler method to the BaseLdapServer
JDK-8311148 Add manual tests to open
JDK-8312448 Adjust delay time and gc log argument in TestAbortOnVMOperationTimeout
JDK-8311620 Application freezes when copying an animated gif image to the system clipboard
JDK-8310697 Build with gcc8 is broken after JDK-8307301
JDK-8309124 Bump update version for OpenJDK: jdk-17.0.9
JDK-8310207 C2 compiled code crashes with SIGFPE with -XX:+StressLCM and -XX:+StressGCM
JDK-8312070 C2: assert(final_con == (jlong)final_int) failed: final value should be integer
JDK-8311250 Clean up and open source four Dialog related tests
JDK-8311251 Clean up and open source some AWT tests
JDK-8310287 clean up use of bad arguments for `@clean` in langtools tests
JDK-8312537 com/sun/security/auth/module/AllPlatforms.java fails to compile
JDK-8310208 Compile command in compiler.loopopts.TestRemoveEmptyCountedLoop does not work
JDK-8311929 Configure should check that jtreg is of the required version
JDK-8311914 Convert sun/security/provider/KeyStore/DKSTest.sh to Java Jtreg Test
JDK-8312536 Cover logout method for several LoginModule
JDK-8310119 Create a regression test for JDK-8139581
JDK-8310286 Create regression test for verifying setMargin() of JRadioButton
JDK-8313152 CurrencySymbols.properties is missing the copyright notice
JDK-8310278 Define jtreg jdk_desktop test group time-based sub-tasks for use by headful testing.
JDK-8310280 disable os.release_multi_mappings_vm on macOS-X64
JDK-8312000 Error in parsing replay file when staticfield is an array of single dimension
JDK-8310283 G1: Full gc mark stack draining should prefer to make work available to other threads
JDK-8310699 gcc12 based Alpine build broken build after JDK-8307301
JDK-8316353 Ideographic characters aren't stretched by AffineTransform.scale(2, 1)
JDK-8312450 Improve java/util/UUID/UUIDTest.java
JDK-8313149 Improve test coverage for XPath Axes: namespace
JDK-8311915 Investigate and improve instruction cache flushing during compilation
JDK-8312223 java.awt.ScrollPane broken after multiple scroll up/down
JDK-8312447 java/security/MessageDigest/ThreadSafetyTest.java test times out
JDK-8311930 JDK-8292716 breaks configure without jtreg
JDK-8312068 Loop Predication should not hoist range checks with trap on success projection by negating their condition
JDK-8310279 macos attempt_reserve_memory_at(arg1, arg2, true) failure
JDK-8312449 Major performance regression in Math.log on aarch64
JDK-8310205 migrate tests to use jdk.test.whitebox.WhiteBox
JDK-8311157 Open source a few more AWT Choice tests
JDK-8311150 Open source AWT CardLayout and Checkbox tests
JDK-8311156 Open source several AWT Choice jtreg tests
JDK-8311816 Open source several AWT ScrollPane related tests
JDK-8311494 Open source some AWT tests related to datatransfer and Toolkit
JDK-8311152 Open source some AWT tests related to TextComponent and Toolkit
JDK-8311149 Open source some AWT tests relating to Button and a few other classes
JDK-8311502 Opensource and clean up five more AWT Focus related tests
JDK-8311819 Optimize and opensource some old AWT tests
JDK-8312540 Performance regression in LockSupport.unpark with lots of idle threads
JDK-8312024 Pin msys2/setup-msys2 github action to a specific commit
JDK-8312381 ProblemList runtime/CompressedOops/CompressedClassPointers.java
JDK-8312539 Remove BadKeyUsageTest.java from Problem List
JDK-8312362 remove broken EnableThreadSMRExtraValidityChecks option
JDK-8312451 Remove SECOM certificate that is expiring in September 2023
JDK-8312538 remove test/lib/sun/hotspot
JDK-8311140 Replace NULL with nullptr in share/opto/
JDK-8311913 sanity/client/SwingSet/src/ToolTipDemoTest.java fails on Windows
JDK-8312224 ScrollPane insets are incorrect
JDK-8311818 Several tests in compiler/c2/irTests miss @requires vm.compiler2.enabled
JDK-8311668 Some client related jtreg problem list entries are malformed
JDK-8310122 Speed up compiler/codegen/Test7100757.java
JDK-8310120 Speed up compiler/intrinsics/unsafe/DirectByteBufferTest.java and HeapByteBufferTest.java
JDK-8311615 StackWalkTest.java fails after CODETOOLS-7903373
JDK-8312363 store a JavaThread* in the java.lang.Thread object after the JavaThread* is added to the main ThreadsList
JDK-8312226 sun/java2d/pipe/InterpolationQualityTest.java fails with D3D basic render driver
JDK-8310281 sun/security/pkcs11/KeyStore/SecretKeysBasic.sh failed with "PKCS11Exception: CKR_ATTRIBUTE_SENSITIVE"
JDK-8311618 Test javax/swing/JTableHeader/6889007/bug6889007.java failed: Wrong type of cursor
JDK-8310290 Tests should not rely on specific JAR file names (hotspot)
JDK-8310289 Tests should not rely on specific JAR file names (jpackage)
JDK-8310282 Two javac tests have bad jtreg `@clean` tags
JDK-8312881 Update Commons BCEL to Version 6.7.0
JDK-8311998 Update GHA XCode to 12.5.1
JDK-8310700 Update HarfBuzz to 7.2.0
JDK-8311503 Update javax/swing/Popup/TaskbarPositionTest.java
JDK-8310291 Update Libpng to 1.6.39
JDK-8313150 Verify version numbers in legal files
JDK-8312225 Wrong visible amount in Adjustable of ScrollPane
JDK-8310121 ZGC: vmTestbase/gc/ArrayJuggle/ tests fails intermittently with exit code 97

Kimura Yukihiro, Fujitsu

Bug Summary
JDK-8313815 The exception messages printed by jcmd ManagementAgent.start are corrupted on Japanese Windows

kirill, Independent

Bug Summary
JDK-8310035 Footprint regression from JDK-8224957

Jenny Shivayogi, Amazon

Bug Summary
JDK-8311838 Open source AWT misc tests
JDK-8312079 Open source few AWT Insets related tests
JDK-8311841 Open source several clipboard AWT tests

Dan Lutker, Amazon

Bug Summary
JDK-8314552 Fix javadoc tests to work with jtreg 7

Matthias Baesken, SAP

Bug Summary
JDK-8309589 (zipfs) ZipFSOutputStreamTest.testOutputStream should only check inflated bytes
JDK-8309997 Adjust ShenandoahHeap print_heap_regions_on
JDK-8311229 avoid NULL after 8301661
JDK-8311777 avoid potential leaks in KeystoreImpl.m related to JNU_CHECK_EXCEPTION early returns
JDK-8310000 enhance exceptions in MappedMemoryUtils.c
JDK-8311265 enhance logging and some exception in krb5/Config.java
JDK-8314992 java/lang/ProcessHandle tests fail with "RuntimeException: Input/output error" in java.lang.ProcessHandleImpl$Info.info0
JDK-8309901 javax/sound/sampled/Clip/SetPositionHang.java failed with ArrayIndexOutOfBoundsException: Array index out of range: -4
JDK-8310189 Provide sctpHandleSocketErrorWithMessage
JDK-8312895 report some fontconfig related environment variables in hs_err file
JDK-8310114 Resolve multiple definition of 'handleSocketError' when statically linking with JDK native libraries
JDK-8315212 some tests fail in case ipv6 is disabled on the machine
JDK-8309932 VerifyCACerts.java misses blank in error output

Martin Doerr, SAP

Bug Summary
JDK-8314089 (cal) Japanese calendar unit test system should avoid multiple static imports
JDK-8310378 [REDO] ByteBufferTest.java: replace endless recursion with RuntimeException in void ck(double x, double y)
JDK-8310736 [Windows] hs_err files sometimes miss information about the code containing the error
JDK-8310723 AArch64: Handle special cases for MaxINode & MinINode
JDK-8315564 Add Certigna Root CA - 2
JDK-8314177 Add container tests for on-the-fly resource quota updates
JDK-8310895 Add ftcolor.c to imported freetype sources
JDK-8311167 Add new positioning options to PassFailJFrame test framework
JDK-8315707 C1 compilation crashes in LinearScan::resolve_exception_edge
JDK-8311275 DrawStringWithInfiniteXform.java failed with "RuntimeException: drawString with InfiniteXform transform takes long time"
JDK-8310377 Dubious PrintCompilation output
JDK-8310374 emit abstract machine code in hs-err logs
JDK-8310372 Exception printed to stdout on Windows when storing transparent image in clipboard
JDK-8311121 Factor out the common code for initializing and starting internal VM JavaThreads
JDK-8310737 function isWsl() returns false on WSL2
JDK-8311027 Have -XshowSettings option display tzdata version
JDK-8310738 Incorrect value of 'used' jvmstat counter
JDK-8311277 java/util/concurrent/ConcurrentHashMap/ConcurrentAssociateTest.java fails with internal timeout when executed with TieredCompilation1/3
JDK-8310522 jdk/jfr/jvm/TestDumpOnCrash.java timed out
JDK-8310373 jfr command hangs when it processes invalid file
JDK-8310520 jtreg time out of CtrlASCII.java seems to hang the Xserver.
JDK-8310637 Juggle04/TestDescription.java should be a booleanArr test and not a byteArr one
JDK-8310519 jvmti/RedefineClasses/StressRedefine failed: assert(!is_null(v)) failed: narrow klass value can never be zero
JDK-8310741 Linux os::create_thread() overcounts guardpage size with newer glibc (>=2.27)
JDK-8314176 ListKeychainStore.sh fails in some virtualized environments
JDK-8310740 Make thread stacks not use huge pages
JDK-8310521 max code printed in hs-err logs should be configurable
JDK-8314090 Missing coverage for javax.xml.crypto.dom.DOMCryptoContext
JDK-8314175 nsk/jdb tests don't pass -verbose flag to the debuggee
JDK-8314042 Off-by-one bug when searching arrays in AlpnGreaseTest
JDK-8311276 Provide a reason for PassFailJFrame.forceFail
JDK-8310634 Refactor TestMemoryAwareness to use WhiteBox api for host values
JDK-8311028 Refactoring changes to PassFailJFrame Test Framework
JDK-8314043 Remove UTF-8 character from TaskbarPositionTest.java
JDK-8310739 RunThese30M.java crashed with assert(early->flag() == current->flag() || early->flag() == mtNone)
JDK-8310375 runtime/ErrorHandling/MachCodeFramesInErrorFile.java fails when hsdis is present
JDK-8311478 Screen capture for test JFileChooserSetLocationTest.java, failure case
JDK-8314223 security/infra/java/security/cert/CertPathValidator/certification/AmazonCA.java fails
JDK-8310633 show abstract machine code in hs-err for all VM crashes
JDK-8314040 T6587786.java failed after JDK-8189997
JDK-8314039 tools/launcher/I18NArgTest.java fails on Japanese Windows environment
JDK-8312497 Update FreeType to 2.13.0
JDK-8310636 Update PCSC-Lite for Suse Linux to 1.9.9 and fix incomplete license wording
JDK-8311120 Update Siphash
JDK-8314088 Update test java/awt/Choice/DragOffNoSelect.java
JDK-8314087 Update VerifySignedJar to actually exercise and test verification
JDK-8314178 vmTestbase/nsk/jdb/interrupt/interrupt001/interrupt001.java timed out due to missing prompt
JDK-8310635 vmTestbase/nsk/monitoring/stress/lowmem fails on calling isCollectionUsageThresholdExceeded()

nagata.haruhito, Fujitsu

Bug Summary
JDK-8312543 JQuery UI license file not updated
JDK-8312542 Upgrade jQuery UI to version 1.13.2

Ningsheng Jian, ARM

Bug Summary
JDK-8309912 AArch64: Vector registers are clobbered by some macroassemblers

Oli Gillespie, Amazon

Bug Summary
JDK-8315235 JNI NewWeakGlobalRef throws exception for null arg
JDK-8309905 Optimize DateTimeFormatterBuilder.ZoneTextPrinterParser.getTree()
JDK-8315237 SymbolTable can leak Symbols during cleanup

Robbin Ehn, Rivos

Bug Summary
JDK-8317674 RISC-V: Zero extended narrow oop passed to Atomic::cmpxchg

Roman Kennke, Amazon

Bug Summary
JDK-8312514 jdk/jfr/event/oldobject/TestLargeRootSet.java failed "assert(!contains(edge->reference())) failed: invariant"
JDK-8312513 Prepare Leak Profiler for Lilliput

Roman Marchenko, Azul

Bug Summary
JDK-8314128 configure script failed on WSL

Ralf Schmelter, SAP

Bug Summary
JDK-8314596 jdk/jfr/jvm/TestDumpOnCrash.java fails on Linux ppc64le and Linux aarch64
JDK-8313423 Metadata for regionsRefilled of G1EvacuationStatistics event is wrong

Scott Gibbons, Intel

Bug Summary
JDK-8310210 Accelerate AVX-512 CRC32C for small buffers

Sergey Bylokhov, Amazon

Bug Summary
JDK-8313964 GCC 7 reports compiler warning in bundled freetype 2.13.0
JDK-8314057 java/io/ObjectStreamClass/ObjectStreamClassCaching.java fails with various GCs
JDK-8311063 PropertyDescriptor should work with overridden generic getter method
JDK-8311072 Skip the "half float" support in LittleCMS during the build
JDK-8311107 Unnecessary color conversion during 4BYTE_ABGR_PRE to INT_ARGB_PRE blit

Aleksey Shipilev, Amazon

Bug Summary
JDK-8314658 [17u] GHA: Sync up debian-version for cross-builds
JDK-8314393 Add lib-test tier1 testing in GHA
JDK-8309952 Add missing STS to Shenandoah
JDK-8314638 Amend TestLoadIndexedMismatch test to target intrinsic directly
JDK-8311568 AsyncLogWriter should not overide is_Named_thread()
JDK-8311280 Avoid loading Klass* twice in TypeArrayKlass::oop_size()
JDK-8310309 Buffer overrun in reverse_words of sharedRuntime_x86_64.cpp:3517
JDK-8311637 C1 LIR instruction for load-klass
JDK-8314410 C1: Incorrect LoadIndexed value numbering
JDK-8311037 C1: Missing receiver null check in Reference::get intrinsic
JDK-8315308 C2: Sinking node may cause required cast to be dropped
JDK-8310463 Clarify EXPERIMENTAL flags comment in hotspot/share/runtime/globals.hpp
JDK-8310465 ConstantPool::print_on can crash if _cache is NULL
JDK-8311282 Correct type/array element offset in LibraryCallKit::get_state_from_digest_object()
JDK-8314639 Early crashes in os::print_context on AArch64
JDK-8314206 GHA: Bootstrap sysroots with --variant=minbase
JDK-8314205 GHA: Bump GCC versions for July 2023 updates
JDK-8314201 GHA: Bump to Ubuntu 22.04
JDK-8314400 GHA: Cut down cross-compilation sysroots
JDK-8314637 GHA: Cut down cross-compilation sysroots deeper
JDK-8314989 GHA: Drop libfreetype6-dev transitional package in favor of libfreetype-dev
JDK-8314203 GHA: dump config.log in case of configure failure
JDK-8314202 GHA: Harmonize GCC version handling for host and cross builds
JDK-8314399 GHA: qemu-debootstrap is deprecated, use the regular one
JDK-8314987 GHA: RISC-V should use the official repository for bootstrap
JDK-8314856 hs_err should print more stack in hex dump
JDK-8309131 Improve performance of DataInputStream
JDK-8314985 Incorrect description for jtreg-failure-handler option
JDK-8314394 JMH 1.34 and later requires jopt-simple 5.0.4
JDK-8315028 JVM should trim the native heap
JDK-8313604 Linux: Provide the option to override the timer slack
JDK-8311655 LIR_OpLoadKlass::_info shadows the field of the same name from LIR_Op
JDK-8311482 Lower the compile threshold and reduce the iterations of warmup loop in VarHandles tests
JDK-8310313 Mark word accesses should not use Access API
JDK-8309348 Memory leaks in OopMapCache
JDK-8314398 Minor improvements in MSYS2 Workflow handling
JDK-8311095 native_thread not protected by TLH
JDK-8315032 New test runtime/os/TestTrimNative.java#trimNative is failing: did not see the expected RSS reduction
JDK-8311093 Optimize ResourceArea zapping on ResourceMark release
JDK-8311572 Parallelize heap walk for ObjectCount(AfterGC) JFR event collection
JDK-8311485 ParallelObjectIterator freed at the wrong time in VM_HeapDumper
JDK-8311652 PPC: Remove duplicate info != NULL check
JDK-8315307 Print instruction blocks in byte units
JDK-8312971 Provide clean, platform-agnostic interface to C-heap trimming
JDK-8313546 Reconfigure check should include make/conf/version-numbers.conf
JDK-8311481 Remove -XX:+CheckMemoryInitialization
JDK-8311569 Remove unused MemAllocator::obj_memory_range
JDK-8314204 Run GHA manually with user-specified make and configure arguments
JDK-8315036 runtime/os/TestTrimNative.java is failing on slow machines
JDK-8310318 SA: Allow larger object alignments
JDK-8310350 Select num workers for safepoint ParallelCleanupTask
JDK-8310319 serviceability/sa/TestObjectAlignment.java fails on x86_32
JDK-8309213 Shenandoah: Handle more GCCauses in ShenandoahControlThread::request_gc
JDK-8309212 Shenandoah: HdrSeq asserts "sub-bucket index (512) overflow for value ( 1.00)"
JDK-8311484 Shenandoah: Some tests failed with "EA: missing allocation reference path"
JDK-8310464 Shenandoah: Strengthen the mark word check in string dedup
JDK-8314857 Shenandoah: sun/tools/jhsdb/heapconfig/JMapHeapConfigTest.java fails
JDK-8314640 Socket.setOption(TCP_QUICKACK) uses wrong level
JDK-8310462 Some LoadLoad barriers in the interpreter are unnecessary after JDK-8220051
JDK-8311036 Thread.isAlive0 doesn't need to call into the VM
JDK-8311483 TLAB initialization may cause div by zero
JDK-8310714 Unsafe list operations in JfrStringPool
JDK-8314395 Update jib-profiles.js to use JMH 1.33 devkit
JDK-8314396 Update jib-profiles.js to use JMH 1.34 devkit
JDK-8314207 Update JMH devkit to 1.36
JDK-8314636 Update JMH devkit to 1.37
JDK-8311281 Use acquire semantics in ObjectSynchronizer::read_stable_mark()

Sergey Nazarkin, Azul

Bug Summary
JDK-8312101 [arm32] SafeFetch32 thumb interleaving causes random crashes
JDK-8312102 arm32 build crashes since JDK-8283326
JDK-8311636 AsyncGetCallTrace can cause SIGBUS on M1
JDK-8312088 Implement SafeFetch statically
JDK-8312103 Temporary fix for arm32 SafeFetch

Sonia Zaldana Calles, Red Hat

Bug Summary
JDK-8313615 Zero: Handle "zero" variant in CommandLineOptionTest.java

Tyler Steele, IBM

Bug Summary
JDK-8313561 [AIX] Broken build after JDK-8307301

Vladimir Kempik, Syntacore

Bug Summary
JDK-8312219 RISC-V: small improvements to shift immediate instructions

William Kemper, Amazon

Bug Summary
JDK-8310564 gc/stringdedup/TestStringDeduplicationInterned.java fails with Shenandoah
JDK-8310842 Shenandoah: A couple of virtual thread tests failed with iu mode even without Loom enabled.
JDK-8310817 Shenandoah: Don't produce new memory state in C2 LRB runtime call
JDK-8310339 Shenandoah: ThreadMXBean synchronizer tests crash with aggressive heuristics

Xin Liu, Amazon

Bug Summary
JDK-8311959 async logging for stdout and stderr

Yuri Nesterenko, Azul

Bug Summary
JDK-8318353 Buffer clean in PasswordCallback
JDK-8317040 Exclude cleaner test failing on older releases

yifan.tsai, Independent

Bug Summary
JDK-8311824 Improve MD5 intrinsic on AArch64

Zdenek Zambersky, Red Hat

Bug Summary
JDK-8310044 Fix container tests for jdks with symlinked conf dir