PUSHES REPORT: 18.0.1

This report shows who pushed the backports to the given release. This usually shows who did the backporting, testing, and review work.

Report generated: Sun Jul 03 02:00:46 CEST 2022

Distribution by priority

Count Priority
1 P1
18 P2
81 P3
26 P4

Distribution by components

Count Component
126 100% Total
68 54.0% hotspot
39 31.0% hotspot/compiler
12 9.5% hotspot/jfr
10 7.9% hotspot/runtime
6 4.8% hotspot/gc
1 0.8% hotspot/jvmti
21 16.7% core-libs
5 4.0% core-libs
4 3.2% core-libs/java.util
2 1.6% core-libs/java.net
2 1.6% core-libs/javax.naming
2 1.6% core-libs/java.nio
1 0.8% core-libs/java.rmi
1 0.8% core-libs/java.io:serialization
1 0.8% core-libs/java.lang.module
1 0.8% core-libs/java.io
1 0.8% core-libs/java.time
1 0.8% core-libs/java.lang
9 7.1% client-libs
4 3.2% client-libs/javax.accessibility
2 1.6% client-libs/java.awt
1 0.8% client-libs
1 0.8% client-libs/demo
1 0.8% client-libs/java.awt:i18n
9 7.1% infrastructure
6 4.8% infrastructure/build
2 1.6% infrastructure
1 0.8% infrastructure/release_eng
9 7.1% tools
3 2.4% tools/jpackage
3 2.4% tools/javac
2 1.6% tools/javadoc(tool)
1 0.8% tools/launcher
8 6.3% security-libs
4 3.2% security-libs/java.security
2 1.6% security-libs
1 0.8% security-libs/javax.xml.crypto
1 0.8% security-libs/javax.crypto
2 1.6% core-svc
1 0.8% core-svc/tools
1 0.8% core-svc/debugger

Distribution by affiliation

This Release Pushes

Original Pushes

Count Committer
126 100% Total
83 65.9% Oracle
9 7.1% Tobias Hartmann
8 6.3% Daniel Daugherty
7 5.6% Erik Gahlin
5 4.0% Maurizio Cimadamore
3 2.4% Stuart Marks
3 2.4% Jan Lahoda
3 2.4% Harold Seigel
3 2.4% Joe Darcy
3 2.4% Fairoz Matte
3 2.4% Vladimir Ivanov
2 1.6% Markus Grönlund
2 1.6% Igor Veresov
2 1.6% Sean Coffey
2 1.6% Roger Riggs
2 1.6% Vladimir Kozlov
2 1.6% Naoto Sato
2 1.6% Erik Joelsson
2 1.6% Thomas Schatzl
2 1.6% Alexander Matveev
1 0.8% Weijun Wang
1 0.8% Michael McMahon
1 0.8% Hannes Wallnoefer
1 0.8% pavel.kharskii
1 0.8% Ioi Lam
1 0.8% Rajan Halade
1 0.8% Pavel Rappo
1 0.8% Coleen Phillimore
1 0.8% Claes Redestad
1 0.8% Alexey Ivanov
1 0.8% Dmitry Markov
1 0.8% Robert Mckenna
1 0.8% Jonathan Gibbons
1 0.8% Kevin Walls
1 0.8% Kim Barrett
1 0.8% Christian Hagedorn
1 0.8% Julia Boes
1 0.8% Mark Reinhold
17 13.5% Red Hat
10 7.9% Aleksey Shipilev
4 3.2% Roland Westrelin
2 1.6% Roman Kennke
1 0.8% Zhengyu Gu
6 4.8% SAP
3 2.4% Matthias Baesken
2 1.6% Martin Doerr
1 0.8% Johannes Bechberger
5 4.0% JetBrains
2 1.6% Artem Semenov
2 1.6% Aleksandr Veselov
1 0.8% Anton Tarasov
4 3.2% ARM
2 1.6% Hao Sun
1 0.8% Eric Liu
1 0.8% Fei Gao
4 3.2% Intel
2 1.6% Jatin Bhateja
2 1.6% Smita Kamath
3 2.4% Amazon
2 1.6% Sergey Bylokhov
1 0.8% William Kemper
3 2.4% Independent
1 0.8% 54955201+macarte
1 0.8% Quan Anh Mai
1 0.8% gipperon
1 0.8% Tencent
1 0.8% Jie Fu
Count Committer
126 100% Total
81 64.3% Oracle
8 6.3% Daniel Daugherty
7 5.6% Erik Gahlin
5 4.0% Maurizio Cimadamore
4 3.2% Vladimir Ivanov
3 2.4% Stuart Marks
3 2.4% Jan Lahoda
3 2.4% Douglas Simon
3 2.4% Joe Darcy
3 2.4% Fairoz Matte
2 1.6% Weijun Wang
2 1.6% Markus Grönlund
2 1.6% Igor Veresov
2 1.6% Roger Riggs
2 1.6% Vladimir Kozlov
2 1.6% Naoto Sato
2 1.6% Tobias Hartmann
2 1.6% Thomas Schatzl
2 1.6% Alexander Matveev
1 0.8% Emanuel Peter
1 0.8% Sean Mullan
1 0.8% Michael McMahon
1 0.8% Hannes Wallnoefer
1 0.8% David Holmes
1 0.8% Daniel Jelinski
1 0.8% pavel.kharskii
1 0.8% Ioi Lam
1 0.8% Rajan Halade
1 0.8% Pavel Rappo
1 0.8% Aleksej Efimov
1 0.8% Coleen Phillimore
1 0.8% Claes Redestad
1 0.8% Alexey Ivanov
1 0.8% Harold Seigel
1 0.8% Dmitry Markov
1 0.8% Robert Mckenna
1 0.8% Jonathan Gibbons
1 0.8% Kevin Walls
1 0.8% Kim Barrett
1 0.8% Christian Hagedorn
1 0.8% Julia Boes
1 0.8% Mark Reinhold
1 0.8% Erik Joelsson
17 13.5% Red Hat
10 7.9% Aleksey Shipilev
4 3.2% Roland Westrelin
2 1.6% Roman Kennke
1 0.8% Zhengyu Gu
6 4.8% JetBrains
2 1.6% Artem Semenov
2 1.6% Aleksandr Veselov
1 0.8% Anton Tarasov
1 0.8% Maxim Kartashev
5 4.0% SAP
2 1.6% Martin Doerr
2 1.6% Matthias Baesken
1 0.8% Johannes Bechberger
4 3.2% ARM
2 1.6% Hao Sun
1 0.8% Eric Liu
1 0.8% Fei Gao
4 3.2% Intel
2 1.6% Jatin Bhateja
2 1.6% Smita Kamath
3 2.4% Amazon
2 1.6% Sergey Bylokhov
1 0.8% William Kemper
3 2.4% Independent
1 0.8% yifan.tsai
1 0.8% Quan Anh Mai
1 0.8% gipperon
1 0.8% Azul
1 0.8% Sergey Nazarkin
1 0.8% Tencent
1 0.8% Jie Fu
1 0.8% Unknown
1 0.8% N/A

Chronological push log:

Days Ago This Release Push By Original Push By Bug Summary
Name Affiliation Name Affiliation
116 Roman Kennke Red Hat Roman Kennke Red Hat JDK-8282806 Memory leak in invoker.c fillInvokeRequest() during JDI operations
117 Sean Coffey Oracle Weijun Wang Oracle JDK-8282747 org.jcp.xml.dsig.internal.dom.Utils.parseIdFromSameDocumentURI throws StringIndexOutOfBoundsException when calling substring method
130 54955201+macarte Independent Aleksej Efimov Oracle JDK-8282269 JNDI DNS provider fails to resolve SRV entries when IPV6 stack is enabled
131 Rajan Halade Oracle Rajan Halade Oracle JDK-8282206 Add expiry exception for Digicert (geotrustglobalca) expiring in May 2022
135 Sergey Bylokhov Amazon Sergey Bylokhov Amazon JDK-8282035 javax/print/PrintServiceLookup/FlushCustomClassLoader.java fails to free
136 Harold Seigel Oracle David Holmes Oracle JDK-8282013 Upgrading from 8 to 11 no longer accepts '/' as filepath separator in gc paths
136 Erik Joelsson Oracle Maxim Kartashev JetBrains JDK-8282009 Windows builds in different directories are not fully reproducible
137 gipperon Independent gipperon Independent JDK-8281877 Remove EA from JDK 18 version string starting with Initial RC promotion B35 on February 10, 2022
137 Tobias Hartmann Oracle Tobias Hartmann Oracle JDK-8281876 [BACKOUT] AArch64: Implement string_compare intrinsic in SVE
143 Joe Darcy Oracle Joe Darcy Oracle JDK-8281559 RandomGenerator:NextDouble() default behavior partially fixed by JDK-8280950
143 Joe Darcy Oracle Joe Darcy Oracle JDK-8281557 RandomGenerator:NextDouble() default behavior non conformant after JDK-8280550 fix
143 Joe Darcy Oracle Joe Darcy Oracle JDK-8281556 SplittableRandom#nextDouble(double,double) can return result >= bound
145 Robert Mckenna Oracle Robert Mckenna Oracle JDK-8281399 LDAP connection timeout not honoured under contention
145 Sean Coffey Oracle Sean Mullan Oracle JDK-8281211 Correct signer logic for jars signed with multiple digest algorithms
148 Matthias Baesken SAP Matthias Baesken SAP JDK-8281669 [test] Adjust sun/security/pkcs12/KeytoolOpensslInteropTest.java after 8278344
149 Matthias Baesken SAP Daniel Jelinski Oracle JDK-8281196 Memory leak in DefaultProxySelector
149 Tobias Hartmann Oracle Vladimir Ivanov Oracle JDK-8281192 C2: Infinite loop in CMoveINode::Ideal during IGVN
149 Tobias Hartmann Oracle yifan.tsai Independent JDK-8281191 Compilation logging crashes for thread suspension / debugging tests
149 Tobias Hartmann Oracle Douglas Simon Oracle JDK-8281190 [JVMCI] failed speculations list must outlive any nmethod that refers to it
149 Tobias Hartmann Oracle Emanuel Peter Oracle JDK-8281189 C2: assert(f <= 1 && f >= 0) failed: Incorrect frequency
149 Tobias Hartmann Oracle Sergey Nazarkin Azul JDK-8281188 [arm32] C1 longs comparison operation destroys argument registers
149 Tobias Hartmann Oracle Douglas Simon Oracle JDK-8281187 [JVMCI] exception in HotSpotJVMCIRuntime.translate can exit the VM
150 Sergey Bylokhov Amazon Sergey Bylokhov Amazon JDK-8280910 Update openjdk project in jcheck to "jdk-updates" for jdk18u
151 Tobias Hartmann Oracle Douglas Simon Oracle JDK-8281668 [JVMCI] assert((uint)reason < 2* _trap_hist_limit) failed: oob
152 Aleksey Shipilev Red Hat Aleksey Shipilev Red Hat JDK-8280968 x86_32 Math.sqrt performance regression with -XX:UseSSE={0,1}
152 Aleksey Shipilev Red Hat Aleksey Shipilev Red Hat JDK-8280966 Update JMH devkit to 1.34
155 Alexey Ivanov Oracle Alexey Ivanov Oracle JDK-8278472 Invalid value set to CANDIDATEFORM structure
155 Dmitry Markov Oracle Dmitry Markov Oracle JDK-8280874 Drag And Drop hangs on Windows
156 Harold Seigel Oracle N/A Unknown JDK-8280822 macos attempt_reserve_memory_at(arg1, arg2, true) failure
158 Maurizio Cimadamore Oracle Maurizio Cimadamore Oracle JDK-8281667 Small javadoc tweaks to foreign API
159 Julia Boes Oracle Julia Boes Oracle JDK-8280673 Missing "classpath exception" in several files from jdk.httpserver
162 Jonathan Gibbons Oracle Jonathan Gibbons Oracle JDK-8280672 Update nroff pages in JDK 18 before RC
164 Michael McMahon Oracle Michael McMahon Oracle JDK-8280671 Temporarily disable Unix domain sockets in Windows PipeImpl
164 Jan Lahoda Oracle Jan Lahoda Oracle JDK-8280670 Error "Cannot read field "sym" because "this.lvar[od]" is null" when compiling
164 Daniel Daugherty Oracle Daniel Daugherty Oracle JDK-8280669 25 Null pointer dereference defect groups in 4 files
164 Aleksey Shipilev Red Hat Aleksey Shipilev Red Hat JDK-8280668 AArch64 "core" variant does not build after JDK-8270947
164 Martin Doerr SAP Martin Doerr SAP JDK-8280667 [PPC64, s390] frame size checks are not yet correct
164 Kim Barrett Oracle Kim Barrett Oracle JDK-8280666 vmTestbase/vm/gc/containers/Combination05/TestDescription.java crashes verifying length of DCQS
165 Fei Gao ARM Fei Gao ARM JDK-8280665 jdk/incubator/vector/Vector256ConversionTests.java crashes randomly with SVE
165 Aleksandr Veselov JetBrains Aleksandr Veselov JetBrains JDK-8280658 Access Bridge: Wrong frame position and hit test result on HiDPI display
165 Erik Gahlin Oracle Erik Gahlin Oracle JDK-8280654 jdk/jfr/jmx/streaming/TestMaxSize.java Expected only one or two chunks
165 Markus Grönlund Oracle Markus Grönlund Oracle JDK-8280652 RunThese30M fails "assert(_class_unload ? true : ((((JfrTraceIdBits::load(class_loader_klass)) & ((1 << 4) << 8)) != 0))) failed: invariant"
166 Aleksey Shipilev Red Hat Aleksey Shipilev Red Hat JDK-8280650 PPC64 debug builds fail with "untested: RangeCheckStub: predicate_failed_trap_id"
169 Erik Joelsson Oracle Erik Joelsson Oracle JDK-8280043 Define version in .jcheck/conf
169 Daniel Daugherty Oracle Daniel Daugherty Oracle JDK-8280648 ProblemList jdk/jfr/api/consumer/recordingstream/TestOnEvent.java on linux-x64
169 Martin Doerr SAP Martin Doerr SAP JDK-8280646 [PPC64, s390] implement frame::is_interpreted_frame_valid checks
169 Johannes Bechberger SAP Johannes Bechberger SAP JDK-8280645 [macosx] ignore xcodebuild warnings on M1
169 Maurizio Cimadamore Oracle Maurizio Cimadamore Oracle JDK-8280643 Synthetic cast causes generation of store barriers when using heap segments
170 Hao Sun ARM Hao Sun ARM JDK-8280640 [TESTBUG] ReturnBlobToWrongHeapTest.java fails with -XX:TieredStopAtLevel=1 on machines with many cores
170 Naoto Sato Oracle Naoto Sato Oracle JDK-8280638 timeouts in test java/time/test/java/time/format/TestZoneTextPrinterParser.java
170 Claes Redestad Oracle Claes Redestad Oracle JDK-8280636 Loop optimization issue in String.encodeUTF8_UTF16
170 Aleksey Shipilev Red Hat Aleksey Shipilev Red Hat JDK-8280634 jdk.jpackage/share/native/applauncher/JvmLauncher.cpp fails to build with GCC 6.3.0
170 Thomas Schatzl Oracle Thomas Schatzl Oracle JDK-8280633 [REDO] VM Exit does not abort concurrent mark
170 Christian Hagedorn Oracle Christian Hagedorn Oracle JDK-8280631 C2: assert(is_Loop()) failed: invalid node class: Region
172 Pavel Rappo Oracle Pavel Rappo Oracle JDK-8280628 ExceptionInInitializerError: improve handling of exceptions in user-provided taglets
172 Fairoz Matte Oracle Fairoz Matte Oracle JDK-8280627 [TESTBUG] modify compiler/loopopts/TestSkeletonPredicateNegation.java to run on C1 also
172 Tobias Hartmann Oracle Tobias Hartmann Oracle JDK-8280625 Method linking fails with guarantee(mh->adapter() != NULL) failed: Adapter blob must already exist!
173 Roman Kennke Red Hat Roman Kennke Red Hat JDK-8280623 Preserve result in native wrapper with +UseHeavyMonitors
173 Hao Sun ARM Hao Sun ARM JDK-8280621 ARM32: several vector test failures for ASHR
173 Erik Gahlin Oracle Erik Gahlin Oracle JDK-8280620 jdk/jfr/api/recording/time/TestTimeMultiple.java failed with "RuntimeException: getStopTime() > afterStop"
173 Vladimir Ivanov Oracle Vladimir Ivanov Oracle JDK-8280618 C1: No inlining through invokedynamic and invokestatic call sites when resolved class is not linked
173 Harold Seigel Oracle Harold Seigel Oracle JDK-8279691 Bytecodes::result_type() for arraylength returns T_VOID instead of T_INT
173 Fairoz Matte Oracle Fairoz Matte Oracle JDK-8279782 compiler/loopopts/TestSkeletonPredicateNegation.java times out with -XX:TieredStopAtLevel < 4
173 Hannes Wallnoefer Oracle Hannes Wallnoefer Oracle JDK-8279781 DocTrees.getDocCommentTree should be specified as idempotent
173 Matthias Baesken SAP Matthias Baesken SAP JDK-8279780 sun/security/pkcs12/KeytoolOpensslInteropTest.java test fails because of different openssl output
173 Jan Lahoda Oracle Jan Lahoda Oracle JDK-8279779 javac tries to compile a file twice via PackageElement.getEnclosedElements
173 Jan Lahoda Oracle Jan Lahoda Oracle JDK-8279778 JavacTrees.searchMethod finds incorrect match
176 Maurizio Cimadamore Oracle Maurizio Cimadamore Oracle JDK-8279777 Dereferencing segments backed by different scopes leads to pollution
176 Ioi Lam Oracle Ioi Lam Oracle JDK-8279776 ~13% variation in Renaissance-Scrabble
177 Fairoz Matte Oracle Fairoz Matte Oracle JDK-8279775 Some JFR tests do not accept 'GCLocker Initiated GC' as a valid GC cause
178 Daniel Daugherty Oracle Daniel Daugherty Oracle JDK-8279774 ProblemList sun/security/ssl/SSLSessionImpl/NoInvalidateSocketException.java
178 Daniel Daugherty Oracle Daniel Daugherty Oracle JDK-8279773 ProblemList java/nio/channels/DatagramChannel/ManySourcesAndTargets.java on macosx-aarch64
178 Anton Tarasov JetBrains Anton Tarasov JetBrains JDK-8279772 [macos] test/jdk/java/awt/dnd/RemoveDropTargetCrashTest crashes with VoiceOver on macOS
178 Daniel Daugherty Oracle Daniel Daugherty Oracle JDK-8279771 ProblemList java/awt/GraphicsDevice/CheckDisplayModes.java on macosx-aarch64
178 Maurizio Cimadamore Oracle Maurizio Cimadamore Oracle JDK-8279770 Alignment of heap segments is not enforced correctly
178 Aleksey Shipilev Red Hat Aleksey Shipilev Red Hat JDK-8279769 Incorrect legacyMap.get in java.security.Provider after JDK-8276660
179 Quan Anh Mai Independent Quan Anh Mai Independent JDK-8279768 compiler/vectorapi/reshape/TestVectorCastAVX1.java crashes in assembler
179 Vladimir Ivanov Oracle Vladimir Ivanov Oracle JDK-8279767 C2: Receiver downcast is missing when inlining through method handle linkers
179 Vladimir Ivanov Oracle Vladimir Ivanov Oracle JDK-8279766 [vector] assert(payload->is_object()) failed: expected 'object' value for scalar-replaced boxed vector but got: NULL
179 Aleksey Shipilev Red Hat Aleksey Shipilev Red Hat JDK-8279765 GHA: Print tests that are in error
179 Roland Westrelin Red Hat Roland Westrelin Red Hat JDK-8279764 two microbenchmarks tests fail "assert(!jvms->method()->has_exception_handlers()) failed: no exception handler expected" after JDK-8275638
186 William Kemper Amazon William Kemper Amazon JDK-8279763 Uneven work distribution when scanning heap roots in G1
189 Igor Veresov Oracle Igor Veresov Oracle JDK-8279762 C1: assert(false) failed: live_in set of first block must be empty
190 Vladimir Kozlov Oracle Vladimir Kozlov Oracle JDK-8279715 Document the -XX:+NeverActAsServerClassMachine flag
190 Eric Liu ARM Eric Liu ARM JDK-8279761 AArch64: [vectorapi] VectorMaskLoadStoreTest.testMaskCast() test fail
191 pavel.kharskii Oracle pavel.kharskii Oracle JDK-8278869 Bump version numbers for OPENJDK 18.0.1
191 Aleksey Shipilev Red Hat Aleksey Shipilev Red Hat JDK-8279760 [BACKOUT] JDK-8278413: C2 crash when allocating array of size too large
191 Erik Gahlin Oracle Erik Gahlin Oracle JDK-8279759 jdk/jfr/api/consumer/streaming/TestLatestEvent.java times out
192 Aleksey Shipilev Red Hat Aleksey Shipilev Red Hat JDK-8279758 C2: Bad AD file when matching SqrtF with UseSSE=0
192 Stuart Marks Oracle Stuart Marks Oracle JDK-8279757 rmiregistry fails to start because SecurityManager is disabled
192 Coleen Phillimore Oracle Coleen Phillimore Oracle JDK-8279756 vmTestbase/nsk/jvmti/RedefineClasses/StressRedefine failed with EXCEPTION_ACCESS_VIOLATION at 0x000000000000000d
192 Erik Gahlin Oracle Erik Gahlin Oracle JDK-8279755 JFR: One closed state per file or stream
192 Erik Gahlin Oracle Erik Gahlin Oracle JDK-8279754 java.nio.file.InvalidPathException: Malformed input or input contains unmappable characters
192 Markus Grönlund Oracle Markus Grönlund Oracle JDK-8279753 RunThese24H.java failed with EXCEPTION_ACCESS_VIOLATION in __write_sample_info__
192 Kevin Walls Oracle Kevin Walls Oracle JDK-8279752 jstatd fails to start because SecurityManager is disabled
192 Jatin Bhateja Intel Jatin Bhateja Intel JDK-8279751 Enable X86 maskAll instruction pattern for 32 bit JVM.
193 Smita Kamath Intel Smita Kamath Intel JDK-8279750 Intrinsics missing vzeroupper instruction
193 Daniel Daugherty Oracle Daniel Daugherty Oracle JDK-8279749 ProblemList jdk/jfr/event/oldobject/TestLargeRootSet.java on 2 platforms
193 Zhengyu Gu Red Hat Zhengyu Gu Red Hat JDK-8279748 Shenandoah: TestHeapDump test failed
193 Daniel Daugherty Oracle Daniel Daugherty Oracle JDK-8279747 ProblemList compiler/codecache/jmx/PoolsIndependenceTest.java on macosx-aarch64
193 Roger Riggs Oracle Roger Riggs Oracle JDK-8279746 ObjectInputStream methods invoking the OIF.CFG.getSerialFilterFactory() silent about error cases.
193 Roger Riggs Oracle Roger Riggs Oracle JDK-8279745 Deserialization filter and filter factory property error reporting under specified
193 Aleksey Shipilev Red Hat Aleksey Shipilev Red Hat JDK-8279744 JFR: JfrChunkWriter incorrectly handles int64_t chunk size as size_t
194 Smita Kamath Intel Smita Kamath Intel JDK-8279743 compiler/codegen/aes/TestAESMain.java failed with "Error: invalid offset: -1434443640" after 8273297
194 Aleksandr Veselov JetBrains Aleksandr Veselov JetBrains JDK-8279742 [macos] accessibility frame is misplaced on a secondary monitor on macOS
194 Roland Westrelin Red Hat Roland Westrelin Red Hat JDK-8279741 C2 crash when allocating array of size too large
197 Alexander Matveev Oracle Alexander Matveev Oracle JDK-8279740 [macos] SigningPackageTest is failed with runtime exception
197 Daniel Daugherty Oracle Daniel Daugherty Oracle JDK-8279739 RunThese24H times out with "java.lang.management.ThreadInfo.getLockName()" is null
197 Artem Semenov JetBrains Artem Semenov JetBrains JDK-8279738 [macos] Screen reader reads SwingSet2 JTable row selection as null, dimmed row for last column
197 Artem Semenov JetBrains Artem Semenov JetBrains JDK-8279737 SwingSet2 table demo does not have accessible description set for images
197 Igor Veresov Oracle Igor Veresov Oracle JDK-8279735 Hotspot C1 compiler crashes on Kotlin suspend fun with loop
197 Naoto Sato Oracle Naoto Sato Oracle JDK-8279734 StringTokenizer(String, String, boolean) documentation bug
197 Erik Gahlin Oracle Erik Gahlin Oracle JDK-8279733 2 jdk/jfr/api/consumer/streaming tests failed to attach
197 Roland Westrelin Red Hat Roland Westrelin Red Hat JDK-8279732 GraphKit::combine_exception_states fails with "matching stack sizes" assert
197 Roland Westrelin Red Hat Roland Westrelin Red Hat JDK-8279731 Inner loop of long loop nest runs for too few iterations
197 Jatin Bhateja Intel Jatin Bhateja Intel JDK-8279730 Incorrect behavior of FloatVector.withLane on X86
198 Mark Reinhold Oracle Mark Reinhold Oracle JDK-8279729 Clarify the ModuleDescriptor.Version specification’s treatment of repeated punctuation characters
198 Stuart Marks Oracle Stuart Marks Oracle JDK-8279727 update --help-extra message to include default value of --finalization option
198 Thomas Schatzl Oracle Thomas Schatzl Oracle JDK-8279726 SuspendibleThreadSet::_suspend_all should be volatile/atomic
199 Stuart Marks Oracle Stuart Marks Oracle JDK-8279725 update jcmd GC.finalizer_info to list finalization status
199 Vladimir Kozlov Oracle Vladimir Kozlov Oracle JDK-8279724 ClassCastException with no stack trace is thrown with -Xcomp in method handle invocation
199 Erik Gahlin Oracle Erik Gahlin Oracle JDK-8279723 test/jdk/jdk/jfr/api/consumer/TestHiddenMethod.java needs update for JEP 416
199 Maurizio Cimadamore Oracle Maurizio Cimadamore Oracle JDK-8279722 Misc issues in foreign API javadoc
200 Alexander Matveev Oracle Alexander Matveev Oracle JDK-8279721 [macos] tools/jpackage tests timeout due to /usr/bin/osascript
200 Jie Fu Tencent Jie Fu Tencent JDK-8279719 runtime/BootstrapMethod/BSMCalledTwice.java fails with release VMs after JDK-8262134
200 Weijun Wang Oracle Weijun Wang Oracle JDK-8279718 KeyStore:getAttributes() not returning unmodifiable Set

No changesets log

JDK-8283516 Remove 3 krb5.conf settings from The Kerberos 5 GSS-API Mechanism
JDK-8280608 Document the new -version option in keytool and jarsigner
JDK-8279714 Update the `java` tool specification with the --finalization option
JDK-8273941 G1 GC tuning guide updates for JDK18
JDK-6584403 Request to add a CA/CSR certificate cookbook to JSSE Reference Guide

Committer push log

54955201+macarte, Independent

Bug Summary
JDK-8282269 JNDI DNS provider fails to resolve SRV entries when IPV6 stack is enabled

Alexey Ivanov, Oracle

Bug Summary
JDK-8278472 Invalid value set to CANDIDATEFORM structure

Aleksandr Veselov, JetBrains

Bug Summary
JDK-8279742 [macos] accessibility frame is misplaced on a secondary monitor on macOS
JDK-8280658 Access Bridge: Wrong frame position and hit test result on HiDPI display

Alexander Matveev, Oracle

Bug Summary
JDK-8279740 [macos] SigningPackageTest is failed with runtime exception
JDK-8279721 [macos] tools/jpackage tests timeout due to /usr/bin/osascript

Quan Anh Mai, Independent

Bug Summary
JDK-8279768 compiler/vectorapi/reshape/TestVectorCastAVX1.java crashes in assembler

Anton Tarasov, JetBrains

Bug Summary
JDK-8279772 [macos] test/jdk/java/awt/dnd/RemoveDropTargetCrashTest crashes with VoiceOver on macOS

Artem Semenov, JetBrains

Bug Summary
JDK-8279738 [macos] Screen reader reads SwingSet2 JTable row selection as null, dimmed row for last column
JDK-8279737 SwingSet2 table demo does not have accessible description set for images

Christian Hagedorn, Oracle

Bug Summary
JDK-8280631 C2: assert(is_Loop()) failed: invalid node class: Region

Sean Coffey, Oracle

Bug Summary
JDK-8281211 Correct signer logic for jars signed with multiple digest algorithms
JDK-8282747 org.jcp.xml.dsig.internal.dom.Utils.parseIdFromSameDocumentURI throws StringIndexOutOfBoundsException when calling substring method

Coleen Phillimore, Oracle

Bug Summary
JDK-8279756 vmTestbase/nsk/jvmti/RedefineClasses/StressRedefine failed with EXCEPTION_ACCESS_VIOLATION at 0x000000000000000d

Joe Darcy, Oracle

Bug Summary
JDK-8281557 RandomGenerator:NextDouble() default behavior non conformant after JDK-8280550 fix
JDK-8281559 RandomGenerator:NextDouble() default behavior partially fixed by JDK-8280950
JDK-8281556 SplittableRandom#nextDouble(double,double) can return result >= bound

Daniel Daugherty, Oracle

Bug Summary
JDK-8280669 25 Null pointer dereference defect groups in 4 files
JDK-8279747 ProblemList compiler/codecache/jmx/PoolsIndependenceTest.java on macosx-aarch64
JDK-8279771 ProblemList java/awt/GraphicsDevice/CheckDisplayModes.java on macosx-aarch64
JDK-8279773 ProblemList java/nio/channels/DatagramChannel/ManySourcesAndTargets.java on macosx-aarch64
JDK-8280648 ProblemList jdk/jfr/api/consumer/recordingstream/TestOnEvent.java on linux-x64
JDK-8279749 ProblemList jdk/jfr/event/oldobject/TestLargeRootSet.java on 2 platforms
JDK-8279774 ProblemList sun/security/ssl/SSLSessionImpl/NoInvalidateSocketException.java
JDK-8279739 RunThese24H times out with "java.lang.management.ThreadInfo.getLockName()" is null

Dmitry Markov, Oracle

Bug Summary
JDK-8280874 Drag And Drop hangs on Windows

Erik Gahlin, Oracle

Bug Summary
JDK-8279733 2 jdk/jfr/api/consumer/streaming tests failed to attach
JDK-8279754 java.nio.file.InvalidPathException: Malformed input or input contains unmappable characters
JDK-8279759 jdk/jfr/api/consumer/streaming/TestLatestEvent.java times out
JDK-8280620 jdk/jfr/api/recording/time/TestTimeMultiple.java failed with "RuntimeException: getStopTime() > afterStop"
JDK-8280654 jdk/jfr/jmx/streaming/TestMaxSize.java Expected only one or two chunks
JDK-8279755 JFR: One closed state per file or stream
JDK-8279723 test/jdk/jdk/jfr/api/consumer/TestHiddenMethod.java needs update for JEP 416

Eric Liu, ARM

Bug Summary
JDK-8279761 AArch64: [vectorapi] VectorMaskLoadStoreTest.testMaskCast() test fail

Erik Joelsson, Oracle

Bug Summary
JDK-8280043 Define version in .jcheck/conf
JDK-8282009 Windows builds in different directories are not fully reproducible

Fei Gao, ARM

Bug Summary
JDK-8280665 jdk/incubator/vector/Vector256ConversionTests.java crashes randomly with SVE

Fairoz Matte, Oracle

Bug Summary
JDK-8280627 [TESTBUG] modify compiler/loopopts/TestSkeletonPredicateNegation.java to run on C1 also
JDK-8279782 compiler/loopopts/TestSkeletonPredicateNegation.java times out with -XX:TieredStopAtLevel < 4
JDK-8279775 Some JFR tests do not accept 'GCLocker Initiated GC' as a valid GC cause

gipperon, Independent

Bug Summary
JDK-8281877 Remove EA from JDK 18 version string starting with Initial RC promotion B35 on February 10, 2022

Hannes Wallnoefer, Oracle

Bug Summary
JDK-8279781 DocTrees.getDocCommentTree should be specified as idempotent

Hao Sun, ARM

Bug Summary
JDK-8280640 [TESTBUG] ReturnBlobToWrongHeapTest.java fails with -XX:TieredStopAtLevel=1 on machines with many cores
JDK-8280621 ARM32: several vector test failures for ASHR

Harold Seigel, Oracle

Bug Summary
JDK-8279691 Bytecodes::result_type() for arraylength returns T_VOID instead of T_INT
JDK-8280822 macos attempt_reserve_memory_at(arg1, arg2, true) failure
JDK-8282013 Upgrading from 8 to 11 no longer accepts '/' as filepath separator in gc paths

Ioi Lam, Oracle

Bug Summary
JDK-8279776 ~13% variation in Renaissance-Scrabble

Igor Veresov, Oracle

Bug Summary
JDK-8279762 C1: assert(false) failed: live_in set of first block must be empty
JDK-8279735 Hotspot C1 compiler crashes on Kotlin suspend fun with loop

Jatin Bhateja, Intel

Bug Summary
JDK-8279751 Enable X86 maskAll instruction pattern for 32 bit JVM.
JDK-8279730 Incorrect behavior of FloatVector.withLane on X86

Julia Boes, Oracle

Bug Summary
JDK-8280673 Missing "classpath exception" in several files from jdk.httpserver

Jie Fu, Tencent

Bug Summary
JDK-8279719 runtime/BootstrapMethod/BSMCalledTwice.java fails with release VMs after JDK-8262134

Jonathan Gibbons, Oracle

Bug Summary
JDK-8280672 Update nroff pages in JDK 18 before RC

Jan Lahoda, Oracle

Bug Summary
JDK-8280670 Error "Cannot read field "sym" because "this.lvar[od]" is null" when compiling
JDK-8279779 javac tries to compile a file twice via PackageElement.getEnclosedElements
JDK-8279778 JavacTrees.searchMethod finds incorrect match

Johannes Bechberger, SAP

Bug Summary
JDK-8280645 [macosx] ignore xcodebuild warnings on M1

Kim Barrett, Oracle

Bug Summary
JDK-8280666 vmTestbase/vm/gc/containers/Combination05/TestDescription.java crashes verifying length of DCQS

Kevin Walls, Oracle

Bug Summary
JDK-8279752 jstatd fails to start because SecurityManager is disabled

Vladimir Kozlov, Oracle

Bug Summary
JDK-8279724 ClassCastException with no stack trace is thrown with -Xcomp in method handle invocation
JDK-8279715 Document the -XX:+NeverActAsServerClassMachine flag

Matthias Baesken, SAP

Bug Summary
JDK-8281669 [test] Adjust sun/security/pkcs12/KeytoolOpensslInteropTest.java after 8278344
JDK-8281196 Memory leak in DefaultProxySelector
JDK-8279780 sun/security/pkcs12/KeytoolOpensslInteropTest.java test fails because of different openssl output

Maurizio Cimadamore, Oracle

Bug Summary
JDK-8279770 Alignment of heap segments is not enforced correctly
JDK-8279777 Dereferencing segments backed by different scopes leads to pollution
JDK-8279722 Misc issues in foreign API javadoc
JDK-8281667 Small javadoc tweaks to foreign API
JDK-8280643 Synthetic cast causes generation of store barriers when using heap segments

Martin Doerr, SAP

Bug Summary
JDK-8280667 [PPC64, s390] frame size checks are not yet correct
JDK-8280646 [PPC64, s390] implement frame::is_interpreted_frame_valid checks

Markus Grönlund, Oracle

Bug Summary
JDK-8279753 RunThese24H.java failed with EXCEPTION_ACCESS_VIOLATION in __write_sample_info__
JDK-8280652 RunThese30M fails "assert(_class_unload ? true : ((((JfrTraceIdBits::load(class_loader_klass)) & ((1 << 4) << 8)) != 0))) failed: invariant"

Michael McMahon, Oracle

Bug Summary
JDK-8280671 Temporarily disable Unix domain sockets in Windows PipeImpl

Mark Reinhold, Oracle

Bug Summary
JDK-8279729 Clarify the ModuleDescriptor.Version specification’s treatment of repeated punctuation characters

Naoto Sato, Oracle

Bug Summary
JDK-8279734 StringTokenizer(String, String, boolean) documentation bug
JDK-8280638 timeouts in test java/time/test/java/time/format/TestZoneTextPrinterParser.java

pavel.kharskii, Oracle

Bug Summary
JDK-8278869 Bump version numbers for OPENJDK 18.0.1

Pavel Rappo, Oracle

Bug Summary
JDK-8280628 ExceptionInInitializerError: improve handling of exceptions in user-provided taglets

Claes Redestad, Oracle

Bug Summary
JDK-8280636 Loop optimization issue in String.encodeUTF8_UTF16

Rajan Halade, Oracle

Bug Summary
JDK-8282206 Add expiry exception for Digicert (geotrustglobalca) expiring in May 2022

Roman Kennke, Red Hat

Bug Summary
JDK-8282806 Memory leak in invoker.c fillInvokeRequest() during JDI operations
JDK-8280623 Preserve result in native wrapper with +UseHeavyMonitors

Robert Mckenna, Oracle

Bug Summary
JDK-8281399 LDAP connection timeout not honoured under contention

Roland Westrelin, Red Hat

Bug Summary
JDK-8279741 C2 crash when allocating array of size too large
JDK-8279732 GraphKit::combine_exception_states fails with "matching stack sizes" assert
JDK-8279731 Inner loop of long loop nest runs for too few iterations
JDK-8279764 two microbenchmarks tests fail "assert(!jvms->method()->has_exception_handlers()) failed: no exception handler expected" after JDK-8275638

Roger Riggs, Oracle

Bug Summary
JDK-8279745 Deserialization filter and filter factory property error reporting under specified
JDK-8279746 ObjectInputStream methods invoking the OIF.CFG.getSerialFilterFactory() silent about error cases.

Sergey Bylokhov, Amazon

Bug Summary
JDK-8282035 javax/print/PrintServiceLookup/FlushCustomClassLoader.java fails to free
JDK-8280910 Update openjdk project in jcheck to "jdk-updates" for jdk18u

Aleksey Shipilev, Red Hat

Bug Summary
JDK-8279760 [BACKOUT] JDK-8278413: C2 crash when allocating array of size too large
JDK-8280668 AArch64 "core" variant does not build after JDK-8270947
JDK-8279758 C2: Bad AD file when matching SqrtF with UseSSE=0
JDK-8279765 GHA: Print tests that are in error
JDK-8279769 Incorrect legacyMap.get in java.security.Provider after JDK-8276660
JDK-8280634 jdk.jpackage/share/native/applauncher/JvmLauncher.cpp fails to build with GCC 6.3.0
JDK-8279744 JFR: JfrChunkWriter incorrectly handles int64_t chunk size as size_t
JDK-8280650 PPC64 debug builds fail with "untested: RangeCheckStub: predicate_failed_trap_id"
JDK-8280966 Update JMH devkit to 1.34
JDK-8280968 x86_32 Math.sqrt performance regression with -XX:UseSSE={0,1}

Stuart Marks, Oracle

Bug Summary
JDK-8279757 rmiregistry fails to start because SecurityManager is disabled
JDK-8279727 update --help-extra message to include default value of --finalization option
JDK-8279725 update jcmd GC.finalizer_info to list finalization status

Smita Kamath, Intel

Bug Summary
JDK-8279743 compiler/codegen/aes/TestAESMain.java failed with "Error: invalid offset: -1434443640" after 8273297
JDK-8279750 Intrinsics missing vzeroupper instruction

Tobias Hartmann, Oracle

Bug Summary
JDK-8281188 [arm32] C1 longs comparison operation destroys argument registers
JDK-8281876 [BACKOUT] AArch64: Implement string_compare intrinsic in SVE
JDK-8281668 [JVMCI] assert((uint)reason < 2* _trap_hist_limit) failed: oob
JDK-8281187 [JVMCI] exception in HotSpotJVMCIRuntime.translate can exit the VM
JDK-8281190 [JVMCI] failed speculations list must outlive any nmethod that refers to it
JDK-8281189 C2: assert(f <= 1 && f >= 0) failed: Incorrect frequency
JDK-8281192 C2: Infinite loop in CMoveINode::Ideal during IGVN
JDK-8281191 Compilation logging crashes for thread suspension / debugging tests
JDK-8280625 Method linking fails with guarantee(mh->adapter() != NULL) failed: Adapter blob must already exist!

Thomas Schatzl, Oracle

Bug Summary
JDK-8280633 [REDO] VM Exit does not abort concurrent mark
JDK-8279726 SuspendibleThreadSet::_suspend_all should be volatile/atomic

Vladimir Ivanov, Oracle

Bug Summary
JDK-8279766 [vector] assert(payload->is_object()) failed: expected 'object' value for scalar-replaced boxed vector but got: NULL
JDK-8280618 C1: No inlining through invokedynamic and invokestatic call sites when resolved class is not linked
JDK-8279767 C2: Receiver downcast is missing when inlining through method handle linkers

Weijun Wang, Oracle

Bug Summary
JDK-8279718 KeyStore:getAttributes() not returning unmodifiable Set

William Kemper, Amazon

Bug Summary
JDK-8279763 Uneven work distribution when scanning heap roots in G1

Zhengyu Gu, Red Hat

Bug Summary
JDK-8279748 Shenandoah: TestHeapDump test failed