PUSHES REPORT: 19.0.1

This report shows who pushed the backports to the given release. This usually shows who did the backporting, testing, and review work.

Report generated: Mon Sep 26 01:49:28 CEST 2022

Distribution by priority

Count Priority
2 P1
30 P2
97 P3
35 P4

Distribution by components

Count Component
164 100% Total
61 37.2% hotspot
16 9.8% hotspot/compiler
13 7.9% hotspot/jfr
12 7.3% hotspot/jvmti
10 6.1% hotspot/runtime
8 4.9% hotspot/gc
1 0.6% hotspot/svc-agent
1 0.6% hotspot/svc
55 33.5% core-libs
16 9.8% core-libs/java.lang.foreign
9 5.5% core-libs/java.lang
6 3.7% core-libs/java.nio
4 2.4% core-libs
4 2.4% core-libs/java.util:i18n
3 1.8% core-libs/java.util.jar
2 1.2% core-libs/java.lang:class_loading
2 1.2% core-libs/java.util:collections
1 0.6% core-libs/java.io:serialization
1 0.6% core-libs/java.util
1 0.6% core-libs/java.lang.invoke
1 0.6% core-libs/java.net
1 0.6% core-libs/javax.lang.model
1 0.6% core-libs/java.lang.module
1 0.6% core-libs/java.lang:reflect
1 0.6% core-libs/java.time
1 0.6% core-libs/javax.naming
23 14.0% tools
13 7.9% tools/javadoc(tool)
6 3.7% tools/javac
3 1.8% tools/jpackage
1 0.6% tools/jlink
6 3.7% client-libs
3 1.8% client-libs/2d
1 0.6% client-libs
1 0.6% client-libs/java.beans
1 0.6% client-libs/java.awt
6 3.7% xml
4 2.4% xml/jaxp
1 0.6% xml/javax.xml.validation
1 0.6% xml/org.w3c.dom
5 3.0% infrastructure
3 1.8% infrastructure/build
1 0.6% infrastructure/release_eng
1 0.6% infrastructure
4 2.4% core-svc
3 1.8% core-svc/debugger
1 0.6% core-svc/java.lang.management
2 1.2% security-libs
2 1.2% security-libs/javax.net.ssl
1 0.6% globalization
1 0.6% globalization/translation
1 0.6% release-team
1 0.6% release-team

Distribution by affiliation

This Release Pushes

Original Pushes

Count Committer
164 100% Total
136 82.9% Oracle
17 10.4% Daniel Daugherty
12 7.3% Maurizio Cimadamore
8 4.9% Alan Bateman
6 3.7% Brian Burkhalter
6 3.7% Joe Wang
5 3.0% Erik Gahlin
5 3.0% Jan Lahoda
5 3.0% Pavel Rappo
5 3.0% Robert Mckenna
5 3.0% Jonathan Gibbons
5 3.0% Jorn Vernee
4 2.4% Markus Grönlund
4 2.4% Thomas Schatzl
4 2.4% Serguei Spitsyn
3 1.8% Yoshiki Sato
3 1.8% Hannes Wallnoefer
3 1.8% David Holmes
3 1.8% Ron Pressler
3 1.8% Lance Andersen
3 1.8% Naoto Sato
2 1.2% Stuart Marks
2 1.2% Igor Veresov
2 1.2% Jaikiran Pai
2 1.2% Christian Hagedorn
2 1.2% Philip Race
2 1.2% Alexander Matveev
1 0.6% Emanuel Peter
1 0.6% Albert Yang
1 0.6% Alexey Semenyuk
1 0.6% Chris Plummer
1 0.6% Ioi Lam
1 0.6% Claes Redestad
1 0.6% Vladimir Kozlov
1 0.6% Tobias Hartmann
1 0.6% Joe Darcy
1 0.6% Abhishek Kumar
1 0.6% Dean Long
1 0.6% Alisen Chung
1 0.6% Mark Reinhold
1 0.6% Vladimir Ivanov
1 0.6% Raffaello Giulietti
11 6.7% SAP
5 3.0% Christoph Langer
2 1.2% Martin Doerr
2 1.2% Thomas Stuefe
1 0.6% Richard Reingruber
1 0.6% Matthias Baesken
7 4.3% Independent
3 1.8% georgeadams1995
2 1.2% Vladimir Kempik
1 0.6% Peter Levart
1 0.6% Zhengyu Gu
2 1.2% ARM
1 0.6% Pengfei Li
1 0.6% Xiaohong Gong
2 1.2% Intel
2 1.2% Jatin Bhateja
2 1.2% Red Hat
1 0.6% Aleksey Shipilev
1 0.6% Roland Westrelin
1 0.6% Amazon
1 0.6% Sergey Bylokhov
1 0.6% BellSoft
1 0.6% Boris Ulasevich
1 0.6% IBM
1 0.6% Tyler Steele
1 0.6% Loongson
1 0.6% Qi Ao
Count Committer
164 100% Total
140 85.4% Oracle
17 10.4% Daniel Daugherty
12 7.3% Maurizio Cimadamore
10 6.1% Alan Bateman
6 3.7% Brian Burkhalter
6 3.7% Joe Wang
5 3.0% Erik Gahlin
5 3.0% Jan Lahoda
5 3.0% Pavel Rappo
5 3.0% Jonathan Gibbons
5 3.0% Jorn Vernee
4 2.4% Markus Grönlund
4 2.4% Thomas Schatzl
4 2.4% Serguei Spitsyn
3 1.8% Yoshiki Sato
3 1.8% Magnus Ihse Bursie
3 1.8% Hannes Wallnoefer
3 1.8% David Holmes
3 1.8% Ron Pressler
3 1.8% Lance Andersen
3 1.8% Naoto Sato
2 1.2% Stuart Marks
2 1.2% Daniel Jelinski
2 1.2% Igor Veresov
2 1.2% Jaikiran Pai
2 1.2% Robert Mckenna
2 1.2% Christian Hagedorn
2 1.2% Philip Race
2 1.2% Alexander Matveev
1 0.6% Emanuel Peter
1 0.6% Albert Yang
1 0.6% Alexey Semenyuk
1 0.6% Chris Plummer
1 0.6% Ioi Lam
1 0.6% Claes Redestad
1 0.6% Vladimir Kozlov
1 0.6% Tobias Hartmann
1 0.6% Joe Darcy
1 0.6% Abhishek Kumar
1 0.6% Dean Long
1 0.6% Alisen Chung
1 0.6% Mark Reinhold
1 0.6% Vladimir Ivanov
1 0.6% Raffaello Giulietti
8 4.9% SAP
3 1.8% Thomas Stuefe
2 1.2% Martin Doerr
2 1.2% Matthias Baesken
1 0.6% Richard Reingruber
5 3.0% Independent
2 1.2% Peter Levart
1 0.6% georgeadams1995
1 0.6% Zhengyu Gu
1 0.6% Vladimir Kempik
2 1.2% ARM
1 0.6% Pengfei Li
1 0.6% Xiaohong Gong
2 1.2% Intel
2 1.2% Jatin Bhateja
2 1.2% Red Hat
1 0.6% Aleksey Shipilev
1 0.6% Roland Westrelin
1 0.6% Alibaba
1 0.6% Xiaolin Zheng
1 0.6% Amazon
1 0.6% Sergey Bylokhov
1 0.6% BellSoft
1 0.6% Boris Ulasevich
1 0.6% IBM
1 0.6% Tyler Steele
1 0.6% Loongson
1 0.6% Qi Ao

Chronological push log:

Days Ago This Release Push By Original Push By Bug Summary
Name Affiliation Name Affiliation
2 Jan Lahoda Oracle Jan Lahoda Oracle JDK-8294269 A false cyclic inheritance error reported
2 Jan Lahoda Oracle Jan Lahoda Oracle JDK-8294268 Duplicate ldc generated by javac
3 Vladimir Kempik Independent Xiaolin Zheng Alibaba JDK-8294243 RISC-V: Need to save and restore callee-saved FloatRegisters in StubGenerator::generate_call_stub
12 Robert Mckenna Oracle Alan Bateman Oracle JDK-8293699 jdk/internal/misc/TerminatingThreadLocal/TestTerminatingThreadLocal.java failed "AssertionError: Expected terminated values: [666] but got: []"
12 Robert Mckenna Oracle Peter Levart Independent JDK-8293689 TerminatingThreadLocal(s) not registered from virtual thread(s)
12 Robert Mckenna Oracle Alan Bateman Oracle JDK-8293688 CarrierThread.blocking not reset when spare not activated
13 Qi Ao Loongson Qi Ao Loongson JDK-8293670 java/beans/XMLDecoder/8028054/Task.java should use the 3-arg Class.forName
16 Yoshiki Sato Oracle Yoshiki Sato Oracle JDK-8293594 (tz) Update Timezone Data to 2022c
19 Thomas Schatzl Oracle Thomas Schatzl Oracle JDK-8293421 G1 remembered set memory footprint regression after JDK-8286115
20 Hannes Wallnoefer Oracle Hannes Wallnoefer Oracle JDK-8293180 JQuery UI license file not updated
30 Christoph Langer SAP Matthias Baesken SAP JDK-8292961 MetricsTesterCgroupV2.getLongValueEntryFromFile fails when named value doesn't exist
30 Christoph Langer SAP Daniel Jelinski Oracle JDK-8292960 javax/net/ssl/ServerName/SSLEngineExplorerMatchedSNI.java failed intermittently due to SSLException: Tag mismatch
30 Christoph Langer SAP Daniel Jelinski Oracle JDK-8292959 Tests fail with SSLProtocolException: Input record too big
37 Lance Andersen Oracle Lance Andersen Oracle JDK-8292487 Back out the fix forJDK-8281962 from jdk19u
44 Vladimir Kozlov Oracle Vladimir Kozlov Oracle JDK-8292503 [BACKOUT] JDK-8279219: [REDO] C2 crash when allocating array of size too large
46 Lance Andersen Oracle Lance Andersen Oracle JDK-8292502 Revert unintentional change to deflate.c
46 Thomas Schatzl Oracle Thomas Schatzl Oracle JDK-8292501 Allocating card table before heap causes underflow asserts in CardTable::addr_for()
47 Alisen Chung Oracle Alisen Chung Oracle JDK-8292500 JDK 19 RDP2 L10n resource files update - msgdrop 10
51 Alan Bateman Oracle Alan Bateman Oracle JDK-8292131 ThreadMXBean.getThread{Cpu,User}Time fails with -XX:-VMContinuations
52 Peter Levart Independent Peter Levart Independent JDK-8292129 java/io/ObjectStreamClass/ObjectStreamClassCaching.java fails with various GCs
52 Yoshiki Sato Oracle Yoshiki Sato Oracle JDK-8291894 System.loadLibrary does not work on Big Sur if JDK is built with macOS SDK 10.15 and earlier
52 Yoshiki Sato Oracle Yoshiki Sato Oracle JDK-8291892 Add legacy tz tests to OpenJDK
52 David Holmes Oracle David Holmes Oracle JDK-8292127 Remove EA from JDK 19 version string starting with Initial RC promotion B35 on August 11, 2022
53 Thomas Schatzl Oracle Thomas Schatzl Oracle JDK-8292125 Race freeing remembered set segments
54 Erik Gahlin Oracle Erik Gahlin Oracle JDK-8291724 jdk/jfr/event/runtime/TestClassLoaderStatsEvent.java Value not equal to 2, field='hiddenClassCount', value='0'
59 Mark Reinhold Oracle Mark Reinhold Oracle JDK-8291723 Snippetize modules API examples
60 Philip Race Oracle Philip Race Oracle JDK-8291339 Update FreeType to 2.12.1
60 georgeadams1995 Independent georgeadams1995 Independent JDK-8291330 Bump macOS GitHub actions to macOS 11
60 Maurizio Cimadamore Oracle Maurizio Cimadamore Oracle JDK-8291722 java/foreign/TestUnsupportedPlatform fails after JDK-8290455
62 Maurizio Cimadamore Oracle Maurizio Cimadamore Oracle JDK-8291329 jck test api/java_lang/foreign/VaList/Empty.html fails on some platforms
65 Christoph Langer SAP Thomas Stuefe SAP JDK-8291328 Alpine: disable some panama tests that rely on std::thread
67 David Holmes Oracle David Holmes Oracle JDK-8291327 Test jdk/javadoc/tool/CheckManPageOptions.java after manpage update
67 David Holmes Oracle David Holmes Oracle JDK-8291089 Update nroff pages in JDK 19 before RC
68 Maurizio Cimadamore Oracle Maurizio Cimadamore Oracle JDK-8291324 Typo in javadoc of MemorySegment/MemoryAddress
68 Markus Grönlund Oracle Markus Grönlund Oracle JDK-8291323 JFR: Cannot resolve method
68 Ioi Lam Oracle Ioi Lam Oracle JDK-8291321 CDS cannot archive lamda proxy with useImplMethodHandle
69 Pengfei Li ARM Pengfei Li ARM JDK-8291319 C2: Assert failed in PhaseCFG::verify() after JDK-8183390
69 Roland Westrelin Red Hat Roland Westrelin Red Hat JDK-8291317 Apache Lucene triggers: DEBUG MESSAGE: duplicated predicate failed which is impossible
70 georgeadams1995 Independent Magnus Ihse Bursie Oracle JDK-8290409 Restore cancel-in-progress in GHA
70 georgeadams1995 Independent Magnus Ihse Bursie Oracle JDK-8290405 Rewrite of GitHub Actions (GHA) sanity tests
72 Philip Race Oracle Philip Race Oracle JDK-8290392 Update HarfBuzz to 4.4.1
73 Pavel Rappo Oracle Pavel Rappo Oracle JDK-8291315 Bad result for the snippet @link tag if substring/regex consists of whitespace
73 Zhengyu Gu Independent Zhengyu Gu Independent JDK-8291313 Shenandoah: disable Loom for iu mode
73 Brian Burkhalter Oracle Brian Burkhalter Oracle JDK-8291311 Add TEST.properties to java/nio/channels/FileChannel and move tests out of largeMemory sub-dir
74 Jatin Bhateja Intel Jatin Bhateja Intel JDK-8291309 C2: Error: ShouldNotReachHere() in Type::typerr()
74 Joe Wang Oracle Joe Wang Oracle JDK-8291307 jcup.md missing additional text
74 Joe Wang Oracle Joe Wang Oracle JDK-8291305 Missing notice in dom.md
75 Daniel Daugherty Oracle Daniel Daugherty Oracle JDK-8291303 ProblemList vmTestbase/nsk/jvmti/scenarios/capability/CM03/cm03t001/TestDescription.java on linux-all
75 Daniel Daugherty Oracle Daniel Daugherty Oracle JDK-8291300 ProblemList com/sun/jdi/InvokeHangTest.java on macosx-x64 in vthread mode
75 Brian Burkhalter Oracle Brian Burkhalter Oracle JDK-8291299 java/nio/channels/FileChannel/largeMemory/LargeGatheringWrite.java timed out
75 Alan Bateman Oracle Alan Bateman Oracle JDK-8291298 Improve Thread description of inherited AccessControlContext
75 Maurizio Cimadamore Oracle Maurizio Cimadamore Oracle JDK-8291297 SegmentAllocator:allocateArray(MemoryLayout, count) does not throw IAEx when count is -1
75 Maurizio Cimadamore Oracle Maurizio Cimadamore Oracle JDK-8291296 Javadoc for MemorySegment/MemoryAddress getter/setters contains some typos
75 Maurizio Cimadamore Oracle Maurizio Cimadamore Oracle JDK-8291295 SegmentAllocator:allocate() can return null some cases
75 Jorn Vernee Oracle Jorn Vernee Oracle JDK-8291294 j.l.foreign.VaList::skip call could throw java.lang.IndexOutOfBoundsException: Out of bound access on segment
75 Jorn Vernee Oracle Jorn Vernee Oracle JDK-8291293 Specification of method j.l.foreign.VaList::skip deserves clarification
75 Jorn Vernee Oracle Jorn Vernee Oracle JDK-8291292 j.l.foreign.VaList::nextVarg call could throw IndexOutOfBoundsException or even crash the VM
76 Serguei Spitsyn Oracle Serguei Spitsyn Oracle JDK-8291291 fatal error: stuck in JvmtiVTMSTransitionDisabler::disable_VTMS_transitions
76 Christoph Langer SAP Magnus Ihse Bursie Oracle JDK-8291290 UnreadableRB case in MissingResourceCauseTest is not working reliably on Windows
76 Pavel Rappo Oracle Pavel Rappo Oracle JDK-8291088 Using @inheritDoc in an inapplicable context shouldn't crash javadoc
76 Maurizio Cimadamore Oracle Maurizio Cimadamore Oracle JDK-8291255 Revisit implementation of memory session
76 Martin Doerr SAP Martin Doerr SAP JDK-8291254 [PPC64] JfrGetCallTrace: assert(_pc != nullptr) failed: must have PC
76 Markus Grönlund Oracle Markus Grönlund Oracle JDK-8291253 JFR: Thread checkpoint no longer enforce mutual exclusion post Loom integration
76 Jan Lahoda Oracle Jan Lahoda Oracle JDK-8291252 A NullPointerException thrown from guard expression
76 Albert Yang Oracle Albert Yang Oracle JDK-8291251 G1: Incorrect verification logic in G1ConcurrentMark::clear_next_bitmap
79 Joe Wang Oracle Joe Wang Oracle JDK-8291250 Update java.xml module-info
79 Daniel Daugherty Oracle Daniel Daugherty Oracle JDK-8291249 ProblemList serviceability/jvmti/GetLocalVariable/GetLocalWithoutSuspendTest.java on windows-x64 in -Xcomp mode
79 Vladimir Kempik Independent Vladimir Kempik Independent JDK-8291248 buffer overflow in MTLVertexCache.m: MTLVertexCache_AddGlyphQuad
79 Stuart Marks Oracle Stuart Marks Oracle JDK-8291247 wrong wording in @param doc for HashMap.newHashMap et. al.
79 Jorn Vernee Oracle Jorn Vernee Oracle JDK-8291246 SegmentAllocator::allocateUtf8String(String str) should be clarified for strings containing \0
79 Jorn Vernee Oracle Jorn Vernee Oracle JDK-8291245 Canonicalize header ids in foreign API javadocs
79 Thomas Stuefe SAP Thomas Stuefe SAP JDK-8291244 Build warning in methodData.cpp memset zero-length parameter
80 Alexander Matveev Oracle Alexander Matveev Oracle JDK-8291243 [macos] app image signature invalid when creating DMG or PKG
80 Daniel Daugherty Oracle Daniel Daugherty Oracle JDK-8291241 ProblemList jdk/jfr/api/consumer/TestRecordingFileWrite.java on linux-x64 and macosx-x64
80 Brian Burkhalter Oracle Brian Burkhalter Oracle JDK-8291236 java/nio/channels/FileChannel/MapTest.java times out
80 Brian Burkhalter Oracle Brian Burkhalter Oracle JDK-8291235 Test java/nio/channels/FileChannel/LargeGatheringWrite.java times out
80 Joe Wang Oracle Joe Wang Oracle JDK-8291086 Improve XSLT XPath operators count efficiency
80 Stuart Marks Oracle Stuart Marks Oracle JDK-8291234 Map::replaceAll javadoc has redundant @throws clauses
80 Maurizio Cimadamore Oracle Maurizio Cimadamore Oracle JDK-8291233 Need spec clarification of j.l.foreign.*Layout
80 Jan Lahoda Oracle Jan Lahoda Oracle JDK-8291232 Pattern domination not working properly for record patterns
81 Pavel Rappo Oracle Pavel Rappo Oracle JDK-8291231 {@inheritDoc} only copies one instance of the specified exception
81 Ron Pressler Oracle Ron Pressler Oracle JDK-8291230 serviceability/jvmti/vthread/ContStackDepthTest/ContStackDepthTest.java failing
81 Daniel Daugherty Oracle Daniel Daugherty Oracle JDK-8291229 ProblemList jdk/jfr/event/runtime/TestActiveSettingEvent.java
81 Daniel Daugherty Oracle Daniel Daugherty Oracle JDK-8291228 ProblemList vmTestbase/nsk/jdwp/ThreadReference/ForceEarlyReturn/forceEarlyReturn002/forceEarlyReturn002.java when run with vthread wrapper
81 Daniel Daugherty Oracle Daniel Daugherty Oracle JDK-8291227 ProblemList vmTestbase/gc/gctests/MemoryEaterMT/MemoryEaterMT.java with ZGC on windows
81 Thomas Stuefe SAP Thomas Stuefe SAP JDK-8291225 Memory corruption with CPU_ALLOC, CPU_FREE on muslc
81 Alan Bateman Oracle Alan Bateman Oracle JDK-8291224 Clarify relationship between ThreadStart/ThreadEnd and can_support_virtual_threads capability
82 Tyler Steele IBM Tyler Steele IBM JDK-8291223 S390X: Fix crashes after JDK-8284161 (Virtual Threads)
82 Daniel Daugherty Oracle Daniel Daugherty Oracle JDK-8291222 move oop safety check from SharedRuntime::get_java_tid() to JavaThread::threadObj()
82 Chris Plummer Oracle Chris Plummer Oracle JDK-8291221 Fatal Error when suspending virtual thread after it has terminated
83 Pavel Rappo Oracle Pavel Rappo Oracle JDK-8291220 Incorrect HTML generation for copied javadoc with multiple @throws tags
83 Matthias Baesken SAP Matthias Baesken SAP JDK-8291219 [test] java/lang/ProcessBuilder/Basic.java fails on Alpine/musl
83 Jatin Bhateja Intel Jatin Bhateja Intel JDK-8291218 C2 crash: assert(t->meet(t0) == t) failed: Not monotonic
84 Erik Gahlin Oracle Erik Gahlin Oracle JDK-8291217 jdk.jfr.consumer.RecordedThread.getId references Thread::getId, should be Thread::threadId
85 Serguei Spitsyn Oracle Serguei Spitsyn Oracle JDK-8291216 JVMTI SelfSuspendDisablerTest.java failed with RuntimeException: Test FAILED: Unexpected thread state
85 Igor Veresov Oracle Igor Veresov Oracle JDK-8291080 -Xcomp is missing from java launcher documentation
85 Serguei Spitsyn Oracle Serguei Spitsyn Oracle JDK-8291215 GetThreadState returns 0 for virtual thread that has terminated
86 Sergey Bylokhov Amazon Sergey Bylokhov Amazon JDK-8291214 getLocalGraphicsEnvironment() on for multi-screen setups throws exception NPE
86 Vladimir Ivanov Oracle Vladimir Ivanov Oracle JDK-8291213 C2: Loop opts are missing during OSR compilation
86 Maurizio Cimadamore Oracle Maurizio Cimadamore Oracle JDK-8291212 SegmentAllocator:allocateUtf8String(String str) default behavior mismatch to spec
86 Daniel Daugherty Oracle Daniel Daugherty Oracle JDK-8291211 ProblemList sun/tools/jhsdb/JStackStressTest.java on linux-aarch64
86 Naoto Sato Oracle Naoto Sato Oracle JDK-8290772 ISO 4217 Amendment 172 Update
86 Tobias Hartmann Oracle Tobias Hartmann Oracle JDK-8291210 Unreachable loop is not removed from C2 IR, leading to a broken graph
87 Alan Bateman Oracle Alan Bateman Oracle JDK-8291208 Suspend/ResumeAllVirtualThreads need both can_suspend and can_support_virtual_threads
88 Naoto Sato Oracle Naoto Sato Oracle JDK-8291207 Recommend Locale.of() method instead of the constructor
88 Raffaello Giulietti Oracle Raffaello Giulietti Oracle JDK-8291206 Random:from() adapter does not delegate to supplied generator in all cases
89 Joe Darcy Oracle Joe Darcy Oracle JDK-8291205 Update SourceVersion to use snippets
89 Daniel Daugherty Oracle Daniel Daugherty Oracle JDK-8291204 ProblemList jdk/jfr/api/consumer/recordingstream/TestOnEvent.java on linux-x64 again
89 Igor Veresov Oracle Igor Veresov Oracle JDK-8291202 Very slow C1 arraycopy jcstress tests after JDK-8279886
89 Jonathan Gibbons Oracle Jonathan Gibbons Oracle JDK-8291200 Broken links on constant-values page
89 Jonathan Gibbons Oracle Jonathan Gibbons Oracle JDK-8291197 Bogus warning generated for record with compact constructor
89 Brian Burkhalter Oracle Brian Burkhalter Oracle JDK-8291195 (fs) Files.writeString spec for IOException has "specified charset" when no charset is provided
89 Claes Redestad Oracle Claes Redestad Oracle JDK-8291194 Footprint regression due MH creation when initializing StringConcatFactory
89 Maurizio Cimadamore Oracle Maurizio Cimadamore Oracle JDK-8291193 SegmentAllocator::allocateArray null handling is too lax
89 Dean Long Oracle Dean Long Oracle JDK-8291191 AArch64: C2 compilation fails with guarantee(!true || (true && (shift != 0))) failed: impossible encoding
90 Daniel Daugherty Oracle Daniel Daugherty Oracle JDK-8291190 ProblemList java/lang/ref/OOMEInReferenceHandler.java
90 Pavel Rappo Oracle Pavel Rappo Oracle JDK-8291074 Allow @systemProperty to appear in overview documentation
90 Daniel Daugherty Oracle Daniel Daugherty Oracle JDK-8291188 ProblemList java/lang/reflect/callerCache/ReflectionCallerCacheTest.java in -Xcomp mode
90 Daniel Daugherty Oracle Daniel Daugherty Oracle JDK-8291186 ProblemList vmTestbase/nsk/jdi/ClassType/invokeMethod/invokemethod011/TestDescription.java when run with vthread wrapper
90 Jonathan Gibbons Oracle Jonathan Gibbons Oracle JDK-8291076 Document set of strings javac recognizes for SuppressWarnings
90 Maurizio Cimadamore Oracle Maurizio Cimadamore Oracle JDK-8291160 SegmentAllocator:allocateArray(*) default behavior mismatch to spec
90 Thomas Schatzl Oracle Thomas Schatzl Oracle JDK-8291159 BlockLocationPrinter fails to decode addresses with G1
90 Christian Hagedorn Oracle Christian Hagedorn Oracle JDK-8291158 C2: And node gets wrong type due to not adding it back to the worklist in CCP
90 Alan Bateman Oracle Alan Bateman Oracle JDK-8291152 java/lang/Thread/jni/AttachCurrentThread/AttachTest.java#id1 failed with "RuntimeException: Test failed"
92 Jaikiran Pai Oracle Jaikiran Pai Oracle JDK-8291151 tools/jlink/plugins/CompressorPluginTest.java test failing
92 Jaikiran Pai Oracle Jaikiran Pai Oracle JDK-8291150 broken link in com.sun.net.httpserver.SimpleFileServer
93 Boris Ulasevich BellSoft Boris Ulasevich BellSoft JDK-8291149 ARM32: missing LIR_Assembler::cmove metadata type support
93 Jan Lahoda Oracle Jan Lahoda Oracle JDK-8291148 VerifyError with JEP 405 pattern match
93 Abhishek Kumar Oracle Abhishek Kumar Oracle JDK-8291147 broken links in java.desktop
94 Brian Burkhalter Oracle Brian Burkhalter Oracle JDK-8291146 (fc) FileChannel::map for MemorySegments should state it always throws UOE
94 Joe Wang Oracle Joe Wang Oracle JDK-8291145 Document.normalizeDocument() produces different results
94 Naoto Sato Oracle Naoto Sato Oracle JDK-8291144 Files.readString ignores encoding errors for UTF-16
94 Serguei Spitsyn Oracle Serguei Spitsyn Oracle JDK-8291143 serviceability/jvmti/vthread/GetSetLocalTest failed with assert: Not supported for heap frames
94 Richard Reingruber SAP Richard Reingruber SAP JDK-8291142 C1: LIR_OpVisitState::maxNumberOfOperands too small
95 Daniel Daugherty Oracle Daniel Daugherty Oracle JDK-8291141 ProblemList serviceability/jvmti/vthread/ContStackDepthTest/ContStackDepthTest.java in -Xcomp mode
95 Markus Grönlund Oracle Markus Grönlund Oracle JDK-8291140 misc tests fail "assert(ms < 1000) failed: Un-interruptable sleep, short time use only"
95 Alan Bateman Oracle Alan Bateman Oracle JDK-8291137 StructureViolationException should not link to fork method
95 Alan Bateman Oracle Alan Bateman Oracle JDK-8291135 Concurrent implicit attach from native threads crashes VM
95 Joe Wang Oracle Joe Wang Oracle JDK-8291133 broken link in java.xml
96 Robert Mckenna Oracle Robert Mckenna Oracle JDK-8288929 jtreg test com/sun/jndi/ldap/LdapPoolTimeoutTest.java fails intermittently in nightly run
96 Alexander Matveev Oracle Alexander Matveev Oracle JDK-8291132 Throw exception for missing values in .jpackage.xml
96 Maurizio Cimadamore Oracle Maurizio Cimadamore Oracle JDK-8291131 SegmentAllocator:allocate(long bytesSize) not throwing IAEx when bytesSize < 0
96 Aleksey Shipilev Red Hat Aleksey Shipilev Red Hat JDK-8291130 GCC 12 fails to build zReferenceProcessor.cpp
96 Ron Pressler Oracle Ron Pressler Oracle JDK-8291129 VThreadMonitorTest fails "assert(!current->cont_fastpath() || (current->cont_fastpath_thread_state() && !interpreted_native_or_deoptimized_on_stack(current))) failed"
96 Ron Pressler Oracle Ron Pressler Oracle JDK-8291127 serviceability/jvmti/vthread/ContStackDepthTest/ContStackDepthTest.java failing in loom repo with Xcomp
96 Daniel Daugherty Oracle Daniel Daugherty Oracle JDK-8291126 additional review changes for JDK-8286830
96 Daniel Daugherty Oracle Daniel Daugherty Oracle JDK-8291125 JavaThread touches oop after GC barrier is detached
96 Daniel Daugherty Oracle Daniel Daugherty Oracle JDK-8291124 add support for JavaThread::is_oop_safe()
96 Hannes Wallnoefer Oracle Hannes Wallnoefer Oracle JDK-8291120 Empty spans in mobile navigation markup
96 Emanuel Peter Oracle Emanuel Peter Oracle JDK-8291119 remove memory_operand assert for spilled instructions
96 Hannes Wallnoefer Oracle Hannes Wallnoefer Oracle JDK-8291108 Problematic fix for font boosting
97 Lance Andersen Oracle Lance Andersen Oracle JDK-8291107 broken link in java.base/java/util/zip/package-summary.html
97 Erik Gahlin Oracle Erik Gahlin Oracle JDK-8291104 JFR: Change package name of snippet files
97 Markus Grönlund Oracle Markus Grönlund Oracle JDK-8291103 JFR: Disabling the JfrThreadSampler commits only a partially disabled state
97 Erik Gahlin Oracle Erik Gahlin Oracle JDK-8291102 JFR: Incorrect error message when starting recording with missing .jfc file
97 Martin Doerr SAP Martin Doerr SAP JDK-8291100 jni/nullCaller/NullCallerTest.java failing (ppc64)
97 Christian Hagedorn Oracle Christian Hagedorn Oracle JDK-8291099 C2: LShiftLNode::Ideal produces wrong result after JDK-8278114
98 Xiaohong Gong ARM Xiaohong Gong ARM JDK-8291097 AArch64: Fix register issues in SVE backend match rules
100 Jonathan Gibbons Oracle Jonathan Gibbons Oracle JDK-8291095 jdk/javadoc/doclet/testTagMisuse/TestTagMisuse.java fails after JDK-8288545
100 Erik Gahlin Oracle Erik Gahlin Oracle JDK-8291094 15% increase in JFR footprint in Noop-Base
100 Jonathan Gibbons Oracle Jonathan Gibbons Oracle JDK-8291093 Missing space in error message
100 Robert Mckenna Oracle Robert Mckenna Oracle JDK-8288653 Bump version numbers for 19.0.1
100 Alan Bateman Oracle Alan Bateman Oracle JDK-8291071 Add JNI_VERSION_19 to jni.h and JNI spec
101 Alexey Semenyuk Oracle Alexey Semenyuk Oracle JDK-8291090 jpackage tests failing on Windows due to powershell issue

No changesets log

JDK-8291079 14.11.1: Typo in grammar for guarded pattern
JDK-8291075 Reconcile specification and implementation of link parsing
JDK-8291073 Add an anchor to each option on javadoc man page
JDK-8291072 broken link in specs/index.html
JDK-8289495 com/sun/management/OperatingSystemMXBean/TestTotalSwap.java: Expected total swap size ... but getTotalSwapSpaceSize returned ...

Committer push log

Abhishek Kumar, Oracle

Bug Summary
JDK-8291147 broken links in java.desktop

Alisen Chung, Oracle

Bug Summary
JDK-8292500 JDK 19 RDP2 L10n resource files update - msgdrop 10

Alan Bateman, Oracle

Bug Summary
JDK-8291071 Add JNI_VERSION_19 to jni.h and JNI spec
JDK-8291224 Clarify relationship between ThreadStart/ThreadEnd and can_support_virtual_threads capability
JDK-8291135 Concurrent implicit attach from native threads crashes VM
JDK-8291298 Improve Thread description of inherited AccessControlContext
JDK-8291152 java/lang/Thread/jni/AttachCurrentThread/AttachTest.java#id1 failed with "RuntimeException: Test failed"
JDK-8291137 StructureViolationException should not link to fork method
JDK-8291208 Suspend/ResumeAllVirtualThreads need both can_suspend and can_support_virtual_threads
JDK-8292131 ThreadMXBean.getThread{Cpu,User}Time fails with -XX:-VMContinuations

Alexander Matveev, Oracle

Bug Summary
JDK-8291243 [macos] app image signature invalid when creating DMG or PKG
JDK-8291132 Throw exception for missing values in .jpackage.xml

Qi Ao, Loongson

Bug Summary
JDK-8293670 java/beans/XMLDecoder/8028054/Task.java should use the 3-arg Class.forName

Alexey Semenyuk, Oracle

Bug Summary
JDK-8291090 jpackage tests failing on Windows due to powershell issue

Albert Yang, Oracle

Bug Summary
JDK-8291251 G1: Incorrect verification logic in G1ConcurrentMark::clear_next_bitmap

Brian Burkhalter, Oracle

Bug Summary
JDK-8291146 (fc) FileChannel::map for MemorySegments should state it always throws UOE
JDK-8291195 (fs) Files.writeString spec for IOException has "specified charset" when no charset is provided
JDK-8291311 Add TEST.properties to java/nio/channels/FileChannel and move tests out of largeMemory sub-dir
JDK-8291299 java/nio/channels/FileChannel/largeMemory/LargeGatheringWrite.java timed out
JDK-8291236 java/nio/channels/FileChannel/MapTest.java times out
JDK-8291235 Test java/nio/channels/FileChannel/LargeGatheringWrite.java times out

Boris Ulasevich, BellSoft

Bug Summary
JDK-8291149 ARM32: missing LIR_Assembler::cmove metadata type support

Christian Hagedorn, Oracle

Bug Summary
JDK-8291158 C2: And node gets wrong type due to not adding it back to the worklist in CCP
JDK-8291099 C2: LShiftLNode::Ideal produces wrong result after JDK-8278114

Chris Plummer, Oracle

Bug Summary
JDK-8291221 Fatal Error when suspending virtual thread after it has terminated

Christoph Langer, SAP

Bug Summary
JDK-8291328 Alpine: disable some panama tests that rely on std::thread
JDK-8292960 javax/net/ssl/ServerName/SSLEngineExplorerMatchedSNI.java failed intermittently due to SSLException: Tag mismatch
JDK-8292961 MetricsTesterCgroupV2.getLongValueEntryFromFile fails when named value doesn't exist
JDK-8292959 Tests fail with SSLProtocolException: Input record too big
JDK-8291290 UnreadableRB case in MissingResourceCauseTest is not working reliably on Windows

Joe Darcy, Oracle

Bug Summary
JDK-8291205 Update SourceVersion to use snippets

Daniel Daugherty, Oracle

Bug Summary
JDK-8291124 add support for JavaThread::is_oop_safe()
JDK-8291126 additional review changes for JDK-8286830
JDK-8291125 JavaThread touches oop after GC barrier is detached
JDK-8291222 move oop safety check from SharedRuntime::get_java_tid() to JavaThread::threadObj()
JDK-8291300 ProblemList com/sun/jdi/InvokeHangTest.java on macosx-x64 in vthread mode
JDK-8291190 ProblemList java/lang/ref/OOMEInReferenceHandler.java
JDK-8291188 ProblemList java/lang/reflect/callerCache/ReflectionCallerCacheTest.java in -Xcomp mode
JDK-8291204 ProblemList jdk/jfr/api/consumer/recordingstream/TestOnEvent.java on linux-x64 again
JDK-8291241 ProblemList jdk/jfr/api/consumer/TestRecordingFileWrite.java on linux-x64 and macosx-x64
JDK-8291229 ProblemList jdk/jfr/event/runtime/TestActiveSettingEvent.java
JDK-8291249 ProblemList serviceability/jvmti/GetLocalVariable/GetLocalWithoutSuspendTest.java on windows-x64 in -Xcomp mode
JDK-8291141 ProblemList serviceability/jvmti/vthread/ContStackDepthTest/ContStackDepthTest.java in -Xcomp mode
JDK-8291211 ProblemList sun/tools/jhsdb/JStackStressTest.java on linux-aarch64
JDK-8291227 ProblemList vmTestbase/gc/gctests/MemoryEaterMT/MemoryEaterMT.java with ZGC on windows
JDK-8291186 ProblemList vmTestbase/nsk/jdi/ClassType/invokeMethod/invokemethod011/TestDescription.java when run with vthread wrapper
JDK-8291228 ProblemList vmTestbase/nsk/jdwp/ThreadReference/ForceEarlyReturn/forceEarlyReturn002/forceEarlyReturn002.java when run with vthread wrapper
JDK-8291303 ProblemList vmTestbase/nsk/jvmti/scenarios/capability/CM03/cm03t001/TestDescription.java on linux-all

David Holmes, Oracle

Bug Summary
JDK-8292127 Remove EA from JDK 19 version string starting with Initial RC promotion B35 on August 11, 2022
JDK-8291327 Test jdk/javadoc/tool/CheckManPageOptions.java after manpage update
JDK-8291089 Update nroff pages in JDK 19 before RC

Dean Long, Oracle

Bug Summary
JDK-8291191 AArch64: C2 compilation fails with guarantee(!true || (true && (shift != 0))) failed: impossible encoding

Erik Gahlin, Oracle

Bug Summary
JDK-8291094 15% increase in JFR footprint in Noop-Base
JDK-8291217 jdk.jfr.consumer.RecordedThread.getId references Thread::getId, should be Thread::threadId
JDK-8291724 jdk/jfr/event/runtime/TestClassLoaderStatsEvent.java Value not equal to 2, field='hiddenClassCount', value='0'
JDK-8291104 JFR: Change package name of snippet files
JDK-8291102 JFR: Incorrect error message when starting recording with missing .jfc file

Emanuel Peter, Oracle

Bug Summary
JDK-8291119 remove memory_operand assert for spilled instructions

georgeadams1995, Independent

Bug Summary
JDK-8291330 Bump macOS GitHub actions to macOS 11
JDK-8290409 Restore cancel-in-progress in GHA
JDK-8290405 Rewrite of GitHub Actions (GHA) sanity tests

Hannes Wallnoefer, Oracle

Bug Summary
JDK-8291120 Empty spans in mobile navigation markup
JDK-8293180 JQuery UI license file not updated
JDK-8291108 Problematic fix for font boosting

Ioi Lam, Oracle

Bug Summary
JDK-8291321 CDS cannot archive lamda proxy with useImplMethodHandle

Igor Veresov, Oracle

Bug Summary
JDK-8291080 -Xcomp is missing from java launcher documentation
JDK-8291202 Very slow C1 arraycopy jcstress tests after JDK-8279886

Jatin Bhateja, Intel

Bug Summary
JDK-8291218 C2 crash: assert(t->meet(t0) == t) failed: Not monotonic
JDK-8291309 C2: Error: ShouldNotReachHere() in Type::typerr()

Jonathan Gibbons, Oracle

Bug Summary
JDK-8291197 Bogus warning generated for record with compact constructor
JDK-8291200 Broken links on constant-values page
JDK-8291076 Document set of strings javac recognizes for SuppressWarnings
JDK-8291095 jdk/javadoc/doclet/testTagMisuse/TestTagMisuse.java fails after JDK-8288545
JDK-8291093 Missing space in error message

Jan Lahoda, Oracle

Bug Summary
JDK-8294269 A false cyclic inheritance error reported
JDK-8291252 A NullPointerException thrown from guard expression
JDK-8294268 Duplicate ldc generated by javac
JDK-8291232 Pattern domination not working properly for record patterns
JDK-8291148 VerifyError with JEP 405 pattern match

Joe Wang, Oracle

Bug Summary
JDK-8291133 broken link in java.xml
JDK-8291145 Document.normalizeDocument() produces different results
JDK-8291086 Improve XSLT XPath operators count efficiency
JDK-8291307 jcup.md missing additional text
JDK-8291305 Missing notice in dom.md
JDK-8291250 Update java.xml module-info

Jaikiran Pai, Oracle

Bug Summary
JDK-8291150 broken link in com.sun.net.httpserver.SimpleFileServer
JDK-8291151 tools/jlink/plugins/CompressorPluginTest.java test failing

Jorn Vernee, Oracle

Bug Summary
JDK-8291245 Canonicalize header ids in foreign API javadocs
JDK-8291292 j.l.foreign.VaList::nextVarg call could throw IndexOutOfBoundsException or even crash the VM
JDK-8291294 j.l.foreign.VaList::skip call could throw java.lang.IndexOutOfBoundsException: Out of bound access on segment
JDK-8291246 SegmentAllocator::allocateUtf8String(String str) should be clarified for strings containing \0
JDK-8291293 Specification of method j.l.foreign.VaList::skip deserves clarification

Vladimir Kozlov, Oracle

Bug Summary
JDK-8292503 [BACKOUT] JDK-8279219: [REDO] C2 crash when allocating array of size too large

Lance Andersen, Oracle

Bug Summary
JDK-8292487 Back out the fix forJDK-8281962 from jdk19u
JDK-8291107 broken link in java.base/java/util/zip/package-summary.html
JDK-8292502 Revert unintentional change to deflate.c

Matthias Baesken, SAP

Bug Summary
JDK-8291219 [test] java/lang/ProcessBuilder/Basic.java fails on Alpine/musl

Maurizio Cimadamore, Oracle

Bug Summary
JDK-8291722 java/foreign/TestUnsupportedPlatform fails after JDK-8290455
JDK-8291296 Javadoc for MemorySegment/MemoryAddress getter/setters contains some typos
JDK-8291329 jck test api/java_lang/foreign/VaList/Empty.html fails on some platforms
JDK-8291233 Need spec clarification of j.l.foreign.*Layout
JDK-8291255 Revisit implementation of memory session
JDK-8291193 SegmentAllocator::allocateArray null handling is too lax
JDK-8291295 SegmentAllocator:allocate() can return null some cases
JDK-8291131 SegmentAllocator:allocate(long bytesSize) not throwing IAEx when bytesSize < 0
JDK-8291160 SegmentAllocator:allocateArray(*) default behavior mismatch to spec
JDK-8291297 SegmentAllocator:allocateArray(MemoryLayout, count) does not throw IAEx when count is -1
JDK-8291212 SegmentAllocator:allocateUtf8String(String str) default behavior mismatch to spec
JDK-8291324 Typo in javadoc of MemorySegment/MemoryAddress

Martin Doerr, SAP

Bug Summary
JDK-8291254 [PPC64] JfrGetCallTrace: assert(_pc != nullptr) failed: must have PC
JDK-8291100 jni/nullCaller/NullCallerTest.java failing (ppc64)

Markus Grönlund, Oracle

Bug Summary
JDK-8291323 JFR: Cannot resolve method
JDK-8291103 JFR: Disabling the JfrThreadSampler commits only a partially disabled state
JDK-8291253 JFR: Thread checkpoint no longer enforce mutual exclusion post Loom integration
JDK-8291140 misc tests fail "assert(ms < 1000) failed: Un-interruptable sleep, short time use only"

Mark Reinhold, Oracle

Bug Summary
JDK-8291723 Snippetize modules API examples

Naoto Sato, Oracle

Bug Summary
JDK-8291144 Files.readString ignores encoding errors for UTF-16
JDK-8290772 ISO 4217 Amendment 172 Update
JDK-8291207 Recommend Locale.of() method instead of the constructor

Peter Levart, Independent

Bug Summary
JDK-8292129 java/io/ObjectStreamClass/ObjectStreamClassCaching.java fails with various GCs

Pengfei Li, ARM

Bug Summary
JDK-8291319 C2: Assert failed in PhaseCFG::verify() after JDK-8183390

Pavel Rappo, Oracle

Bug Summary
JDK-8291074 Allow @systemProperty to appear in overview documentation
JDK-8291315 Bad result for the snippet @link tag if substring/regex consists of whitespace
JDK-8291220 Incorrect HTML generation for copied javadoc with multiple @throws tags
JDK-8291088 Using @inheritDoc in an inapplicable context shouldn't crash javadoc
JDK-8291231 {@inheritDoc} only copies one instance of the specified exception

Philip Race, Oracle

Bug Summary
JDK-8291339 Update FreeType to 2.12.1
JDK-8290392 Update HarfBuzz to 4.4.1

Claes Redestad, Oracle

Bug Summary
JDK-8291194 Footprint regression due MH creation when initializing StringConcatFactory

Raffaello Giulietti, Oracle

Bug Summary
JDK-8291206 Random:from() adapter does not delegate to supplied generator in all cases

Robert Mckenna, Oracle

Bug Summary
JDK-8288653 Bump version numbers for 19.0.1
JDK-8293688 CarrierThread.blocking not reset when spare not activated
JDK-8293699 jdk/internal/misc/TerminatingThreadLocal/TestTerminatingThreadLocal.java failed "AssertionError: Expected terminated values: [666] but got: []"
JDK-8288929 jtreg test com/sun/jndi/ldap/LdapPoolTimeoutTest.java fails intermittently in nightly run
JDK-8293689 TerminatingThreadLocal(s) not registered from virtual thread(s)

Roland Westrelin, Red Hat

Bug Summary
JDK-8291317 Apache Lucene triggers: DEBUG MESSAGE: duplicated predicate failed which is impossible

Ron Pressler, Oracle

Bug Summary
JDK-8291230 serviceability/jvmti/vthread/ContStackDepthTest/ContStackDepthTest.java failing
JDK-8291127 serviceability/jvmti/vthread/ContStackDepthTest/ContStackDepthTest.java failing in loom repo with Xcomp
JDK-8291129 VThreadMonitorTest fails "assert(!current->cont_fastpath() || (current->cont_fastpath_thread_state() && !interpreted_native_or_deoptimized_on_stack(current))) failed"

Richard Reingruber, SAP

Bug Summary
JDK-8291142 C1: LIR_OpVisitState::maxNumberOfOperands too small

Sergey Bylokhov, Amazon

Bug Summary
JDK-8291214 getLocalGraphicsEnvironment() on for multi-screen setups throws exception NPE

Aleksey Shipilev, Red Hat

Bug Summary
JDK-8291130 GCC 12 fails to build zReferenceProcessor.cpp

Stuart Marks, Oracle

Bug Summary
JDK-8291234 Map::replaceAll javadoc has redundant @throws clauses
JDK-8291247 wrong wording in @param doc for HashMap.newHashMap et. al.

Serguei Spitsyn, Oracle

Bug Summary
JDK-8291291 fatal error: stuck in JvmtiVTMSTransitionDisabler::disable_VTMS_transitions
JDK-8291215 GetThreadState returns 0 for virtual thread that has terminated
JDK-8291216 JVMTI SelfSuspendDisablerTest.java failed with RuntimeException: Test FAILED: Unexpected thread state
JDK-8291143 serviceability/jvmti/vthread/GetSetLocalTest failed with assert: Not supported for heap frames

Thomas Stuefe, SAP

Bug Summary
JDK-8291244 Build warning in methodData.cpp memset zero-length parameter
JDK-8291225 Memory corruption with CPU_ALLOC, CPU_FREE on muslc

Tobias Hartmann, Oracle

Bug Summary
JDK-8291210 Unreachable loop is not removed from C2 IR, leading to a broken graph

Thomas Schatzl, Oracle

Bug Summary
JDK-8292501 Allocating card table before heap causes underflow asserts in CardTable::addr_for()
JDK-8291159 BlockLocationPrinter fails to decode addresses with G1
JDK-8293421 G1 remembered set memory footprint regression after JDK-8286115
JDK-8292125 Race freeing remembered set segments

Tyler Steele, IBM

Bug Summary
JDK-8291223 S390X: Fix crashes after JDK-8284161 (Virtual Threads)

Vladimir Kempik, Independent

Bug Summary
JDK-8291248 buffer overflow in MTLVertexCache.m: MTLVertexCache_AddGlyphQuad
JDK-8294243 RISC-V: Need to save and restore callee-saved FloatRegisters in StubGenerator::generate_call_stub

Vladimir Ivanov, Oracle

Bug Summary
JDK-8291213 C2: Loop opts are missing during OSR compilation

Xiaohong Gong, ARM

Bug Summary
JDK-8291097 AArch64: Fix register issues in SVE backend match rules

Yoshiki Sato, Oracle

Bug Summary
JDK-8293594 (tz) Update Timezone Data to 2022c
JDK-8291892 Add legacy tz tests to OpenJDK
JDK-8291894 System.loadLibrary does not work on Big Sur if JDK is built with macOS SDK 10.15 and earlier

Zhengyu Gu, Independent

Bug Summary
JDK-8291313 Shenandoah: disable Loom for iu mode