PUSHES REPORT: 19.0.2

This report shows who pushed the backports to the given release. This usually shows who did the backporting, testing, and review work.

Report generated: Fri Feb 03 01:46:32 CET 2023

Distribution by priority

Count Priority
2 P1
36 P2
131 P3
69 P4

Distribution by components

Count Component
238 100% Total
101 42.4% hotspot
43 18.1% hotspot/compiler
17 7.1% hotspot/runtime
14 5.9% hotspot/jfr
13 5.5% hotspot/jvmti
9 3.8% hotspot/gc
2 0.8% hotspot
1 0.4% hotspot/svc-agent
1 0.4% hotspot/svc
1 0.4% hotspot/test
64 26.9% core-libs
17 7.1% core-libs/java.lang.foreign
10 4.2% core-libs/java.lang
7 2.9% core-libs/java.util:i18n
6 2.5% core-libs/java.nio
5 2.1% core-libs/java.time
3 1.3% core-libs
3 1.3% core-libs/java.util.jar
2 0.8% core-libs/java.lang:class_loading
2 0.8% core-libs/java.util:collections
1 0.4% core-libs/java.util.concurrent
1 0.4% core-libs/java.io:serialization
1 0.4% core-libs/java.util
1 0.4% core-libs/java.lang.invoke
1 0.4% core-libs/java.net
1 0.4% core-libs/javax.lang.model
1 0.4% core-libs/java.lang.module
1 0.4% core-libs/java.lang:reflect
1 0.4% core-libs/javax.naming
29 12.2% tools
13 5.5% tools/javadoc(tool)
10 4.2% tools/javac
3 1.3% tools/jpackage
2 0.8% tools
1 0.4% tools/jlink
18 7.6% client-libs
9 3.8% client-libs/2d
4 1.7% client-libs/java.awt
3 1.3% client-libs
1 0.4% client-libs/javax.sound
1 0.4% client-libs/java.beans
7 2.9% security-libs
3 1.3% security-libs/java.security
2 0.8% security-libs/javax.net.ssl
1 0.4% security-libs/javax.crypto:pkcs11
1 0.4% security-libs/javax.crypto
6 2.5% infrastructure
4 1.7% infrastructure/build
2 0.8% infrastructure/release_eng
6 2.5% xml
4 1.7% xml/jaxp
1 0.4% xml/javax.xml.validation
1 0.4% xml/org.w3c.dom
5 2.1% core-svc
3 1.3% core-svc/debugger
2 0.8% core-svc/java.lang.management
1 0.4% globalization
1 0.4% globalization/translation
1 0.4% release-team
1 0.4% release-team

Distribution by affiliation

This Release Pushes

Original Pushes

Count Committer
238 100% Total
168 70.6% Oracle
21 8.8% Tobias Hartmann
17 7.1% Daniel Daugherty
12 5.0% Maurizio Cimadamore
8 3.4% Alan Bateman
7 2.9% Yoshiki Sato
6 2.5% Brian Burkhalter
6 2.5% Jan Lahoda
6 2.5% Joe Wang
6 2.5% Robert Mckenna
5 2.1% Erik Gahlin
5 2.1% Pavel Rappo
5 2.1% Jonathan Gibbons
5 2.1% Jorn Vernee
4 1.7% Markus Grönlund
4 1.7% David Holmes
4 1.7% Thomas Schatzl
4 1.7% Serguei Spitsyn
3 1.3% Hannes Wallnoefer
3 1.3% Ron Pressler
3 1.3% Lance Andersen
3 1.3% Naoto Sato
2 0.8% Stuart Marks
2 0.8% Igor Veresov
2 0.8% Jaikiran Pai
2 0.8% Christian Hagedorn
2 0.8% Philip Race
2 0.8% Alexander Matveev
1 0.4% Emanuel Peter
1 0.4% Albert Yang
1 0.4% Alexey Semenyuk
1 0.4% Chris Plummer
1 0.4% Vicente Arturo Romero Zaldivar
1 0.4% Ioi Lam
1 0.4% jena.nibedita
1 0.4% Srikanth Adayapalam
1 0.4% Claes Redestad
1 0.4% Alexey Ivanov
1 0.4% Vladimir Kozlov
1 0.4% Ramkumar Sunderbabu
1 0.4% Joe Darcy
1 0.4% Abhishek Kumar
1 0.4% Dean Long
1 0.4% Alisen Chung
1 0.4% Mark Reinhold
1 0.4% Vladimir Ivanov
1 0.4% Raffaello Giulietti
20 8.4% SAP
13 5.5% Christoph Langer
2 0.8% Martin Doerr
2 0.8% Matthias Baesken
2 0.8% Thomas Stuefe
1 0.4% Richard Reingruber
13 5.5% Amazon
10 4.2% Victor Rudometov
3 1.3% Sergey Bylokhov
9 3.8% Independent
3 1.3% georgeadams1995
3 1.3% Vladimir Kempik
1 0.4% Peter Levart
1 0.4% Chris Hegarty
1 0.4% Zhengyu Gu
7 2.9% Red Hat
5 2.1% Aleksey Shipilev
1 0.4% Andrew Hughes
1 0.4% Roland Westrelin
4 1.7% Alibaba
4 1.7% Xiaolin Zheng
3 1.3% Google
3 1.3% Man Cao
3 1.3% Huawei
3 1.3% Feilong Jiang
3 1.3% IBM
1 0.4% Ichiroh Takiguchi
1 0.4% gaurav.chaudhari
1 0.4% Tyler Steele
2 0.8% ARM
1 0.4% Pengfei Li
1 0.4% Xiaohong Gong
2 0.8% Intel
2 0.8% Jatin Bhateja
2 0.8% Loongson
2 0.8% Qi Ao
1 0.4% BellSoft
1 0.4% Boris Ulasevich
1 0.4% Rivos
1 0.4% Ludovic Henry
Count Committer
238 100% Total
175 73.5% Oracle
17 7.1% Daniel Daugherty
12 5.0% Maurizio Cimadamore
10 4.2% Alan Bateman
6 2.5% Brian Burkhalter
6 2.5% Joe Wang
6 2.5% Erik Gahlin
6 2.5% Jan Lahoda
5 2.1% Yoshiki Sato
5 2.1% Pavel Rappo
5 2.1% Jorn Vernee
5 2.1% Jonathan Gibbons
4 1.7% Markus Grönlund
4 1.7% Dean Long
4 1.7% Thomas Schatzl
4 1.7% David Holmes
4 1.7% Naoto Sato
4 1.7% Philip Race
4 1.7% Serguei Spitsyn
3 1.3% Jayathirth D V
3 1.3% Emanuel Peter
3 1.3% Magnus Ihse Bursie
3 1.3% Hannes Wallnoefer
3 1.3% Daniel Jelinski
3 1.3% Ron Pressler
3 1.3% Lance Andersen
3 1.3% Rajan Halade
3 1.3% Vladimir Kozlov
3 1.3% Christian Hagedorn
3 1.3% Vladimir Ivanov
2 0.8% Robert Mckenna
2 0.8% Tobias Hartmann
2 0.8% Alexander Zuev
2 0.8% Stuart Marks
2 0.8% Igor Veresov
2 0.8% Jaikiran Pai
2 0.8% Alexander Matveev
1 0.4% Albert Yang
1 0.4% Roberto Castaneda Lozano
1 0.4% Srikanth Adayapalam
1 0.4% Abhishek Kumar
1 0.4% Raffaello Giulietti
1 0.4% Angelos Bimpoudis
1 0.4% Alexey Semenyuk
1 0.4% Chris Plummer
1 0.4% Leonid Mesnik
1 0.4% Vicente Arturo Romero Zaldivar
1 0.4% Ioi Lam
1 0.4% Prasanta Sadhukhan
1 0.4% Ravi Gupta
1 0.4% Claes Redestad
1 0.4% Joe Darcy
1 0.4% Alisen Chung
1 0.4% Mark Reinhold
14 5.9% Red Hat
7 2.9% Roland Westrelin
5 2.1% Aleksey Shipilev
1 0.4% Andrew Haley
1 0.4% Andrew Hughes
13 5.5% SAP
6 2.5% Matthias Baesken
3 1.3% Thomas Stuefe
2 0.8% Martin Doerr
1 0.4% Christoph Langer
1 0.4% Richard Reingruber
12 5.0% Independent
2 0.8% Peter Levart
2 0.8% Fei Yang
2 0.8% Vladimir Kempik
1 0.4% Doug Lea
1 0.4% AJ-Ferguson
1 0.4% georgeadams1995
1 0.4% Zhengyu Gu
1 0.4% deigue
1 0.4% Ryan Ernst
4 1.7% Alibaba
4 1.7% Xiaolin Zheng
4 1.7% Amazon
3 1.3% Sergey Bylokhov
1 0.4% David Alvarez
4 1.7% Google
3 1.3% Man Cao
1 0.4% Justin King
2 0.8% ARM
1 0.4% Pengfei Li
1 0.4% Xiaohong Gong
2 0.8% IBM
1 0.4% Ichiroh Takiguchi
1 0.4% Tyler Steele
2 0.8% Intel
2 0.8% Jatin Bhateja
2 0.8% Loongson
2 0.8% Qi Ao
1 0.4% BellSoft
1 0.4% Boris Ulasevich
1 0.4% Huawei
1 0.4% Feilong Jiang
1 0.4% Rivos
1 0.4% Ludovic Henry
1 0.4% Unknown
1 0.4% N/A

Chronological push log:

Days Ago This Release Push By Original Push By Bug Summary
Name Affiliation Name Affiliation
63 Victor Rudometov Amazon Angelos Bimpoudis Oracle JDK-8297942 NullPointerException with invalid pattern matching construct in constructor call
64 Christoph Langer SAP Christoph Langer SAP JDK-8297888 Improve handling of macos xcode toolchain
65 Aleksey Shipilev Red Hat Justin King Google JDK-8297775 Memory leak in ShenandoahFullGC
66 Feilong Jiang Huawei Feilong Jiang Huawei JDK-8297722 compiler/runtime/TestConstantsInError.java fails on riscv
66 Chris Hegarty Independent Ryan Ernst Independent JDK-8297721 ProcessHandleImpl should assert privilege when modifying reaper thread
66 David Holmes Oracle David Holmes Oracle JDK-8297690 Memory leak in JVM_StartThread with the integration of Virtual threads
68 Feilong Jiang Huawei Fei Yang Independent JDK-8297678 Increase InlineSmallCode default from 1000 to 2500 for RISC-V
69 Christoph Langer SAP Matthias Baesken SAP JDK-8297610 UnexpectedSourceImageSize test times out on slow machines when fastdebug is used
70 Ludovic Henry Rivos Ludovic Henry Rivos JDK-8297601 Fix PaX check on RISC-V
70 Vladimir Kempik Independent Vladimir Kempik Independent JDK-8297599 RISC-V: improve performance of copy_memory stub
70 Victor Rudometov Amazon Jayathirth D V Oracle JDK-8297575 sun/java2d/DirectX/OnScreenRenderingResizeTest/OnScreenRenderingResizeTest.java fails again
70 Victor Rudometov Amazon Jayathirth D V Oracle JDK-8297574 Update sun/java2d/DirectX/OnScreenRenderingResizeTest/OnScreenRenderingResizeTest.java
70 Christoph Langer SAP Matthias Baesken SAP JDK-8297568 PublicMethodsTest is slow due to dependency verification with debug builds
70 Sergey Bylokhov Amazon Sergey Bylokhov Amazon JDK-8297540 One more cast in SAFE_SIZE_NEW_ARRAY2
71 Victor Rudometov Amazon Jayathirth D V Oracle JDK-8297524 sun/java2d/DirectX/OnScreenRenderingResizeTest/OnScreenRenderingResizeTest.java fails
71 Tobias Hartmann Oracle Dean Long Oracle JDK-8297512 missing is_unloading() check in SharedRuntime::fixup_callers_callsite()
71 Tobias Hartmann Oracle Roberto Castaneda Lozano Oracle JDK-8297511 C2 compilation fails with assert "non-reduction loop contains reduction nodes"
71 Tobias Hartmann Oracle Vladimir Kozlov Oracle JDK-8297510 SIGSEGV in PhaseIdealLoop::build_loop_late_post_work
71 Tobias Hartmann Oracle Emanuel Peter Oracle JDK-8297509 C2: PhaseCCP: remove not visited nodes, prevent type inconsistency
71 Tobias Hartmann Oracle Roland Westrelin Red Hat JDK-8297508 misc tests failed "assert(false) failed: graph should be schedulable"
71 Tobias Hartmann Oracle Emanuel Peter Oracle JDK-8297506 C2: fix and simplify IdealLoopTree::do_remove_empty_loop
71 Xiaolin Zheng Alibaba Xiaolin Zheng Alibaba JDK-8297463 RISC-V: C2: assert(false) failed: bad AD file
71 Xiaolin Zheng Alibaba Dean Long Oracle JDK-8297460 [Aarch64] C2: assert(false) failed: bad AD file
73 Victor Rudometov Amazon Ravi Gupta Oracle JDK-8297368 Write a test to verify the content change of TextArea sends TextEvent
73 Victor Rudometov Amazon Philip Race Oracle JDK-8297365 closed sun/java2d/GdiRendering/ClipShapeRendering.java failed with "Incorrect color ffeeeeee instead of ff0000ff in pixel (100, 100)"
73 Victor Rudometov Amazon Alexander Zuev Oracle JDK-8297363 javax/sound/midi/Sequencer/MetaCallback.java failed with timeout
73 Xiaolin Zheng Alibaba Xiaolin Zheng Alibaba JDK-8297339 RISC-V: Fix temp usages of heapbase register killed by MacroAssembler::en/decode_klass_not_null
73 Xiaolin Zheng Alibaba Xiaolin Zheng Alibaba JDK-8297337 RISC-V: C1: Fix LIRGenerator::do_LibmIntrinsic
76 Man Cao Google Man Cao Google JDK-8297287 Remove sysThreadAvailableStackWithSlack from hotspot-symbols
76 Victor Rudometov Amazon Philip Race Oracle JDK-8297282 Regression Test CoordinateTruncationBug.java fails on OL8.3
76 Victor Rudometov Amazon Prasanta Sadhukhan Oracle JDK-8297280 javax/swing/JTree/6263446/bug6263446.java fails intermittently on a VM
76 jena.nibedita Oracle Rajan Halade Oracle JDK-8297128 java/security/cert/pkix/policyChanges/TestPolicy.java is failing
77 Christoph Langer SAP Erik Gahlin Oracle JDK-8297231 JFR: File Read event for RandomAccessFile::write(byte[]) is incorrect
78 Alexey Ivanov Oracle Alexander Zuev Oracle JDK-8297151 Overzealous check in sizecalc.h prevents large memory allocation
79 Yoshiki Sato Oracle Yoshiki Sato Oracle JDK-8296110 (tz) Update Timezone Data to 2022f
80 Yoshiki Sato Oracle Naoto Sato Oracle JDK-8296828 CLDR v42 update for tzdata 2022f
85 Victor Rudometov Amazon Rajan Halade Oracle JDK-8296716 BuildEEBasicConstraints.java test fails with SunCertPathBuilderException
85 Christoph Langer SAP Rajan Halade Oracle JDK-8296669 Update test artifacts in QuoVadis CA interop tests
86 Aleksey Shipilev Red Hat Aleksey Shipilev Red Hat JDK-8296525 S390X: Optimized builds are broken
86 Aleksey Shipilev Red Hat Aleksey Shipilev Red Hat JDK-8296524 sun/security/pkcs11/Signature/TestDSAKeyLength.java fails when NSS version detection fails
87 Srikanth Adayapalam Oracle Srikanth Adayapalam Oracle JDK-8296021 TYPE_USE annotations on generic type arguments of record components discarded
90 Sergey Bylokhov Amazon Sergey Bylokhov Amazon JDK-8296397 Move the "sizecalc.h" to the correct location
91 Christoph Langer SAP Matthias Baesken SAP JDK-8296313 langtools OptionalDependencyTest.java use File.pathSeparator
91 Christoph Langer SAP Matthias Baesken SAP JDK-8296308 jdeps InverseDepsAnalyzer runs into NoSuchElementException: No value present
92 Man Cao Google Man Cao Google JDK-8296267 SIGQUIT and jcmd attaching mechanism does not work with signal chaining library
92 Ichiroh Takiguchi IBM Ichiroh Takiguchi IBM JDK-8296230 CustomTzIDCheckDST.java testcase failed on AIX platform
99 Christoph Langer SAP Daniel Jelinski Oracle JDK-8295929 Test jdk/sun/security/ssl/SSLSessionImpl/NoInvalidateSocketException.java fails with "tag mismatch"
100 Tobias Hartmann Oracle Dean Long Oracle JDK-8295907 assert(ctrl == kit.control()) failed: Control flow was added although the intrinsic bailed out
100 Tobias Hartmann Oracle Vladimir Ivanov Oracle JDK-8295906 CI: ciBytecodeStream::get_klass() is not consistent
100 Tobias Hartmann Oracle AJ-Ferguson Independent JDK-8295905 AES-CTR cipher state corruption with AVX-512
100 Aleksey Shipilev Red Hat Aleksey Shipilev Red Hat JDK-8295904 Optimized builds are broken due to incorrect assert_is_rfp shortcuts
104 Vicente Arturo Romero Zaldivar Oracle Vicente Arturo Romero Zaldivar Oracle JDK-8295757 Raw inner class constructor ref should not perform diamond inference
107 Yoshiki Sato Oracle David Alvarez Amazon JDK-8295243 (tz) Update Timezone Data to 2022e
118 Man Cao Google Man Cao Google JDK-8295004 Build failure with Clang 14+ due to function warning attribute
120 Yoshiki Sato Oracle Yoshiki Sato Oracle JDK-8294553 (tz) Update Timezone Data to 2022d
121 Robert Mckenna Oracle Doug Lea Independent JDK-8294762 Bad Thread Utilization in ForkJoinPool
121 Matthias Baesken SAP Aleksey Shipilev Red Hat JDK-8294761 Build failures with GCC 11, Alpine 3 due to incompatible casts from nullptr
126 Tobias Hartmann Oracle Roland Westrelin Red Hat JDK-8294559 C2: assert(BoolTest(btest).is_canonical()) failure
127 Robert Mckenna Oracle Robert Mckenna Oracle JDK-8294517 Update jdk19u fix version to 19.0.2
127 gaurav.chaudhari IBM deigue Independent JDK-8294491 [REDO] DST not applying properly with zone id offset set with TZ env variable
128 Andrew Hughes Red Hat Andrew Hughes Red Hat JDK-8293834 Update CLDR data following tzdata 2022c update
128 Qi Ao Loongson Qi Ao Loongson JDK-8294458 Fix some tests with "requires vm.jvmti & vm.continuations"
128 Feilong Jiang Huawei Fei Yang Independent JDK-8294457 riscv: Fix build warnings-as-errors with GCC 11
128 Tobias Hartmann Oracle N/A Unknown JDK-8294453 Trampoline not created for far runtime targets outside small CodeCache
128 Tobias Hartmann Oracle Andrew Haley Red Hat JDK-8294452 AArch64: CMN should be handled the same way as CMP
128 Tobias Hartmann Oracle Vladimir Kozlov Oracle JDK-8294451 test fails "assert(init != __null) failed: initialization not found"
128 Tobias Hartmann Oracle Roland Westrelin Red Hat JDK-8294450 Incorrect result when switching to C2 OSR compilation from C1
128 Tobias Hartmann Oracle Roland Westrelin Red Hat JDK-8294449 assert(false) failed: infinite loop in PhaseIterGVN::optimize
128 Tobias Hartmann Oracle Tobias Hartmann Oracle JDK-8294448 StringConcat::validate_mem_flow asserts with "unexpected user: StoreI"
128 Tobias Hartmann Oracle Vladimir Ivanov Oracle JDK-8294447 C1: Missing access check on non-accessible class
128 Tobias Hartmann Oracle Christian Hagedorn Oracle JDK-8294446 C2: assert(r != __null && r->is_Region()) failed: this phi must have a region
128 Tobias Hartmann Oracle Roland Westrelin Red Hat JDK-8294445 Assertion in PhaseIdealLoop::skeleton_predicate_has_opaque after JDK-8289127
128 Tobias Hartmann Oracle Roland Westrelin Red Hat JDK-8294444 Segfault at PhaseIdealLoop::clone_loop_handle_data_uses
128 Jan Lahoda Oracle Jan Lahoda Oracle JDK-8294443 java.lang.AssertionError at at jdk.compiler/com.sun.tools.javac.code.Scope$ScopeImpl.leave(Scope.java:386)
132 Jan Lahoda Oracle Jan Lahoda Oracle JDK-8294269 A false cyclic inheritance error reported
132 Jan Lahoda Oracle Jan Lahoda Oracle JDK-8294268 Duplicate ldc generated by javac
133 Vladimir Kempik Independent Xiaolin Zheng Alibaba JDK-8294243 RISC-V: Need to save and restore callee-saved FloatRegisters in StubGenerator::generate_call_stub
142 Robert Mckenna Oracle Alan Bateman Oracle JDK-8293732 jdk/internal/misc/TerminatingThreadLocal/TestTerminatingThreadLocal.java failed "AssertionError: Expected terminated values: [666] but got: []"
142 Robert Mckenna Oracle Peter Levart Independent JDK-8293731 TerminatingThreadLocal(s) not registered from virtual thread(s)
142 Robert Mckenna Oracle Alan Bateman Oracle JDK-8293730 CarrierThread.blocking not reset when spare not activated
143 Qi Ao Loongson Qi Ao Loongson JDK-8293729 java/beans/XMLDecoder/8028054/Task.java should use the 3-arg Class.forName
146 Yoshiki Sato Oracle Yoshiki Sato Oracle JDK-8293728 (tz) Update Timezone Data to 2022c
149 Thomas Schatzl Oracle Thomas Schatzl Oracle JDK-8293727 G1 remembered set memory footprint regression after JDK-8286115
150 Hannes Wallnoefer Oracle Hannes Wallnoefer Oracle JDK-8293726 JQuery UI license file not updated
160 Christoph Langer SAP Matthias Baesken SAP JDK-8293138 MetricsTesterCgroupV2.getLongValueEntryFromFile fails when named value doesn't exist
160 Christoph Langer SAP Daniel Jelinski Oracle JDK-8293137 javax/net/ssl/ServerName/SSLEngineExplorerMatchedSNI.java failed intermittently due to SSLException: Tag mismatch
160 Christoph Langer SAP Daniel Jelinski Oracle JDK-8293136 Tests fail with SSLProtocolException: Input record too big
167 Lance Andersen Oracle Lance Andersen Oracle JDK-8292784 Back out the fix forJDK-8281962 from jdk19u
174 Vladimir Kozlov Oracle Vladimir Kozlov Oracle JDK-8292518 [BACKOUT] JDK-8279219: [REDO] C2 crash when allocating array of size too large
176 Lance Andersen Oracle Lance Andersen Oracle JDK-8292517 Revert unintentional change to deflate.c
176 Thomas Schatzl Oracle Thomas Schatzl Oracle JDK-8292516 Allocating card table before heap causes underflow asserts in CardTable::addr_for()
177 Alisen Chung Oracle Alisen Chung Oracle JDK-8292515 JDK 19 RDP2 L10n resource files update - msgdrop 10
181 Alan Bateman Oracle Alan Bateman Oracle JDK-8292152 ThreadMXBean.getThread{Cpu,User}Time fails with -XX:-VMContinuations
182 Peter Levart Independent Peter Levart Independent JDK-8292151 java/io/ObjectStreamClass/ObjectStreamClassCaching.java fails with various GCs
182 Yoshiki Sato Oracle Yoshiki Sato Oracle JDK-8292148 System.loadLibrary does not work on Big Sur if JDK is built with macOS SDK 10.15 and earlier
182 Yoshiki Sato Oracle Yoshiki Sato Oracle JDK-8292144 Add legacy tz tests to OpenJDK
182 David Holmes Oracle David Holmes Oracle JDK-8292150 Remove EA from JDK 19 version string starting with Initial RC promotion B35 on August 11, 2022
183 Thomas Schatzl Oracle Thomas Schatzl Oracle JDK-8292149 Race freeing remembered set segments
184 Erik Gahlin Oracle Erik Gahlin Oracle JDK-8291747 jdk/jfr/event/runtime/TestClassLoaderStatsEvent.java Value not equal to 2, field='hiddenClassCount', value='0'
189 Mark Reinhold Oracle Mark Reinhold Oracle JDK-8291746 Snippetize modules API examples
190 Philip Race Oracle Philip Race Oracle JDK-8291741 Update FreeType to 2.12.1
190 georgeadams1995 Independent georgeadams1995 Independent JDK-8291742 Bump macOS GitHub actions to macOS 11
190 Maurizio Cimadamore Oracle Maurizio Cimadamore Oracle JDK-8291744 java/foreign/TestUnsupportedPlatform fails after JDK-8290455
192 Maurizio Cimadamore Oracle Maurizio Cimadamore Oracle JDK-8291450 jck test api/java_lang/foreign/VaList/Empty.html fails on some platforms
195 Christoph Langer SAP Thomas Stuefe SAP JDK-8291449 Alpine: disable some panama tests that rely on std::thread
197 David Holmes Oracle David Holmes Oracle JDK-8291448 Test jdk/javadoc/tool/CheckManPageOptions.java after manpage update
197 David Holmes Oracle David Holmes Oracle JDK-8291181 Update nroff pages in JDK 19 before RC
198 Maurizio Cimadamore Oracle Maurizio Cimadamore Oracle JDK-8291442 Typo in javadoc of MemorySegment/MemoryAddress
198 Markus Grönlund Oracle Markus Grönlund Oracle JDK-8291441 JFR: Cannot resolve method
198 Ioi Lam Oracle Ioi Lam Oracle JDK-8291440 CDS cannot archive lamda proxy with useImplMethodHandle
199 Pengfei Li ARM Pengfei Li ARM JDK-8291439 C2: Assert failed in PhaseCFG::verify() after JDK-8183390
199 Roland Westrelin Red Hat Roland Westrelin Red Hat JDK-8291438 Apache Lucene triggers: DEBUG MESSAGE: duplicated predicate failed which is impossible
200 georgeadams1995 Independent Magnus Ihse Bursie Oracle JDK-8291259 Restore cancel-in-progress in GHA
200 georgeadams1995 Independent Magnus Ihse Bursie Oracle JDK-8291258 Rewrite of GitHub Actions (GHA) sanity tests
202 Philip Race Oracle Philip Race Oracle JDK-8291257 Update HarfBuzz to 4.4.1
203 Pavel Rappo Oracle Pavel Rappo Oracle JDK-8291437 Bad result for the snippet @link tag if substring/regex consists of whitespace
203 Zhengyu Gu Independent Zhengyu Gu Independent JDK-8291436 Shenandoah: disable Loom for iu mode
203 Brian Burkhalter Oracle Brian Burkhalter Oracle JDK-8291435 Add TEST.properties to java/nio/channels/FileChannel and move tests out of largeMemory sub-dir
204 Jatin Bhateja Intel Jatin Bhateja Intel JDK-8291434 C2: Error: ShouldNotReachHere() in Type::typerr()
204 Joe Wang Oracle Joe Wang Oracle JDK-8291433 jcup.md missing additional text
204 Joe Wang Oracle Joe Wang Oracle JDK-8291432 Missing notice in dom.md
205 Daniel Daugherty Oracle Daniel Daugherty Oracle JDK-8291431 ProblemList vmTestbase/nsk/jvmti/scenarios/capability/CM03/cm03t001/TestDescription.java on linux-all
205 Daniel Daugherty Oracle Daniel Daugherty Oracle JDK-8291430 ProblemList com/sun/jdi/InvokeHangTest.java on macosx-x64 in vthread mode
205 Brian Burkhalter Oracle Brian Burkhalter Oracle JDK-8291424 java/nio/channels/FileChannel/largeMemory/LargeGatheringWrite.java timed out
205 Alan Bateman Oracle Alan Bateman Oracle JDK-8291423 Improve Thread description of inherited AccessControlContext
205 Maurizio Cimadamore Oracle Maurizio Cimadamore Oracle JDK-8291422 SegmentAllocator:allocateArray(MemoryLayout, count) does not throw IAEx when count is -1
205 Maurizio Cimadamore Oracle Maurizio Cimadamore Oracle JDK-8291421 Javadoc for MemorySegment/MemoryAddress getter/setters contains some typos
205 Maurizio Cimadamore Oracle Maurizio Cimadamore Oracle JDK-8291420 SegmentAllocator:allocate() can return null some cases
205 Jorn Vernee Oracle Jorn Vernee Oracle JDK-8291419 j.l.foreign.VaList::skip call could throw java.lang.IndexOutOfBoundsException: Out of bound access on segment
205 Jorn Vernee Oracle Jorn Vernee Oracle JDK-8291417 Specification of method j.l.foreign.VaList::skip deserves clarification
205 Jorn Vernee Oracle Jorn Vernee Oracle JDK-8291416 j.l.foreign.VaList::nextVarg call could throw IndexOutOfBoundsException or even crash the VM
206 Serguei Spitsyn Oracle Serguei Spitsyn Oracle JDK-8291415 fatal error: stuck in JvmtiVTMSTransitionDisabler::disable_VTMS_transitions
206 Christoph Langer SAP Magnus Ihse Bursie Oracle JDK-8291413 UnreadableRB case in MissingResourceCauseTest is not working reliably on Windows
206 Pavel Rappo Oracle Pavel Rappo Oracle JDK-8291180 Using @inheritDoc in an inapplicable context shouldn't crash javadoc
206 Maurizio Cimadamore Oracle Maurizio Cimadamore Oracle JDK-8291412 Revisit implementation of memory session
206 Martin Doerr SAP Martin Doerr SAP JDK-8291411 [PPC64] JfrGetCallTrace: assert(_pc != nullptr) failed: must have PC
206 Markus Grönlund Oracle Markus Grönlund Oracle JDK-8291410 JFR: Thread checkpoint no longer enforce mutual exclusion post Loom integration
206 Jan Lahoda Oracle Jan Lahoda Oracle JDK-8291409 A NullPointerException thrown from guard expression
206 Albert Yang Oracle Albert Yang Oracle JDK-8291408 G1: Incorrect verification logic in G1ConcurrentMark::clear_next_bitmap
209 Joe Wang Oracle Joe Wang Oracle JDK-8291407 Update java.xml module-info
209 Daniel Daugherty Oracle Daniel Daugherty Oracle JDK-8291406 ProblemList serviceability/jvmti/GetLocalVariable/GetLocalWithoutSuspendTest.java on windows-x64 in -Xcomp mode
209 Vladimir Kempik Independent Vladimir Kempik Independent JDK-8291405 buffer overflow in MTLVertexCache.m: MTLVertexCache_AddGlyphQuad
209 Stuart Marks Oracle Stuart Marks Oracle JDK-8291404 wrong wording in @param doc for HashMap.newHashMap et. al.
209 Jorn Vernee Oracle Jorn Vernee Oracle JDK-8291403 SegmentAllocator::allocateUtf8String(String str) should be clarified for strings containing \0
209 Jorn Vernee Oracle Jorn Vernee Oracle JDK-8291402 Canonicalize header ids in foreign API javadocs
209 Thomas Stuefe SAP Thomas Stuefe SAP JDK-8291401 Build warning in methodData.cpp memset zero-length parameter
210 Alexander Matveev Oracle Alexander Matveev Oracle JDK-8291400 [macos] app image signature invalid when creating DMG or PKG
210 Daniel Daugherty Oracle Daniel Daugherty Oracle JDK-8291399 ProblemList jdk/jfr/api/consumer/TestRecordingFileWrite.java on linux-x64 and macosx-x64
210 Brian Burkhalter Oracle Brian Burkhalter Oracle JDK-8291398 java/nio/channels/FileChannel/MapTest.java times out
210 Brian Burkhalter Oracle Brian Burkhalter Oracle JDK-8291397 Test java/nio/channels/FileChannel/LargeGatheringWrite.java times out
210 Joe Wang Oracle Joe Wang Oracle JDK-8291179 Improve XSLT XPath operators count efficiency
210 Stuart Marks Oracle Stuart Marks Oracle JDK-8291396 Map::replaceAll javadoc has redundant @throws clauses
210 Maurizio Cimadamore Oracle Maurizio Cimadamore Oracle JDK-8291395 Need spec clarification of j.l.foreign.*Layout
210 Jan Lahoda Oracle Jan Lahoda Oracle JDK-8291394 Pattern domination not working properly for record patterns
211 Pavel Rappo Oracle Pavel Rappo Oracle JDK-8291393 {@inheritDoc} only copies one instance of the specified exception
211 Ron Pressler Oracle Ron Pressler Oracle JDK-8291392 serviceability/jvmti/vthread/ContStackDepthTest/ContStackDepthTest.java failing
211 Daniel Daugherty Oracle Daniel Daugherty Oracle JDK-8291391 ProblemList jdk/jfr/event/runtime/TestActiveSettingEvent.java
211 Daniel Daugherty Oracle Daniel Daugherty Oracle JDK-8291390 ProblemList vmTestbase/nsk/jdwp/ThreadReference/ForceEarlyReturn/forceEarlyReturn002/forceEarlyReturn002.java when run with vthread wrapper
211 Daniel Daugherty Oracle Daniel Daugherty Oracle JDK-8291389 ProblemList vmTestbase/gc/gctests/MemoryEaterMT/MemoryEaterMT.java with ZGC on windows
211 Thomas Stuefe SAP Thomas Stuefe SAP JDK-8291388 Memory corruption with CPU_ALLOC, CPU_FREE on muslc
211 Alan Bateman Oracle Alan Bateman Oracle JDK-8291387 Clarify relationship between ThreadStart/ThreadEnd and can_support_virtual_threads capability
212 Tyler Steele IBM Tyler Steele IBM JDK-8291386 S390X: Fix crashes after JDK-8284161 (Virtual Threads)
212 Daniel Daugherty Oracle Daniel Daugherty Oracle JDK-8291385 move oop safety check from SharedRuntime::get_java_tid() to JavaThread::threadObj()
212 Chris Plummer Oracle Chris Plummer Oracle JDK-8291384 Fatal Error when suspending virtual thread after it has terminated
213 Pavel Rappo Oracle Pavel Rappo Oracle JDK-8291383 Incorrect HTML generation for copied javadoc with multiple @throws tags
213 Matthias Baesken SAP Matthias Baesken SAP JDK-8291382 [test] java/lang/ProcessBuilder/Basic.java fails on Alpine/musl
213 Jatin Bhateja Intel Jatin Bhateja Intel JDK-8291381 C2 crash: assert(t->meet(t0) == t) failed: Not monotonic
214 Erik Gahlin Oracle Erik Gahlin Oracle JDK-8291380 jdk.jfr.consumer.RecordedThread.getId references Thread::getId, should be Thread::threadId
215 Serguei Spitsyn Oracle Serguei Spitsyn Oracle JDK-8291379 JVMTI SelfSuspendDisablerTest.java failed with RuntimeException: Test FAILED: Unexpected thread state
215 Igor Veresov Oracle Igor Veresov Oracle JDK-8291175 -Xcomp is missing from java launcher documentation
215 Serguei Spitsyn Oracle Serguei Spitsyn Oracle JDK-8291378 GetThreadState returns 0 for virtual thread that has terminated
216 Sergey Bylokhov Amazon Sergey Bylokhov Amazon JDK-8291377 getLocalGraphicsEnvironment() on for multi-screen setups throws exception NPE
216 Vladimir Ivanov Oracle Vladimir Ivanov Oracle JDK-8291376 C2: Loop opts are missing during OSR compilation
216 Maurizio Cimadamore Oracle Maurizio Cimadamore Oracle JDK-8291375 SegmentAllocator:allocateUtf8String(String str) default behavior mismatch to spec
216 Daniel Daugherty Oracle Daniel Daugherty Oracle JDK-8291374 ProblemList sun/tools/jhsdb/JStackStressTest.java on linux-aarch64
216 Naoto Sato Oracle Naoto Sato Oracle JDK-8291373 ISO 4217 Amendment 172 Update
216 Tobias Hartmann Oracle Tobias Hartmann Oracle JDK-8291372 Unreachable loop is not removed from C2 IR, leading to a broken graph
217 Alan Bateman Oracle Alan Bateman Oracle JDK-8291371 Suspend/ResumeAllVirtualThreads need both can_suspend and can_support_virtual_threads
217 Ramkumar Sunderbabu Oracle Leonid Mesnik Oracle JDK-8295897 com/sun/management/OperatingSystemMXBean/TestTotalSwap.java: Expected total swap size ... but getTotalSwapSpaceSize returned ...
218 Naoto Sato Oracle Naoto Sato Oracle JDK-8291370 Recommend Locale.of() method instead of the constructor
218 Raffaello Giulietti Oracle Raffaello Giulietti Oracle JDK-8291369 Random:from() adapter does not delegate to supplied generator in all cases
219 Joe Darcy Oracle Joe Darcy Oracle JDK-8291368 Update SourceVersion to use snippets
219 Daniel Daugherty Oracle Daniel Daugherty Oracle JDK-8291357 ProblemList jdk/jfr/api/consumer/recordingstream/TestOnEvent.java on linux-x64 again
219 Igor Veresov Oracle Igor Veresov Oracle JDK-8291356 Very slow C1 arraycopy jcstress tests after JDK-8279886
219 Jonathan Gibbons Oracle Jonathan Gibbons Oracle JDK-8291355 Broken links on constant-values page
219 Jonathan Gibbons Oracle Jonathan Gibbons Oracle JDK-8291354 Bogus warning generated for record with compact constructor
219 Brian Burkhalter Oracle Brian Burkhalter Oracle JDK-8291353 (fs) Files.writeString spec for IOException has "specified charset" when no charset is provided
219 Claes Redestad Oracle Claes Redestad Oracle JDK-8291352 Footprint regression due MH creation when initializing StringConcatFactory
219 Maurizio Cimadamore Oracle Maurizio Cimadamore Oracle JDK-8291350 SegmentAllocator::allocateArray null handling is too lax
219 Dean Long Oracle Dean Long Oracle JDK-8291349 AArch64: C2 compilation fails with guarantee(!true || (true && (shift != 0))) failed: impossible encoding
220 Daniel Daugherty Oracle Daniel Daugherty Oracle JDK-8291348 ProblemList java/lang/ref/OOMEInReferenceHandler.java
220 Pavel Rappo Oracle Pavel Rappo Oracle JDK-8291169 Allow @systemProperty to appear in overview documentation
220 Daniel Daugherty Oracle Daniel Daugherty Oracle JDK-8291347 ProblemList java/lang/reflect/callerCache/ReflectionCallerCacheTest.java in -Xcomp mode
220 Daniel Daugherty Oracle Daniel Daugherty Oracle JDK-8291346 ProblemList vmTestbase/nsk/jdi/ClassType/invokeMethod/invokemethod011/TestDescription.java when run with vthread wrapper
220 Jonathan Gibbons Oracle Jonathan Gibbons Oracle JDK-8291171 Document set of strings javac recognizes for SuppressWarnings
220 Maurizio Cimadamore Oracle Maurizio Cimadamore Oracle JDK-8291345 SegmentAllocator:allocateArray(*) default behavior mismatch to spec
220 Thomas Schatzl Oracle Thomas Schatzl Oracle JDK-8291344 BlockLocationPrinter fails to decode addresses with G1
220 Christian Hagedorn Oracle Christian Hagedorn Oracle JDK-8291343 C2: And node gets wrong type due to not adding it back to the worklist in CCP
220 Alan Bateman Oracle Alan Bateman Oracle JDK-8291342 java/lang/Thread/jni/AttachCurrentThread/AttachTest.java#id1 failed with "RuntimeException: Test failed"
222 Jaikiran Pai Oracle Jaikiran Pai Oracle JDK-8291341 tools/jlink/plugins/CompressorPluginTest.java test failing
222 Jaikiran Pai Oracle Jaikiran Pai Oracle JDK-8291340 broken link in com.sun.net.httpserver.SimpleFileServer
223 Boris Ulasevich BellSoft Boris Ulasevich BellSoft JDK-8291322 ARM32: missing LIR_Assembler::cmove metadata type support
223 Jan Lahoda Oracle Jan Lahoda Oracle JDK-8291320 VerifyError with JEP 405 pattern match
223 Abhishek Kumar Oracle Abhishek Kumar Oracle JDK-8291318 broken links in java.desktop
224 Brian Burkhalter Oracle Brian Burkhalter Oracle JDK-8291316 (fc) FileChannel::map for MemorySegments should state it always throws UOE
224 Joe Wang Oracle Joe Wang Oracle JDK-8291314 Document.normalizeDocument() produces different results
224 Naoto Sato Oracle Naoto Sato Oracle JDK-8291312 Files.readString ignores encoding errors for UTF-16
224 Serguei Spitsyn Oracle Serguei Spitsyn Oracle JDK-8291310 serviceability/jvmti/vthread/GetSetLocalTest failed with assert: Not supported for heap frames
224 Richard Reingruber SAP Richard Reingruber SAP JDK-8291308 C1: LIR_OpVisitState::maxNumberOfOperands too small
225 Daniel Daugherty Oracle Daniel Daugherty Oracle JDK-8291306 ProblemList serviceability/jvmti/vthread/ContStackDepthTest/ContStackDepthTest.java in -Xcomp mode
225 Markus Grönlund Oracle Markus Grönlund Oracle JDK-8291304 misc tests fail "assert(ms < 1000) failed: Un-interruptable sleep, short time use only"
225 Alan Bateman Oracle Alan Bateman Oracle JDK-8291301 StructureViolationException should not link to fork method
225 Alan Bateman Oracle Alan Bateman Oracle JDK-8291285 Concurrent implicit attach from native threads crashes VM
225 Joe Wang Oracle Joe Wang Oracle JDK-8291284 broken link in java.xml
226 Robert Mckenna Oracle Robert Mckenna Oracle JDK-8291256 jtreg test com/sun/jndi/ldap/LdapPoolTimeoutTest.java fails intermittently in nightly run
226 Alexander Matveev Oracle Alexander Matveev Oracle JDK-8291283 Throw exception for missing values in .jpackage.xml
226 Maurizio Cimadamore Oracle Maurizio Cimadamore Oracle JDK-8291282 SegmentAllocator:allocate(long bytesSize) not throwing IAEx when bytesSize < 0
226 Aleksey Shipilev Red Hat Aleksey Shipilev Red Hat JDK-8291281 GCC 12 fails to build zReferenceProcessor.cpp
226 Ron Pressler Oracle Ron Pressler Oracle JDK-8291280 VThreadMonitorTest fails "assert(!current->cont_fastpath() || (current->cont_fastpath_thread_state() && !interpreted_native_or_deoptimized_on_stack(current))) failed"
226 Ron Pressler Oracle Ron Pressler Oracle JDK-8291279 serviceability/jvmti/vthread/ContStackDepthTest/ContStackDepthTest.java failing in loom repo with Xcomp
226 Daniel Daugherty Oracle Daniel Daugherty Oracle JDK-8291278 additional review changes for JDK-8286830
226 Daniel Daugherty Oracle Daniel Daugherty Oracle JDK-8291277 JavaThread touches oop after GC barrier is detached
226 Daniel Daugherty Oracle Daniel Daugherty Oracle JDK-8291276 add support for JavaThread::is_oop_safe()
226 Hannes Wallnoefer Oracle Hannes Wallnoefer Oracle JDK-8291275 Empty spans in mobile navigation markup
226 Emanuel Peter Oracle Emanuel Peter Oracle JDK-8291274 remove memory_operand assert for spilled instructions
226 Hannes Wallnoefer Oracle Hannes Wallnoefer Oracle JDK-8291273 Problematic fix for font boosting
227 Lance Andersen Oracle Lance Andersen Oracle JDK-8291272 broken link in java.base/java/util/zip/package-summary.html
227 Erik Gahlin Oracle Erik Gahlin Oracle JDK-8291271 JFR: Change package name of snippet files
227 Markus Grönlund Oracle Markus Grönlund Oracle JDK-8291270 JFR: Disabling the JfrThreadSampler commits only a partially disabled state
227 Erik Gahlin Oracle Erik Gahlin Oracle JDK-8291269 JFR: Incorrect error message when starting recording with missing .jfc file
227 Martin Doerr SAP Martin Doerr SAP JDK-8291268 jni/nullCaller/NullCallerTest.java failing (ppc64)
227 Christian Hagedorn Oracle Christian Hagedorn Oracle JDK-8291267 C2: LShiftLNode::Ideal produces wrong result after JDK-8278114
228 Xiaohong Gong ARM Xiaohong Gong ARM JDK-8291265 AArch64: Fix register issues in SVE backend match rules
230 Jonathan Gibbons Oracle Jonathan Gibbons Oracle JDK-8291264 jdk/javadoc/doclet/testTagMisuse/TestTagMisuse.java fails after JDK-8288545
230 Erik Gahlin Oracle Erik Gahlin Oracle JDK-8291263 15% increase in JFR footprint in Noop-Base
230 Jonathan Gibbons Oracle Jonathan Gibbons Oracle JDK-8291262 Missing space in error message
230 Alan Bateman Oracle Alan Bateman Oracle JDK-8291163 Add JNI_VERSION_19 to jni.h and JNI spec
231 Alexey Semenyuk Oracle Alexey Semenyuk Oracle JDK-8291261 jpackage tests failing on Windows due to powershell issue

No changesets log

JDK-8300251 Update security guide with missing debug options
JDK-8300076 Update Security Developers guide about how java.security properties are parsed
JDK-8291174 14.11.1: Typo in grammar for guarded pattern
JDK-8291170 Reconcile specification and implementation of link parsing
JDK-8291166 Add an anchor to each option on javadoc man page
JDK-8291165 broken link in specs/index.html

Committer push log

Abhishek Kumar, Oracle

Bug Summary
JDK-8291318 broken links in java.desktop

Alisen Chung, Oracle

Bug Summary
JDK-8292515 JDK 19 RDP2 L10n resource files update - msgdrop 10

Alexey Ivanov, Oracle

Bug Summary
JDK-8297151 Overzealous check in sizecalc.h prevents large memory allocation

Alan Bateman, Oracle

Bug Summary
JDK-8291163 Add JNI_VERSION_19 to jni.h and JNI spec
JDK-8291387 Clarify relationship between ThreadStart/ThreadEnd and can_support_virtual_threads capability
JDK-8291285 Concurrent implicit attach from native threads crashes VM
JDK-8291423 Improve Thread description of inherited AccessControlContext
JDK-8291342 java/lang/Thread/jni/AttachCurrentThread/AttachTest.java#id1 failed with "RuntimeException: Test failed"
JDK-8291301 StructureViolationException should not link to fork method
JDK-8291371 Suspend/ResumeAllVirtualThreads need both can_suspend and can_support_virtual_threads
JDK-8292152 ThreadMXBean.getThread{Cpu,User}Time fails with -XX:-VMContinuations

Alexander Matveev, Oracle

Bug Summary
JDK-8291400 [macos] app image signature invalid when creating DMG or PKG
JDK-8291283 Throw exception for missing values in .jpackage.xml

Andrew Hughes, Red Hat

Bug Summary
JDK-8293834 Update CLDR data following tzdata 2022c update

Qi Ao, Loongson

Bug Summary
JDK-8294458 Fix some tests with "requires vm.jvmti & vm.continuations"
JDK-8293729 java/beans/XMLDecoder/8028054/Task.java should use the 3-arg Class.forName

Alexey Semenyuk, Oracle

Bug Summary
JDK-8291261 jpackage tests failing on Windows due to powershell issue

Albert Yang, Oracle

Bug Summary
JDK-8291408 G1: Incorrect verification logic in G1ConcurrentMark::clear_next_bitmap

Brian Burkhalter, Oracle

Bug Summary
JDK-8291316 (fc) FileChannel::map for MemorySegments should state it always throws UOE
JDK-8291353 (fs) Files.writeString spec for IOException has "specified charset" when no charset is provided
JDK-8291435 Add TEST.properties to java/nio/channels/FileChannel and move tests out of largeMemory sub-dir
JDK-8291424 java/nio/channels/FileChannel/largeMemory/LargeGatheringWrite.java timed out
JDK-8291398 java/nio/channels/FileChannel/MapTest.java times out
JDK-8291397 Test java/nio/channels/FileChannel/LargeGatheringWrite.java times out

Boris Ulasevich, BellSoft

Bug Summary
JDK-8291322 ARM32: missing LIR_Assembler::cmove metadata type support

Christian Hagedorn, Oracle

Bug Summary
JDK-8291343 C2: And node gets wrong type due to not adding it back to the worklist in CCP
JDK-8291267 C2: LShiftLNode::Ideal produces wrong result after JDK-8278114

Chris Hegarty, Independent

Bug Summary
JDK-8297721 ProcessHandleImpl should assert privilege when modifying reaper thread

Chris Plummer, Oracle

Bug Summary
JDK-8291384 Fatal Error when suspending virtual thread after it has terminated

Christoph Langer, SAP

Bug Summary
JDK-8291449 Alpine: disable some panama tests that rely on std::thread
JDK-8297888 Improve handling of macos xcode toolchain
JDK-8293137 javax/net/ssl/ServerName/SSLEngineExplorerMatchedSNI.java failed intermittently due to SSLException: Tag mismatch
JDK-8296308 jdeps InverseDepsAnalyzer runs into NoSuchElementException: No value present
JDK-8297231 JFR: File Read event for RandomAccessFile::write(byte[]) is incorrect
JDK-8296313 langtools OptionalDependencyTest.java use File.pathSeparator
JDK-8293138 MetricsTesterCgroupV2.getLongValueEntryFromFile fails when named value doesn't exist
JDK-8297568 PublicMethodsTest is slow due to dependency verification with debug builds
JDK-8295929 Test jdk/sun/security/ssl/SSLSessionImpl/NoInvalidateSocketException.java fails with "tag mismatch"
JDK-8293136 Tests fail with SSLProtocolException: Input record too big
JDK-8297610 UnexpectedSourceImageSize test times out on slow machines when fastdebug is used
JDK-8291413 UnreadableRB case in MissingResourceCauseTest is not working reliably on Windows
JDK-8296669 Update test artifacts in QuoVadis CA interop tests

Joe Darcy, Oracle

Bug Summary
JDK-8291368 Update SourceVersion to use snippets

Daniel Daugherty, Oracle

Bug Summary
JDK-8291276 add support for JavaThread::is_oop_safe()
JDK-8291278 additional review changes for JDK-8286830
JDK-8291277 JavaThread touches oop after GC barrier is detached
JDK-8291385 move oop safety check from SharedRuntime::get_java_tid() to JavaThread::threadObj()
JDK-8291430 ProblemList com/sun/jdi/InvokeHangTest.java on macosx-x64 in vthread mode
JDK-8291348 ProblemList java/lang/ref/OOMEInReferenceHandler.java
JDK-8291347 ProblemList java/lang/reflect/callerCache/ReflectionCallerCacheTest.java in -Xcomp mode
JDK-8291357 ProblemList jdk/jfr/api/consumer/recordingstream/TestOnEvent.java on linux-x64 again
JDK-8291399 ProblemList jdk/jfr/api/consumer/TestRecordingFileWrite.java on linux-x64 and macosx-x64
JDK-8291391 ProblemList jdk/jfr/event/runtime/TestActiveSettingEvent.java
JDK-8291406 ProblemList serviceability/jvmti/GetLocalVariable/GetLocalWithoutSuspendTest.java on windows-x64 in -Xcomp mode
JDK-8291306 ProblemList serviceability/jvmti/vthread/ContStackDepthTest/ContStackDepthTest.java in -Xcomp mode
JDK-8291374 ProblemList sun/tools/jhsdb/JStackStressTest.java on linux-aarch64
JDK-8291389 ProblemList vmTestbase/gc/gctests/MemoryEaterMT/MemoryEaterMT.java with ZGC on windows
JDK-8291346 ProblemList vmTestbase/nsk/jdi/ClassType/invokeMethod/invokemethod011/TestDescription.java when run with vthread wrapper
JDK-8291390 ProblemList vmTestbase/nsk/jdwp/ThreadReference/ForceEarlyReturn/forceEarlyReturn002/forceEarlyReturn002.java when run with vthread wrapper
JDK-8291431 ProblemList vmTestbase/nsk/jvmti/scenarios/capability/CM03/cm03t001/TestDescription.java on linux-all

David Holmes, Oracle

Bug Summary
JDK-8297690 Memory leak in JVM_StartThread with the integration of Virtual threads
JDK-8292150 Remove EA from JDK 19 version string starting with Initial RC promotion B35 on August 11, 2022
JDK-8291448 Test jdk/javadoc/tool/CheckManPageOptions.java after manpage update
JDK-8291181 Update nroff pages in JDK 19 before RC

Dean Long, Oracle

Bug Summary
JDK-8291349 AArch64: C2 compilation fails with guarantee(!true || (true && (shift != 0))) failed: impossible encoding

Erik Gahlin, Oracle

Bug Summary
JDK-8291263 15% increase in JFR footprint in Noop-Base
JDK-8291380 jdk.jfr.consumer.RecordedThread.getId references Thread::getId, should be Thread::threadId
JDK-8291747 jdk/jfr/event/runtime/TestClassLoaderStatsEvent.java Value not equal to 2, field='hiddenClassCount', value='0'
JDK-8291271 JFR: Change package name of snippet files
JDK-8291269 JFR: Incorrect error message when starting recording with missing .jfc file

Emanuel Peter, Oracle

Bug Summary
JDK-8291274 remove memory_operand assert for spilled instructions

Feilong Jiang, Huawei

Bug Summary
JDK-8297722 compiler/runtime/TestConstantsInError.java fails on riscv
JDK-8297678 Increase InlineSmallCode default from 1000 to 2500 for RISC-V
JDK-8294457 riscv: Fix build warnings-as-errors with GCC 11

gaurav.chaudhari, IBM

Bug Summary
JDK-8294491 [REDO] DST not applying properly with zone id offset set with TZ env variable

georgeadams1995, Independent

Bug Summary
JDK-8291742 Bump macOS GitHub actions to macOS 11
JDK-8291259 Restore cancel-in-progress in GHA
JDK-8291258 Rewrite of GitHub Actions (GHA) sanity tests

Hannes Wallnoefer, Oracle

Bug Summary
JDK-8291275 Empty spans in mobile navigation markup
JDK-8293726 JQuery UI license file not updated
JDK-8291273 Problematic fix for font boosting

Ioi Lam, Oracle

Bug Summary
JDK-8291440 CDS cannot archive lamda proxy with useImplMethodHandle

Ichiroh Takiguchi, IBM

Bug Summary
JDK-8296230 CustomTzIDCheckDST.java testcase failed on AIX platform

Igor Veresov, Oracle

Bug Summary
JDK-8291175 -Xcomp is missing from java launcher documentation
JDK-8291356 Very slow C1 arraycopy jcstress tests after JDK-8279886

Jatin Bhateja, Intel

Bug Summary
JDK-8291381 C2 crash: assert(t->meet(t0) == t) failed: Not monotonic
JDK-8291434 C2: Error: ShouldNotReachHere() in Type::typerr()

jena.nibedita, Oracle

Bug Summary
JDK-8297128 java/security/cert/pkix/policyChanges/TestPolicy.java is failing

Jonathan Gibbons, Oracle

Bug Summary
JDK-8291354 Bogus warning generated for record with compact constructor
JDK-8291355 Broken links on constant-values page
JDK-8291171 Document set of strings javac recognizes for SuppressWarnings
JDK-8291264 jdk/javadoc/doclet/testTagMisuse/TestTagMisuse.java fails after JDK-8288545
JDK-8291262 Missing space in error message

Jan Lahoda, Oracle

Bug Summary
JDK-8294269 A false cyclic inheritance error reported
JDK-8291409 A NullPointerException thrown from guard expression
JDK-8294268 Duplicate ldc generated by javac
JDK-8294443 java.lang.AssertionError at at jdk.compiler/com.sun.tools.javac.code.Scope$ScopeImpl.leave(Scope.java:386)
JDK-8291394 Pattern domination not working properly for record patterns
JDK-8291320 VerifyError with JEP 405 pattern match

Joe Wang, Oracle

Bug Summary
JDK-8291284 broken link in java.xml
JDK-8291314 Document.normalizeDocument() produces different results
JDK-8291179 Improve XSLT XPath operators count efficiency
JDK-8291433 jcup.md missing additional text
JDK-8291432 Missing notice in dom.md
JDK-8291407 Update java.xml module-info

Jaikiran Pai, Oracle

Bug Summary
JDK-8291340 broken link in com.sun.net.httpserver.SimpleFileServer
JDK-8291341 tools/jlink/plugins/CompressorPluginTest.java test failing

Jorn Vernee, Oracle

Bug Summary
JDK-8291402 Canonicalize header ids in foreign API javadocs
JDK-8291416 j.l.foreign.VaList::nextVarg call could throw IndexOutOfBoundsException or even crash the VM
JDK-8291419 j.l.foreign.VaList::skip call could throw java.lang.IndexOutOfBoundsException: Out of bound access on segment
JDK-8291403 SegmentAllocator::allocateUtf8String(String str) should be clarified for strings containing \0
JDK-8291417 Specification of method j.l.foreign.VaList::skip deserves clarification

Vladimir Kozlov, Oracle

Bug Summary
JDK-8292518 [BACKOUT] JDK-8279219: [REDO] C2 crash when allocating array of size too large

Lance Andersen, Oracle

Bug Summary
JDK-8292784 Back out the fix forJDK-8281962 from jdk19u
JDK-8291272 broken link in java.base/java/util/zip/package-summary.html
JDK-8292517 Revert unintentional change to deflate.c

Ludovic Henry, Rivos

Bug Summary
JDK-8297601 Fix PaX check on RISC-V

Man Cao, Google

Bug Summary
JDK-8295004 Build failure with Clang 14+ due to function warning attribute
JDK-8297287 Remove sysThreadAvailableStackWithSlack from hotspot-symbols
JDK-8296267 SIGQUIT and jcmd attaching mechanism does not work with signal chaining library

Matthias Baesken, SAP

Bug Summary
JDK-8291382 [test] java/lang/ProcessBuilder/Basic.java fails on Alpine/musl
JDK-8294761 Build failures with GCC 11, Alpine 3 due to incompatible casts from nullptr

Maurizio Cimadamore, Oracle

Bug Summary
JDK-8291744 java/foreign/TestUnsupportedPlatform fails after JDK-8290455
JDK-8291421 Javadoc for MemorySegment/MemoryAddress getter/setters contains some typos
JDK-8291450 jck test api/java_lang/foreign/VaList/Empty.html fails on some platforms
JDK-8291395 Need spec clarification of j.l.foreign.*Layout
JDK-8291412 Revisit implementation of memory session
JDK-8291350 SegmentAllocator::allocateArray null handling is too lax
JDK-8291420 SegmentAllocator:allocate() can return null some cases
JDK-8291282 SegmentAllocator:allocate(long bytesSize) not throwing IAEx when bytesSize < 0
JDK-8291345 SegmentAllocator:allocateArray(*) default behavior mismatch to spec
JDK-8291422 SegmentAllocator:allocateArray(MemoryLayout, count) does not throw IAEx when count is -1
JDK-8291375 SegmentAllocator:allocateUtf8String(String str) default behavior mismatch to spec
JDK-8291442 Typo in javadoc of MemorySegment/MemoryAddress

Martin Doerr, SAP

Bug Summary
JDK-8291411 [PPC64] JfrGetCallTrace: assert(_pc != nullptr) failed: must have PC
JDK-8291268 jni/nullCaller/NullCallerTest.java failing (ppc64)

Markus Grönlund, Oracle

Bug Summary
JDK-8291441 JFR: Cannot resolve method
JDK-8291270 JFR: Disabling the JfrThreadSampler commits only a partially disabled state
JDK-8291410 JFR: Thread checkpoint no longer enforce mutual exclusion post Loom integration
JDK-8291304 misc tests fail "assert(ms < 1000) failed: Un-interruptable sleep, short time use only"

Mark Reinhold, Oracle

Bug Summary
JDK-8291746 Snippetize modules API examples

Naoto Sato, Oracle

Bug Summary
JDK-8291312 Files.readString ignores encoding errors for UTF-16
JDK-8291373 ISO 4217 Amendment 172 Update
JDK-8291370 Recommend Locale.of() method instead of the constructor

Peter Levart, Independent

Bug Summary
JDK-8292151 java/io/ObjectStreamClass/ObjectStreamClassCaching.java fails with various GCs

Pengfei Li, ARM

Bug Summary
JDK-8291439 C2: Assert failed in PhaseCFG::verify() after JDK-8183390

Pavel Rappo, Oracle

Bug Summary
JDK-8291169 Allow @systemProperty to appear in overview documentation
JDK-8291437 Bad result for the snippet @link tag if substring/regex consists of whitespace
JDK-8291383 Incorrect HTML generation for copied javadoc with multiple @throws tags
JDK-8291180 Using @inheritDoc in an inapplicable context shouldn't crash javadoc
JDK-8291393 {@inheritDoc} only copies one instance of the specified exception

Philip Race, Oracle

Bug Summary
JDK-8291741 Update FreeType to 2.12.1
JDK-8291257 Update HarfBuzz to 4.4.1

Claes Redestad, Oracle

Bug Summary
JDK-8291352 Footprint regression due MH creation when initializing StringConcatFactory

Raffaello Giulietti, Oracle

Bug Summary
JDK-8291369 Random:from() adapter does not delegate to supplied generator in all cases

Robert Mckenna, Oracle

Bug Summary
JDK-8294762 Bad Thread Utilization in ForkJoinPool
JDK-8293730 CarrierThread.blocking not reset when spare not activated
JDK-8293732 jdk/internal/misc/TerminatingThreadLocal/TestTerminatingThreadLocal.java failed "AssertionError: Expected terminated values: [666] but got: []"
JDK-8291256 jtreg test com/sun/jndi/ldap/LdapPoolTimeoutTest.java fails intermittently in nightly run
JDK-8293731 TerminatingThreadLocal(s) not registered from virtual thread(s)
JDK-8294517 Update jdk19u fix version to 19.0.2

Roland Westrelin, Red Hat

Bug Summary
JDK-8291438 Apache Lucene triggers: DEBUG MESSAGE: duplicated predicate failed which is impossible

Ron Pressler, Oracle

Bug Summary
JDK-8291392 serviceability/jvmti/vthread/ContStackDepthTest/ContStackDepthTest.java failing
JDK-8291279 serviceability/jvmti/vthread/ContStackDepthTest/ContStackDepthTest.java failing in loom repo with Xcomp
JDK-8291280 VThreadMonitorTest fails "assert(!current->cont_fastpath() || (current->cont_fastpath_thread_state() && !interpreted_native_or_deoptimized_on_stack(current))) failed"

Richard Reingruber, SAP

Bug Summary
JDK-8291308 C1: LIR_OpVisitState::maxNumberOfOperands too small

Ramkumar Sunderbabu, Oracle

Bug Summary
JDK-8295897 com/sun/management/OperatingSystemMXBean/TestTotalSwap.java: Expected total swap size ... but getTotalSwapSpaceSize returned ...

Srikanth Adayapalam, Oracle

Bug Summary
JDK-8296021 TYPE_USE annotations on generic type arguments of record components discarded

Sergey Bylokhov, Amazon

Bug Summary
JDK-8291377 getLocalGraphicsEnvironment() on for multi-screen setups throws exception NPE
JDK-8296397 Move the "sizecalc.h" to the correct location
JDK-8297540 One more cast in SAFE_SIZE_NEW_ARRAY2

Aleksey Shipilev, Red Hat

Bug Summary
JDK-8291281 GCC 12 fails to build zReferenceProcessor.cpp
JDK-8297775 Memory leak in ShenandoahFullGC
JDK-8295904 Optimized builds are broken due to incorrect assert_is_rfp shortcuts
JDK-8296525 S390X: Optimized builds are broken
JDK-8296524 sun/security/pkcs11/Signature/TestDSAKeyLength.java fails when NSS version detection fails

Stuart Marks, Oracle

Bug Summary
JDK-8291396 Map::replaceAll javadoc has redundant @throws clauses
JDK-8291404 wrong wording in @param doc for HashMap.newHashMap et. al.

Serguei Spitsyn, Oracle

Bug Summary
JDK-8291415 fatal error: stuck in JvmtiVTMSTransitionDisabler::disable_VTMS_transitions
JDK-8291378 GetThreadState returns 0 for virtual thread that has terminated
JDK-8291379 JVMTI SelfSuspendDisablerTest.java failed with RuntimeException: Test FAILED: Unexpected thread state
JDK-8291310 serviceability/jvmti/vthread/GetSetLocalTest failed with assert: Not supported for heap frames

Thomas Stuefe, SAP

Bug Summary
JDK-8291401 Build warning in methodData.cpp memset zero-length parameter
JDK-8291388 Memory corruption with CPU_ALLOC, CPU_FREE on muslc

Tobias Hartmann, Oracle

Bug Summary
JDK-8294452 AArch64: CMN should be handled the same way as CMP
JDK-8295905 AES-CTR cipher state corruption with AVX-512
JDK-8295907 assert(ctrl == kit.control()) failed: Control flow was added although the intrinsic bailed out
JDK-8294449 assert(false) failed: infinite loop in PhaseIterGVN::optimize
JDK-8294445 Assertion in PhaseIdealLoop::skeleton_predicate_has_opaque after JDK-8289127
JDK-8294447 C1: Missing access check on non-accessible class
JDK-8297511 C2 compilation fails with assert "non-reduction loop contains reduction nodes"
JDK-8294559 C2: assert(BoolTest(btest).is_canonical()) failure
JDK-8294446 C2: assert(r != __null && r->is_Region()) failed: this phi must have a region
JDK-8297506 C2: fix and simplify IdealLoopTree::do_remove_empty_loop
JDK-8297509 C2: PhaseCCP: remove not visited nodes, prevent type inconsistency
JDK-8295906 CI: ciBytecodeStream::get_klass() is not consistent
JDK-8294450 Incorrect result when switching to C2 OSR compilation from C1
JDK-8297508 misc tests failed "assert(false) failed: graph should be schedulable"
JDK-8297512 missing is_unloading() check in SharedRuntime::fixup_callers_callsite()
JDK-8294444 Segfault at PhaseIdealLoop::clone_loop_handle_data_uses
JDK-8297510 SIGSEGV in PhaseIdealLoop::build_loop_late_post_work
JDK-8294448 StringConcat::validate_mem_flow asserts with "unexpected user: StoreI"
JDK-8294451 test fails "assert(init != __null) failed: initialization not found"
JDK-8294453 Trampoline not created for far runtime targets outside small CodeCache
JDK-8291372 Unreachable loop is not removed from C2 IR, leading to a broken graph

Thomas Schatzl, Oracle

Bug Summary
JDK-8292516 Allocating card table before heap causes underflow asserts in CardTable::addr_for()
JDK-8291344 BlockLocationPrinter fails to decode addresses with G1
JDK-8293727 G1 remembered set memory footprint regression after JDK-8286115
JDK-8292149 Race freeing remembered set segments

Tyler Steele, IBM

Bug Summary
JDK-8291386 S390X: Fix crashes after JDK-8284161 (Virtual Threads)

Vladimir Kempik, Independent

Bug Summary
JDK-8291405 buffer overflow in MTLVertexCache.m: MTLVertexCache_AddGlyphQuad
JDK-8297599 RISC-V: improve performance of copy_memory stub
JDK-8294243 RISC-V: Need to save and restore callee-saved FloatRegisters in StubGenerator::generate_call_stub

Vladimir Ivanov, Oracle

Bug Summary
JDK-8291376 C2: Loop opts are missing during OSR compilation

Vicente Arturo Romero Zaldivar, Oracle

Bug Summary
JDK-8295757 Raw inner class constructor ref should not perform diamond inference

Victor Rudometov, Amazon

Bug Summary
JDK-8296716 BuildEEBasicConstraints.java test fails with SunCertPathBuilderException
JDK-8297365 closed sun/java2d/GdiRendering/ClipShapeRendering.java failed with "Incorrect color ffeeeeee instead of ff0000ff in pixel (100, 100)"
JDK-8297363 javax/sound/midi/Sequencer/MetaCallback.java failed with timeout
JDK-8297280 javax/swing/JTree/6263446/bug6263446.java fails intermittently on a VM
JDK-8297942 NullPointerException with invalid pattern matching construct in constructor call
JDK-8297282 Regression Test CoordinateTruncationBug.java fails on OL8.3
JDK-8297524 sun/java2d/DirectX/OnScreenRenderingResizeTest/OnScreenRenderingResizeTest.java fails
JDK-8297575 sun/java2d/DirectX/OnScreenRenderingResizeTest/OnScreenRenderingResizeTest.java fails again
JDK-8297574 Update sun/java2d/DirectX/OnScreenRenderingResizeTest/OnScreenRenderingResizeTest.java
JDK-8297368 Write a test to verify the content change of TextArea sends TextEvent

Xiaohong Gong, ARM

Bug Summary
JDK-8291265 AArch64: Fix register issues in SVE backend match rules

Xiaolin Zheng, Alibaba

Bug Summary
JDK-8297460 [Aarch64] C2: assert(false) failed: bad AD file
JDK-8297337 RISC-V: C1: Fix LIRGenerator::do_LibmIntrinsic
JDK-8297463 RISC-V: C2: assert(false) failed: bad AD file
JDK-8297339 RISC-V: Fix temp usages of heapbase register killed by MacroAssembler::en/decode_klass_not_null

Yoshiki Sato, Oracle

Bug Summary
JDK-8293728 (tz) Update Timezone Data to 2022c
JDK-8294553 (tz) Update Timezone Data to 2022d
JDK-8295243 (tz) Update Timezone Data to 2022e
JDK-8296110 (tz) Update Timezone Data to 2022f
JDK-8292144 Add legacy tz tests to OpenJDK
JDK-8296828 CLDR v42 update for tzdata 2022f
JDK-8292148 System.loadLibrary does not work on Big Sur if JDK is built with macOS SDK 10.15 and earlier

Zhengyu Gu, Independent

Bug Summary
JDK-8291436 Shenandoah: disable Loom for iu mode