PUSHES REPORT: 21.0.1

This report shows who pushed the backports to the given release. This usually shows who did the backporting, testing, and review work.

Report generated: Sun Mar 03 10:25:22 CET 2024

Distribution by priority

Count Priority
1 P1
39 P2
107 P3
110 P4
2 P5

Distribution by components

Count Component
259 100% Total
112 43.2% hotspot
34 13.1% hotspot/compiler
34 13.1% hotspot/runtime
16 6.2% hotspot/jfr
14 5.4% hotspot/gc
7 2.7% hotspot/jvmti
3 1.2% hotspot/svc
2 0.8% hotspot/svc-agent
1 0.4% hotspot
1 0.4% hotspot/test
55 21.2% core-libs
13 5.0% core-libs/java.lang
6 2.3% core-libs/java.lang.foreign
6 2.3% core-libs/java.net
4 1.5% core-libs
3 1.2% core-libs/java.util.concurrent
3 1.2% core-libs/java.util
3 1.2% core-libs/java.lang.invoke
3 1.2% core-libs/java.nio
2 0.8% core-libs/java.time
2 0.8% core-libs/java.text
2 0.8% core-libs/javax.naming
1 0.4% core-libs/java.nio.charsets
1 0.4% core-libs/java.lang:class_loading
1 0.4% core-libs/javax.lang.model
1 0.4% core-libs/java.util.regex
1 0.4% core-libs/java.util:collections
1 0.4% core-libs/java.io
1 0.4% core-libs/java.lang:reflect
1 0.4% core-libs/java.util.jar
34 13.1% tools
21 8.1% tools/javac
5 1.9% tools/javadoc(tool)
3 1.2% tools/jpackage
3 1.2% tools/jlink
1 0.4% tools/jshell
1 0.4% tools/launcher
17 6.6% infrastructure
14 5.4% infrastructure/build
2 0.8% infrastructure
1 0.4% infrastructure/release_eng
16 6.2% security-libs
10 3.9% security-libs/java.security
2 0.8% security-libs/javax.net.ssl
2 0.8% security-libs/javax.crypto:pkcs11
2 0.8% security-libs/javax.crypto
11 4.2% client-libs
4 1.5% client-libs/2d
4 1.5% client-libs/java.awt
2 0.8% client-libs/javax.accessibility
1 0.4% client-libs/javax.sound
10 3.9% core-svc
3 1.2% core-svc/javax.management
3 1.2% core-svc/debugger
2 0.8% core-svc/tools
1 0.4% core-svc
1 0.4% core-svc/java.lang.management
2 0.8% globalization
2 0.8% globalization/translation
1 0.4% other-libs
1 0.4% other-libs
1 0.4% release-team
1 0.4% release-team

Distribution by affiliation

This Release Pushes

Original Pushes

Count Committer
258 100% Total
156 60.5% Oracle
20 7.8% Tobias Hartmann
10 3.9% Daniel Daugherty
10 3.9% Jan Lahoda
6 2.3% Jim Laskey
6 2.3% Erik Gahlin
6 2.3% Joe Darcy
5 1.9% Markus Grönlund
5 1.9% Rajan Halade
5 1.9% Mandy Chung
5 1.9% Serguei Spitsyn
4 1.6% Jorn Vernee
4 1.6% Angelos Bimpoudis
4 1.6% Justin Lu
3 1.2% Patricio Chilano Mateo
3 1.2% Alan Bateman
3 1.2% Roger Riggs
3 1.2% Valerie Peng
3 1.2% Stefan Karlsson
3 1.2% David Holmes
3 1.2% Chris Plummer
3 1.2% Axel Boldt-Christmas
3 1.2% Alexey Ivanov
3 1.2% Jaikiran Pai
2 0.8% Pavel Rappo
2 0.8% Stuart Marks
2 0.8% Hannes Wallnoefer
2 0.8% Weibing Xiao
2 0.8% Naoto Sato
2 0.8% Alexander Matveev
1 0.4% Albert Yang
1 0.4% Ravi Reddy
1 0.4% Sean Coffey
1 0.4% Maurizio Cimadamore
1 0.4% Darragh Clarke
1 0.4% Robert Mckenna
1 0.4% Kevin Walls
1 0.4% Kim Barrett
1 0.4% Abhishek Kumar
1 0.4% Erik Österlund
1 0.4% Erik Joelsson
1 0.4% Thomas Schatzl
1 0.4% Alexander Zuev
1 0.4% Raffaello Giulietti
1 0.4% Joakim Nordström
1 0.4% johny.jose
1 0.4% Daniel Jelinski
1 0.4% Christian Stein
1 0.4% jena.nibedita
1 0.4% Coleen Phillimore
1 0.4% Jamil Nimeh
1 0.4% Per-Ake Minborg
1 0.4% Jesper Wilhelmsson
1 0.4% Philip Race
40 15.5% Amazon
31 12.0% Aleksey Shipilev
4 1.6% Sergey Bylokhov
2 0.8% Ben Taylor
2 0.8% Oli Gillespie
1 0.4% Paul Hohensee
28 10.9% SAP
17 6.6% Matthias Baesken
10 3.9% Christoph Langer
1 0.4% Martin Doerr
11 4.3% Red Hat
9 3.5% Thomas Stuefe
1 0.4% Frederic Thevenet
1 0.4% Andrew Hughes
8 3.1% Independent
2 0.8% Gui Cao
2 0.8% Chen Liang
1 0.4% zjx001202
1 0.4% Zhengyu Gu
1 0.4% 36649395+airsquared
1 0.4% Archie Cobbs
3 1.2% IBM
2 0.8% Tyler Steele
1 0.4% Sidraya Jayagond
3 1.2% Syntacore
3 1.2% Vladimir Kempik
2 0.8% Huawei
2 0.8% Feilong Jiang
2 0.8% Rivos
2 0.8% Robbin Ehn
1 0.4% ARM
1 0.4% Hao Sun
1 0.4% Azul
1 0.4% Roman Marchenko
1 0.4% BellSoft
1 0.4% Alexandr Scherbatiy
1 0.4% Canonical
1 0.4% Vladimir Petko
1 0.4% Loongson
1 0.4% Qi Ao
Count Committer
258 100% Total
154 59.7% Oracle
12 4.7% Daniel Daugherty
9 3.5% Jan Lahoda
7 2.7% Erik Gahlin
6 2.3% Jim Laskey
6 2.3% Joe Darcy
5 1.9% Markus Grönlund
5 1.9% Alan Bateman
5 1.9% Tobias Hartmann
5 1.9% Serguei Spitsyn
4 1.6% Stefan Karlsson
4 1.6% Angelos Bimpoudis
4 1.6% Rajan Halade
4 1.6% Jaikiran Pai
4 1.6% Mandy Chung
3 1.2% Patricio Chilano Mateo
3 1.2% Valerie Peng
3 1.2% Jorn Vernee
3 1.2% David Holmes
3 1.2% Chris Plummer
3 1.2% Axel Boldt-Christmas
3 1.2% Alexey Ivanov
3 1.2% Justin Lu
2 0.8% Pavel Rappo
2 0.8% Roger Riggs
2 0.8% Matthew Donovan
2 0.8% Eric Nothum
2 0.8% Erik Joelsson
2 0.8% Stuart Marks
2 0.8% Hannes Wallnoefer
2 0.8% Christian Stein
2 0.8% Weibing Xiao
2 0.8% Naoto Sato
2 0.8% Per-Ake Minborg
2 0.8% Alexander Matveev
1 0.4% Albert Yang
1 0.4% Haimay Chao
1 0.4% Douglas Simon
1 0.4% Darragh Clarke
1 0.4% ben.perez
1 0.4% Anthony Scarpino
1 0.4% Tobias Holenstein
1 0.4% Robert Mckenna
1 0.4% Kevin Walls
1 0.4% Kim Barrett
1 0.4% Abhishek Kumar
1 0.4% Erik Österlund
1 0.4% David Leopoldseder
1 0.4% Thomas Schatzl
1 0.4% Alexander Zuev
1 0.4% Raffaello Giulietti
1 0.4% Tom Rodriguez
1 0.4% Emanuel Peter
1 0.4% Damon Fenacci
1 0.4% justin.j.gu
1 0.4% Daniel Jelinski
1 0.4% Lance Andersen
1 0.4% Jamil Nimeh
1 0.4% Jesper Wilhelmsson
1 0.4% Philip Race
1 0.4% Viktor Klang
27 10.5% Amazon
18 7.0% Aleksey Shipilev
4 1.6% Sergey Bylokhov
2 0.8% Jenny Shivayogi
2 0.8% Oli Gillespie
1 0.4% Paul Hohensee
19 7.4% SAP
15 5.8% Matthias Baesken
2 0.8% Christoph Langer
1 0.4% Andreas Steiner
1 0.4% Martin Doerr
18 7.0% Red Hat
11 4.3% Thomas Stuefe
5 1.9% Roland Westrelin
1 0.4% Andrew Haley
1 0.4% Andrew Hughes
11 4.3% Independent
2 0.8% Gui Cao
2 0.8% 128162199+TOatGithub
2 0.8% Chen Liang
1 0.4% Zhengyu Gu
1 0.4% kopp.dev
1 0.4% 36649395+airsquared
1 0.4% Archie Cobbs
1 0.4% mvarada2000
6 2.3% Unknown
6 2.3% N/A
4 1.6% IBM
2 0.8% Tyler Steele
1 0.4% Amit Kumar
1 0.4% Sidraya Jayagond
3 1.2% Intel
3 1.2% Jatin Bhateja
3 1.2% Syntacore
2 0.8% Vladimir Kempik
1 0.4% ilya.gavrilin
2 0.8% Huawei
2 0.8% Feilong Jiang
2 0.8% Loongson
2 0.8% Qi Ao
2 0.8% Rivos
2 0.8% Robbin Ehn
1 0.4% ARM
1 0.4% Hao Sun
1 0.4% BellSoft
1 0.4% Alexandr Scherbatiy
1 0.4% Canonical
1 0.4% Vladimir Petko
1 0.4% DataDog
1 0.4% Richard Startin
1 0.4% Fujitsu
1 0.4% Kimura Yukihiro
1 0.4% Google
1 0.4% Man Cao
1 0.4% VMWare
1 0.4% Vyom Tewari

Chronological push log:

UTC Time This Release Push By Original Push By Bug Summary
Name Affiliation Name Affiliation
2023/09/05 07:25 Jan Lahoda Oracle (same) (same) JDK-8315671 javac -g on a java file which uses unnamed variable leads to ClassFormatError when launching that class
2023/09/05 07:23 Jan Lahoda Oracle (same) (same) JDK-8315670 Incorrect warnings about implicit annotation processing
2023/09/04 20:15 Martin Doerr SAP (same) (same) JDK-8315659 C1 compilation crashes in LinearScan::resolve_exception_edge
2023/09/04 18:29 36649395+airsquared Independent (same) (same) JDK-8315654 jpackage does not work for module projects unless --module-path is specified
2023/09/04 12:50 Roman Marchenko Azul Roland Westrelin Red Hat JDK-8315643 SIGSEGV in PhaseIdealLoop::build_loop_late_post_work due to bad immediate dominator info
2023/09/04 10:13 Alexandr Scherbatiy BellSoft (same) (same) JDK-8315638 [macos] PrinterJob does not take into account Sides attribute
2023/09/04 06:38 Aleksey Shipilev Amazon (same) (same) JDK-8315596 jdk/jfr/jvm/TestGetEventWriter.java fails with non-JVMCI GCs
2023/09/01 06:14 Tobias Hartmann Oracle Tobias Holenstein Oracle JDK-8315497 C2 crash due to unexpected exception control flow
2023/09/01 03:40 Qi Ao Loongson (same) (same) JDK-8315492 The macro definition for LoongArch64 zero build is not accurate.
2023/08/31 15:05 Thomas Stuefe Red Hat Aleksey Shipilev Amazon JDK-8315473 Rename DisableTHPStackMitigation flag to THPStackMitigation
2023/08/31 08:01 Aleksey Shipilev Amazon (same) (same) JDK-8315440 GHA: No need for Debian ports keyring installation after JDK-8313701
2023/08/31 04:03 Sergey Bylokhov Amazon (same) (same) JDK-8315427 MidiSystem.getSoundbank() throws unexpected SecurityException
2023/08/30 21:26 Alexander Matveev Oracle (same) (same) JDK-8315414 [macOS] Developer ID Application Certificate not picked up by jpackage if it contains UNICODE characters
2023/08/30 18:50 Chris Plummer Oracle (same) (same) JDK-8315402 SA fails to properly attach to JVM after having just detached from a different JVM
2023/08/30 17:32 jena.nibedita Oracle Haimay Chao Oracle JDK-8315388 Increase jdk.jar.maxSignatureFileSize default which is too low for JARs such as WhiteSource/Mend unified agent jar
2023/08/30 12:50 Matthias Baesken SAP (same) (same) JDK-8315370 use close after failing os::fdopen in vmError and ciEnv
2023/08/30 05:55 Aleksey Shipilev Amazon Roland Westrelin Red Hat JDK-8315309 C2: Sinking node may cause required cast to be dropped
2023/08/29 13:53 Oli Gillespie Amazon (same) (same) JDK-8315229 JNI NewWeakGlobalRef throws exception for null arg
2023/08/29 13:52 Oli Gillespie Amazon (same) (same) JDK-8315228 SymbolTable can leak Symbols during cleanup
2023/08/29 10:03 Thomas Stuefe Red Hat Man Cao Google JDK-8315218 TEST_BUG: runtime/os/THPsInThreadStackPreventionTest.java could fail on machine with large number of cores
2023/08/29 02:30 Andrew Hughes Red Hat (same) (same) JDK-8315160 GHA: Use GCC Major Version Dependencies Only
2023/08/28 21:20 Sidraya Jayagond IBM Sidraya Jayagond IBM JDK-8315143 [s390] Missing return statement after calling jump_to_native_invoker method in generate_method_handle_dispatch.
2023/08/28 21:14 Tyler Steele IBM (same) (same) JDK-8315142 Test java/foreign/TestByteBuffer.java fails: a problem with msync (aix)
2023/08/28 16:00 Weibing Xiao Oracle (same) (same) JDK-8315126 The socket is not closed in Connection::createSocket when the handshake failed for LDAP connection
2023/08/28 15:42 Thomas Stuefe Red Hat (same) (same) JDK-8315124 WSL Linux build crashes after JDK-8310233
2023/08/28 15:34 Thomas Stuefe Red Hat (same) (same) JDK-8315123 JDK-8303215 is incomplete
2023/08/28 15:34 Thomas Stuefe Red Hat (same) (same) JDK-8315122 THPs cause huge RSS due to thread start timing issue
2023/08/28 15:32 Thomas Stuefe Red Hat (same) (same) JDK-8315119 Improve Metaspace test speed
2023/08/26 05:33 Thomas Stuefe Red Hat (same) (same) JDK-8315068 [linux] SIGSEGV if kernel was built without hugepage support
2023/08/25 20:06 Rajan Halade Oracle (same) (same) JDK-8315056 Add Certigna Root CA - 2
2023/08/25 19:50 Patricio Chilano Mateo Oracle (same) (same) JDK-8315055 SharedRuntime::handle_wrong_method() gets called too often when resolving Continuation.enter
2023/08/25 19:50 Ben Taylor Amazon Richard Startin DataDog JDK-8315054 AsyncGetCallTrace crash on unreadable interpreter method pointer
2023/08/25 18:22 Sean Coffey Oracle Anthony Scarpino Oracle JDK-8314686 ECKeySizeParameterSpec causes too many exceptions on third party providers
2023/08/25 17:00 Aleksey Shipilev Amazon (same) (same) JDK-8315045 GHA: RISC-V should use the official repository for bootstrap
2023/08/24 19:28 Valerie Peng Oracle (same) (same) JDK-8314970 sun/security/pkcs11/KeyStore/CertChainRemoval.java fails after 8301154
2023/08/24 18:05 Roger Riggs Oracle Amit Kumar IBM JDK-8313726 Add missing classpath exception copyright header
2023/08/24 13:00 Aleksey Shipilev Amazon (same) (same) JDK-8314947 Print instruction blocks in byte units
2023/08/24 12:59 Aleksey Shipilev Amazon (same) (same) JDK-8314946 GHA: Drop libfreetype6-dev transitional package in favor of libfreetype-dev
2023/08/24 12:59 Aleksey Shipilev Amazon Kimura Yukihiro Fujitsu JDK-8314945 [TESTBUG] test/hotspot/jtreg/compiler/codecache/CodeCacheFullCountTest.java fails with java.lang.VirtualMachineError
2023/08/24 12:23 Alexey Ivanov Oracle (same) (same) JDK-8314941 Ideographic characters aren't stretched by AffineTransform.scale(2, 1)
2023/08/24 07:41 Matthias Baesken SAP (same) (same) JDK-8314928 some tests fail in case ipv6 is disabled on the machine
2023/08/24 07:30 Matthias Baesken SAP (same) (same) JDK-8314926 increase timeout for jdk/classfile/CorpusTest.java
2023/08/24 06:13 Tyler Steele IBM (same) (same) JDK-8314922 (bf) MappedMemoryUtils passes incorrect arguments to msync (aix)
2023/08/24 06:08 Aleksey Shipilev Amazon (same) (same) JDK-8314921 Shenandoah: sun/tools/jhsdb/heapconfig/JMapHeapConfigTest.java fails
2023/08/24 06:07 Aleksey Shipilev Amazon Thomas Stuefe Red Hat JDK-8314920 runtime/os/TestTrimNative.java is failing on slow machines
2023/08/24 06:06 Aleksey Shipilev Amazon Stefan Karlsson Oracle JDK-8314919 InstanceKlassFlags::print_on doesn't print the flag names
2023/08/24 05:47 Thomas Stuefe Red Hat (same) (same) JDK-8314918 Fix THP detection on Linux
2023/08/23 22:23 David Holmes Oracle (same) (same) JDK-8314902 Test gc/stringdedup/TestStringDeduplicationAgeThreshold.java#ZGenerational timed out
2023/08/23 06:27 Gui Cao Independent (same) (same) JDK-8314854 RISC-V: -XX:MaxVectorSize does not work as expected
2023/08/22 02:46 Feilong Jiang Huawei (same) (same) JDK-8314690 RISC-V: Incorrect VMReg encoding in RISCV64Frame.java
2023/08/22 00:17 Valerie Peng Oracle (same) (same) JDK-8313793 Allocate BadPaddingException only if it will be thrown
2023/08/21 20:59 Alexander Matveev Oracle (same) (same) JDK-8314685 [macos] All signing tests which verifies unsigned app images are failing
2023/08/21 19:16 Angelos Bimpoudis Oracle (same) (same) JDK-8314681 Case enumConstant, pattern compilation fails
2023/08/21 19:16 Angelos Bimpoudis Oracle (same) (same) JDK-8314680 Multiple patterns without unnamed variables
2023/08/21 17:13 Ben Taylor Amazon Lance Andersen Oracle JDK-8314674 Invalid CEN header (invalid zip64 extra data field size)
2023/08/21 15:43 Aleksey Shipilev Amazon Vyom Tewari VMWare JDK-8314660 Socket.setOption(TCP_QUICKACK) uses wrong level
2023/08/21 14:37 Aleksey Shipilev Amazon (same) (same) JDK-8314657 GHA: Cut down cross-compilation sysroots deeper
2023/08/18 11:44 Thomas Schatzl Oracle (same) (same) JDK-8314577 gc/g1/ihop/TestIHOPStatic.java fails due to extra concurrent mark with -Xcomp
2023/08/17 19:10 Raffaello Giulietti Oracle (same) (same) JDK-8314538 MatchResult produces StringIndexOutOfBoundsException for groups outside match
2023/08/17 16:11 Mandy Chung Oracle kopp.dev Independent JDK-8314528 MethodTooLargeException thrown while creating a jlink image
2023/08/16 15:28 Weibing Xiao Oracle (same) (same) JDK-8314443 com.sun.jndi.ldap.Connection.cleanup does not close connections on SocketTimeoutErrors
2023/08/16 06:19 Abhishek Kumar Oracle (same) (same) JDK-8314381 [macOS, Accessibility] VoiceOver: No announcements on JRadioButtonMenuItem and JCheckBoxMenuItem
2023/08/15 07:09 Matthias Baesken SAP (same) (same) JDK-8314257 Improve description of NativeLibrary JFR event
2023/08/15 07:06 Aleksey Shipilev Amazon Jaikiran Pai Oracle JDK-8314256 sun.security.ssl.SSLHandshake.getHandshakeProducer() incorrectly checks handshakeConsumers
2023/08/15 07:02 Aleksey Shipilev Amazon (same) (same) JDK-8314255 Update JMH devkit to 1.37
2023/08/15 07:00 Aleksey Shipilev Amazon Alan Bateman Oracle JDK-8314254 FileDescriptor.sync should temporarily increase parallelism
2023/08/15 06:59 Aleksey Shipilev Amazon Thomas Stuefe Red Hat JDK-8314253 Test serviceability/dcmd/vm/TrimLibcHeapTest.java failed: RSS use increased
2023/08/15 06:58 Aleksey Shipilev Amazon (same) (same) JDK-8314252 java/util/Formatter/Padding.java fails on some Locales
2023/08/15 06:57 Aleksey Shipilev Amazon ben.perez Oracle JDK-8314251 DSA does not reset SecureRandom when initSign is called again
2023/08/10 12:05 Aleksey Shipilev Amazon (same) (same) JDK-8314110 C2: setScopedValueCache intrinsic exposes nullptr pre-values to store barriers
2023/08/10 12:02 Aleksey Shipilev Amazon Thomas Stuefe Red Hat JDK-8314109 New test runtime/os/TestTrimNative.java#trimNative is failing: did not see the expected RSS reduction
2023/08/10 11:56 Aleksey Shipilev Amazon Thomas Stuefe Red Hat JDK-8314107 JVM should trim the native heap
2023/08/10 11:46 Ravi Reddy Oracle Viktor Klang Oracle JDK-8314105 java/util/concurrent/ScheduledThreadPoolExecutor/BasicCancelTest.java timed out and also had jcmd pipe errors
2023/08/10 11:46 Aleksey Shipilev Amazon (same) (same) JDK-8314104 Amend TestLoadIndexedMismatch test to target intrinsic directly
2023/08/09 20:19 Daniel Daugherty Oracle (same) (same) JDK-8314433 ProblemList jdk/jfr/tool/TestView.java on macosx-x64
2023/08/09 20:11 Stefan Karlsson Oracle (same) (same) JDK-8314432 Generational ZGC: gc/z/TestSmallHeap.java failed with OutOfMemoryError
2023/08/09 15:13 Jim Laskey Oracle (same) (same) JDK-8314431 String template fails with java.lang.StringIndexOutOfBoundsException if last fragment is UTF16
2023/08/09 10:46 Jim Laskey Oracle (same) (same) JDK-8314430 Compiler crash when template processor type is a captured wildcard
2023/08/09 08:23 Aleksey Shipilev Amazon (same) (same) JDK-8314017 C1: Incorrect LoadIndexed value numbering
2023/08/09 08:21 Aleksey Shipilev Amazon (same) (same) JDK-8314016 GHA: Bootstrap sysroots with --variant=minbase
2023/08/09 07:56 Tobias Hartmann Oracle (same) (same) JDK-8314429 SuperWord fails due to CMove without matching Bool pack
2023/08/08 17:41 Sergey Bylokhov Amazon (same) (same) JDK-8313965 GCC 7 reports compiler warning in bundled freetype 2.13.0
2023/08/08 14:21 Tobias Hartmann Oracle (same) (same) JDK-8313959 C1 should not inline through interface calls with non-subtype receiver
2023/08/08 14:21 Tobias Hartmann Oracle Damon Fenacci Oracle JDK-8313958 SegmentedCodeCache fails when using large pages
2023/08/08 12:03 Christoph Langer SAP Alan Bateman Oracle JDK-8313950 java/lang/ScopedValue/StressStackOverflow.java takes 9mins in tier1
2023/08/07 23:39 Jesper Wilhelmsson Oracle (same) (same) JDK-8313946 Remove EA from the JDK 21 version string with first RC promotion on August 10, 2023
2023/08/07 08:17 Jan Lahoda Oracle (same) (same) JDK-8313869 Strange error message when switching over long
2023/08/07 07:10 Jan Lahoda Oracle (same) (same) JDK-8313862 javac may crash on a record pattern with too few components
2023/08/04 11:33 Stefan Karlsson Oracle (same) (same) JDK-8313945 Generational ZGC: NMT assert when the heap fails to expand
2023/08/04 09:58 Christoph Langer SAP Daniel Daugherty Oracle JDK-8313755 serviceability/jvmti/thread/GetStackTrace/getstacktr03/getstacktr03.java failing
2023/08/04 09:57 Christoph Langer SAP Daniel Daugherty Oracle JDK-8313754 ProblemList java/lang/ScopedValue/StressStackOverflow.java#default with virtual threads on linux-all
2023/08/04 09:57 Christoph Langer SAP Andrew Haley Red Hat JDK-8313753 java/lang/ScopedValue/StressStackOverflow.java fails with "-XX:-VMContinuations"
2023/08/03 20:49 Justin Lu Oracle N/A Unknown JDK-8313944 JDK 21 RDP2 L10n resource files update
2023/08/03 15:37 Matthias Baesken SAP Andreas Steiner SAP JDK-8313700 c++filt is now ibm-llvm-cxxfilt when using xlc17 / clang on AIX
2023/08/03 15:35 Aleksey Shipilev Amazon (same) (same) JDK-8313699 GHA: Bump GCC versions for July 2023 updates
2023/08/03 15:34 Aleksey Shipilev Amazon (same) (same) JDK-8313696 GCC 6 build failure after JDK-8280982
2023/08/03 15:25 Vladimir Kempik Syntacore (same) (same) JDK-8313695 RISC-V: misaligned memory access in String.Compare intrinsic
2023/08/03 08:47 Matthias Baesken SAP (same) (same) JDK-8313943 jdk/jdk/jfr/jvm/TestChunkIntegrity.java fails with timeout
2023/08/03 07:39 Christoph Langer SAP Per-Ake Minborg Oracle JDK-8313942 AIX : test/jdk/java/foreign/TestLayouts.java fails because of different output - expected [[i4](struct)] but found [[I4](struct)]
2023/08/03 07:37 Christoph Langer SAP mvarada2000 Independent JDK-8313940 [AIX] TestNativeStack.java is failing with exit value 1
2023/08/02 10:58 Jorn Vernee Oracle (same) (same) JDK-8313938 Return value corrupted when using CCS + isTrivial (mainline)
2023/08/02 08:18 Aleksey Shipilev Amazon (same) (same) JDK-8313603 Linux: Provide the option to override the timer slack
2023/08/02 07:32 Christoph Langer SAP 128162199+TOatGithub Independent JDK-8313937 Exclude failing multicast tests on AIX
2023/08/02 07:31 Christoph Langer SAP (same) (same) JDK-8313936 Fix section label in test/jdk/ProblemList.txt
2023/08/02 06:36 Tobias Hartmann Oracle (same) (same) JDK-8312573 Failure during CompileOnly parsing leads to ShouldNotReachHere
2023/08/01 23:00 Justin Lu Oracle (same) (same) JDK-8313935 [Doc] MessageFormat null locale generates NullPointerException
2023/08/01 14:35 Roger Riggs Oracle (same) (same) JDK-8313934 Clarify return value of Java Time compareTo methods
2023/08/01 07:39 Christoph Langer SAP (same) (same) JDK-8313542 Disable runtime/ErrorHandling/MachCodeFramesInErrorFile.java on ppc64le
2023/08/01 07:29 Matthias Baesken SAP (same) (same) JDK-8313523 Improve assertions in growableArray
2023/08/01 07:12 Matthias Baesken SAP (same) (same) JDK-8313511 make JDKOPT_CHECK_CODESIGN_PARAMS more verbose
2023/08/01 07:12 Matthias Baesken SAP Rajan Halade Oracle JDK-8313508 security/infra/java/security/cert/CertPathValidator/certification/AmazonCA.java fails
2023/08/01 07:09 Matthias Baesken SAP (same) (same) JDK-8313499 Inform about MaxExpectedDataSegmentSize in case of pthread_create failures on AIX
2023/07/31 21:09 David Holmes Oracle (same) (same) JDK-8313541 Update nroff pages in JDK 21 before RC
2023/07/31 14:46 Matthias Baesken SAP (same) (same) JDK-8313418 MAP_FAILED definition seems to be obsolete in src/java.desktop/unix/native/common/awt/fontpath.c
2023/07/31 14:25 Paul Hohensee Amazon (same) (same) JDK-8313416 MonitoringSupport_lock should be unconditionally initialized after 8304074
2023/07/28 15:52 Sergey Bylokhov Amazon (same) (same) JDK-8313540 JDK21: ProblemList java/lang/ScopedValue/StressStackOverflow.java on linux-x86
2023/07/28 08:36 Aleksey Shipilev Amazon Erik Joelsson Oracle JDK-8313305 Reconfigure check should include make/conf/version-numbers.conf
2023/07/28 07:11 Matthias Baesken SAP (same) (same) JDK-8313301 Some G1 specific tests do not set -XX:+UseG1GC
2023/07/28 06:59 Tobias Hartmann Oracle (same) (same) JDK-8313539 Temporarily disable "malformed control flow" assert to reduce noise
2023/07/28 06:42 Matthias Baesken SAP (same) (same) JDK-8313298 report some fontconfig related environment variables in hs_err file
2023/07/27 21:41 Christoph Langer SAP 128162199+TOatGithub Independent JDK-8313538 Exclude java/foreign/TestByteBuffer.java on AIX
2023/07/27 16:57 Markus Grönlund Oracle (same) (same) JDK-8313537 SIGSEGV in jfr.internal.event.EventWriter.putUncheckedByte after JDK-8312086
2023/07/26 19:28 Daniel Daugherty Oracle (same) (same) JDK-8313536 ProblemList java/util/concurrent/tck/JSR166TestCase.java on select platforms
2023/07/26 18:51 Daniel Daugherty Oracle (same) (same) JDK-8313535 ProblemList java/util/concurrent/SynchronousQueue/Fairness.java on X64
2023/07/26 11:01 Aleksey Shipilev Amazon (same) (same) JDK-8313178 Remove unused MemAllocator::obj_memory_range
2023/07/25 00:11 Serguei Spitsyn Oracle (same) (same) JDK-8312959 assert(JvmtiEnvBase::environments_might_exist()) failed: to enter event controller, JVM TI environments must exist
2023/07/24 10:09 Daniel Jelinski Oracle (same) (same) JDK-8312958 pkcs11 native libraries make JNI calls into java code while holding GC lock
2023/07/20 14:24 Gui Cao Independent (same) (same) JDK-8312465 TestIRMatching.java fails on RISC-V
2023/07/20 07:40 johny.jose Oracle Jaikiran Pai Oracle JDK-8312207 Launching java with large number of jars in classpath with java.protocol.handler.pkgs system property set can lead to StackOverflowError
2023/07/20 01:23 Valerie Peng Oracle (same) (same) JDK-8312957 Concurrency regression in the PBKDF2 key impl of SunJCE provider
2023/07/19 19:14 Chris Plummer Oracle (same) (same) JDK-8312956 vmTestbase/nsk/jdb/interrupt/interrupt001/interrupt001.java timed out due to missing prompt
2023/07/19 12:09 Vladimir Kempik Syntacore ilya.gavrilin Syntacore JDK-8312389 RISC-V: small improvements to shift immediate instructions
2023/07/19 08:47 Jan Lahoda Oracle (same) (same) JDK-8312955 Incorrect exhaustivity computation
2023/07/19 07:37 Angelos Bimpoudis Oracle (same) (same) JDK-8312954 Crash in dominance check when compiling unnamed patterns
2023/07/18 20:40 Serguei Spitsyn Oracle (same) (same) JDK-8312932 ProblemList serviceability/jvmti/vthread/VThreadTLSTest/VThreadTLSTest.java#id1
2023/07/18 20:36 Serguei Spitsyn Oracle (same) (same) JDK-8312930 GetThreadLocalStorage not working for vthreads mounted during JVMTI attach
2023/07/18 19:26 Markus Grönlund Oracle (same) (same) JDK-8312928 JFR: RecordedThread::getOSThreadId() should return -1 if thread is virtual
2023/07/18 17:50 Jan Lahoda Oracle (same) (same) JDK-8312927 Incorrect exhaustivity computation
2023/07/18 16:48 Mandy Chung Oracle (same) (same) JDK-8312926 Clarify the targetName parameter of Lookup::findClass
2023/07/18 10:22 Joakim Nordström Oracle N/A Unknown JDK-8312925 [JFR] Better handling of tampered JFR repository
2023/07/18 08:22 Jan Lahoda Oracle (same) (same) JDK-8312924 Duplicate qualified enum constants not detected
2023/07/18 08:22 Jan Lahoda Oracle (same) (same) JDK-8312923 Incorrect javadoc comment text
2023/07/14 15:54 Jim Laskey Oracle (same) (same) JDK-8312922 Update man page for javadoc
2023/07/14 14:49 Aleksey Shipilev Amazon Jenny Shivayogi Amazon JDK-8312921 Memory leak in Java_jdk_internal_org_jline_terminal_impl_jna_linux_CLibraryImpl_ttyname_1r
2023/07/14 12:49 Markus Grönlund Oracle (same) (same) JDK-8312920 JFR: Missing stack trace during chunk rotation stress
2023/07/14 11:08 Markus Grönlund Oracle (same) (same) JDK-8312919 fatal error: Possible safepoint reached by thread that does not allow it
2023/07/14 05:13 Alan Bateman Oracle (same) (same) JDK-8312918 StructuredTaskScope.shutdown does not interrupt newly started threads
2023/07/13 22:41 Justin Lu Oracle (same) (same) JDK-8312917 [Fmt-Ch] ChoiceFormat claims impossible and unimplemented functionality
2023/07/13 18:02 Stuart Marks Oracle (same) (same) JDK-8312915 fix deficient spliterators for Sequenced Collections
2023/07/13 16:54 Erik Gahlin Oracle (same) (same) JDK-8312914 Update jfr man page to include recently added features
2023/07/13 14:55 Markus Grönlund Oracle (same) (same) JDK-8312913 JFR TestNativeMemoryUsageEvents fails in huge pages configuration
2023/07/13 11:58 Aleksey Shipilev Amazon Jenny Shivayogi Amazon JDK-8312912 Memory leak in jspawnhelper spawnChild after JDK-8307990
2023/07/13 08:34 Vladimir Petko Canonical Vladimir Petko Canonical JDK-8312911 Please disable runtime/jni/nativeStack/TestNativeStack.java on armhf
2023/07/13 08:30 Tobias Hartmann Oracle Roland Westrelin Red Hat JDK-8312910 C2: crash in SubTypeCheckNode::sub() at IGVN split if
2023/07/13 07:29 Robbin Ehn Rivos (same) (same) JDK-8312908 RISC-V: __builtin___clear_cache can fail silently.
2023/07/12 22:59 Stuart Marks Oracle (same) (same) JDK-8312907 Clarify reversed() default methods' implementation requirements
2023/07/12 18:48 Rajan Halade Oracle (same) (same) JDK-8312906 ListKeychainStore.sh fails in some virtualized environments
2023/07/12 18:17 Rajan Halade Oracle (same) (same) JDK-8312905 Remove SECOM certificate that is expiring in September 2023
2023/07/12 14:28 Patricio Chilano Mateo Oracle (same) (same) JDK-8312904 runtime/handshake/HandshakeTimeoutTest.java fails with "has not cleared handshake op" and SIGILL
2023/07/12 06:49 Alan Bateman Oracle (same) (same) JDK-8312903 ScopedValue throwing StructureViolationException should be clearer
2023/07/11 21:43 Maurizio Cimadamore Oracle N/A Unknown JDK-8312902 Minor doc issue in MemorySegment::copy
2023/07/11 18:44 Alexey Ivanov Oracle (same) (same) JDK-8312901 Wrong visible amount in Adjustable of ScrollPane
2023/07/11 13:56 Patricio Chilano Mateo Oracle (same) (same) JDK-8312900 "assert(!JavaThread::current()->is_interp_only_mode() || !nm->method()->is_continuation_enter_intrinsic() || ContinuationEntry::is_interpreted_call(return_pc)) failed: interp_only_mode but not in enterSpecial interpreted entry" in fixup_callers_callsite
2023/07/11 12:43 Erik Gahlin Oracle (same) (same) JDK-8312899 JFR: Remove t.printStackTrace() in PeriodicEvents
2023/07/11 07:58 Hao Sun ARM (same) (same) JDK-8312898 AArch64: [ZGC] Many tests fail with "assert(allocates2(pc)) failed: not in CodeBuffer memory" on some CPUs
2023/07/09 06:21 Erik Joelsson Oracle (same) (same) JDK-8312897 AC_REQUIRE: `PLATFORM_EXTRACT_TARGET_AND_BUILD' was expanded before it was required
2023/07/07 16:47 Zhengyu Gu Independent (same) (same) JDK-8312896 Leak class loader constraints
2023/07/07 15:48 Naoto Sato Oracle (same) (same) JDK-8312894 Remove unused mapping test files
2023/07/07 13:42 Thomas Stuefe Red Hat (same) (same) JDK-8312893 (process) jspawnhelper should not use argv[0]
2023/07/07 07:08 Tobias Hartmann Oracle Eric Nothum Oracle JDK-8312892 IR framework should not whitelist -XX:-UseTLAB
2023/07/06 19:45 Coleen Phillimore Oracle justin.j.gu Oracle JDK-8312891 ResourceHashtable failed "assert(~(_allocation_t[0] | allocation_mask) == (uintptr_t)this) failed: lost resource object"
2023/07/06 12:54 Tobias Hartmann Oracle David Leopoldseder Oracle JDK-8312889 [JVMCI] compiler/runtime/TestConstantDynamic: lookupConstant returned an object of incorrect type: null
2023/07/06 12:26 Hannes Wallnoefer Oracle (same) (same) JDK-8312888 JavaDoc index comparator is not transitive
2023/07/06 10:43 Pavel Rappo Oracle (same) (same) JDK-8312887 Fix typos in java.base
2023/07/06 07:42 Tobias Hartmann Oracle Jatin Bhateja Intel JDK-8312886 assert(false) failed: EA: missing memory path
2023/07/06 06:29 Tobias Hartmann Oracle Jatin Bhateja Intel JDK-8312885 Incorrect result with unwrapped iotaShuffle.
2023/07/06 01:09 Serguei Spitsyn Oracle (same) (same) JDK-8312884 SIGSEGV in JavaThread::is_interp_only_mode()
2023/07/05 17:47 Rajan Halade Oracle Matthew Donovan Oracle JDK-8312883 Verify TLS_ECDH_* cipher suites cannot be negotiated
2023/07/04 12:45 Axel Boldt-Christmas Oracle (same) (same) JDK-8311379 assert(reserved_rgn != nullptr) failed: Add committed region, No reserved region found
2023/07/04 07:43 Matthias Baesken SAP (same) (same) JDK-8311378 avoid potential leaks in KeystoreImpl.m related to JNU_CHECK_EXCEPTION early returns
2023/07/03 20:58 Mandy Chung Oracle (same) (same) JDK-8311377 Clarify the spec of ClassLoader::getClassLoadingLock for non-parallel capable loader
2023/07/03 10:37 Tobias Hartmann Oracle Douglas Simon Oracle JDK-8311376 guarantee(!HAS_PENDING_EXCEPTION) failed in ExceptionTranslation::doit
2023/07/03 06:58 Matthias Baesken SAP (same) (same) JDK-8311375 Handle problems in core-related tests on macOS when codesign tool does not work
2023/07/01 04:29 Feilong Jiang Huawei (same) (same) JDK-8311212 Re-enable locked_create_entry symbol check in runtime/NMT/CheckForProperDetailStackTrace.java for RISC-V
2023/07/01 02:44 Chen Liang Independent (same) (same) JDK-8311374 Clarify API note in Class::getName and MethodType::toMethodDescriptorString
2023/07/01 02:44 Chen Liang Independent (same) (same) JDK-8311373 Correct range notations in MethodTypeDesc specification
2023/06/30 22:34 Daniel Daugherty Oracle (same) (same) JDK-8311372 ProblemList vmTestbase/nsk/jvmti/scenarios/capability/CM03/cm03t001/TestDescription.java with Xcomp on macosx-x64
2023/06/30 22:34 Daniel Daugherty Oracle (same) (same) JDK-8311371 ProblemList vmTestbase/nsk/jdb/interrupt/interrupt001/interrupt001.java on linux-all
2023/06/30 22:34 Daniel Daugherty Oracle (same) (same) JDK-8311370 ProblemList javax/management/remote/mandatory/connection/ConnectionTest.java with virtual threads on windows-x64
2023/06/30 22:34 Daniel Daugherty Oracle (same) (same) JDK-8311369 ProblemList javax/management/remote/mandatory/connection/DeadLockTest.java with virtual threads on windows-x64
2023/06/30 22:34 Daniel Daugherty Oracle (same) (same) JDK-8311368 disable gc/z/TestHighUsage.java
2023/06/30 22:34 Daniel Daugherty Oracle (same) (same) JDK-8311367 ProblemList javax/management/remote/mandatory/subjectDelegation/SubjectDelegation1Test.java on linux-aarch64
2023/06/30 13:16 Axel Boldt-Christmas Oracle (same) (same) JDK-8311366 ProblemList gc/z/TestHighUsage.java with Generational ZGC
2023/06/30 10:26 Tobias Hartmann Oracle N/A Unknown JDK-8311365 C2: assert(false) failed: Bad graph detected in build_loop_late after JDK-8305189
2023/06/29 20:52 Joe Darcy Oracle (same) (same) JDK-8311364 Type in java.lang.reflect.AccessFlag.METHOD_PARAMETER
2023/06/29 13:01 Tobias Hartmann Oracle Roland Westrelin Red Hat JDK-8311363 C2: 8275201 broke constant folding of array store check in some cases
2023/06/29 10:57 Erik Gahlin Oracle (same) (same) JDK-8311362 jdk/jfr/tool/TestView.java can't find event
2023/06/29 00:09 Joe Darcy Oracle (same) (same) JDK-8311361 Note if implicit annotation processing is being used
2023/06/28 19:19 Jorn Vernee Oracle (same) (same) JDK-8311360 Remove 2 malformed java/foreign ProblemList entries
2023/06/28 18:30 Jorn Vernee Oracle (same) (same) JDK-8311359 Linker.Option.firstVariadicArg should specify which index values are valid
2023/06/28 18:26 Tobias Hartmann Oracle Emanuel Peter Oracle JDK-8311358 C2: assert(false) failed: scalar_input is neither phi nor a matchin reduction
2023/06/28 18:21 Rajan Halade Oracle Matthew Donovan Oracle JDK-8311357 sun/security/tools/jarsigner/compatibility/Compatibility.java use wrong key size for EC
2023/06/28 15:48 Archie Cobbs Independent (same) (same) JDK-8311356 javac rejects semicolons in compilation units with no imports
2023/06/28 14:22 Pavel Rappo Oracle (same) (same) JDK-8311355 Fix typo in javac man page
2023/06/28 08:30 Kevin Walls Oracle (same) (same) JDK-8311354 ThreadLists.java inconsistent results
2023/06/28 07:35 Stefan Karlsson Oracle (same) (same) JDK-8311353 Generational ZGC: Lock-order asserts in JVMTI IterateThroughHeap
2023/06/28 05:19 Tobias Hartmann Oracle Jatin Bhateja Intel JDK-8311352 [BACKOUT] 8304450: [vectorapi] Refactor VectorShuffle implementation
2023/06/27 19:56 Joe Darcy Oracle (same) (same) JDK-8311351 typo in the parameter name in @throws of ClassDesc::ofDescriptor
2023/06/27 19:12 Jim Laskey Oracle (same) (same) JDK-8311350 java.util.FormatItemModifier should not be protected
2023/06/27 18:07 Naoto Sato Oracle (same) (same) JDK-8311349 DateTimeFormatter date formats (ISO_LOCAL_DATE) separated with hyphen, not dash
2023/06/27 14:10 Robbin Ehn Rivos (same) (same) JDK-8311348 RISC-V: Add riscv_hwprobe syscall
2023/06/27 01:59 Mandy Chung Oracle (same) (same) JDK-8311347 java/lang/Class/forName/ForNameNames.java fails after being added by JDK-8310242
2023/06/27 01:59 Mandy Chung Oracle (same) (same) JDK-8311346 Clarify the name parameter to Class::forName
2023/06/26 22:35 Joe Darcy Oracle (same) (same) JDK-8311345 Add missing file
2023/06/26 22:35 Joe Darcy Oracle (same) (same) JDK-8311344 Improve location reporting for javac serial lint warnings
2023/06/26 20:29 Christian Stein Oracle (same) (same) JDK-8311314 java -help output for --module-path / -p is incomplete
2023/06/26 15:51 Hannes Wallnoefer Oracle (same) (same) JDK-8311343 Limit key characters in static index pages
2023/06/26 10:09 Jaikiran Pai Oracle (same) (same) JDK-8311342 Thread.interrupt() method's javadoc has an incorrect {@link}
2023/06/26 08:22 Frederic Thevenet Red Hat Erik Gahlin Oracle JDK-8311341 JFR: Display N/A for missing data amount
2023/06/23 23:05 Joe Darcy Oracle (same) (same) JDK-8311340 add note about unnamed module to Elements.getAllModuleElements
2023/06/23 21:59 Jamil Nimeh Oracle (same) (same) JDK-8311339 Expand timeout windows for tests in JDK-8179502
2023/06/23 19:52 Daniel Daugherty Oracle (same) (same) JDK-8311338 JDK21: ProblemList java/lang/ScopedValue/StressStackOverflow.java on generic-x64
2023/06/23 19:48 Alexander Zuev Oracle (same) (same) JDK-8311337 [macOS, Accessibility] VoiceOver: Incorrect announcements of JRadioButton
2023/06/23 11:36 Sergey Bylokhov Amazon (same) (same) JDK-8311336 Reuse stale data to improve DNS resolver resiliency
2023/06/23 04:43 Alan Bateman Oracle (same) (same) JDK-8311335 StructuredTaskScope.join description improvements
2023/06/22 09:38 Erik Gahlin Oracle (same) (same) JDK-8311334 jdk/jfr/event/runtime/TestAgentEvent.java fails due to "missing" dynamic JavaAgent
2023/06/22 08:43 Axel Boldt-Christmas Oracle (same) (same) JDK-8311333 Improve Generational ZGC jtreg testing
2023/06/22 05:48 Tobias Hartmann Oracle Tom Rodriguez Oracle JDK-8311332 [JVMCI] race in CallSiteTargetValue recording
2023/06/22 05:48 Tobias Hartmann Oracle Roland Westrelin Red Hat JDK-8311331 ARM32: TestBooleanVector crashes after 8300257
2023/06/22 05:47 Tobias Hartmann Oracle Eric Nothum Oracle JDK-8311330 C2: assert(final_con == (jlong)final_int) failed: final value should be integer
2023/06/22 05:47 Tobias Hartmann Oracle (same) (same) JDK-8311329 C1: Missing receiver null check in Reference::get intrinsic
2023/06/22 04:24 Jan Lahoda Oracle (same) (same) JDK-8311328 Illegal bytecode for break from if with instanceof pattern matching condition
2023/06/22 04:24 Jan Lahoda Oracle (same) (same) JDK-8311327 Effectivelly final condition not enforced in guards for binding variables from the same case
2023/06/22 03:32 Serguei Spitsyn Oracle (same) (same) JDK-8311326 [REDO] JDK-8307153 JVMTI GetThreadState on carrier should return STATE_WAITING
2023/06/21 17:13 Chris Plummer Oracle (same) (same) JDK-8311325 Test vmTestbase/nsk/jdi/MethodExitRequest/addClassExclusionFilter/filter001/TestDescription.java failed: VMDisconnectedException
2023/06/21 15:10 Darragh Clarke Oracle Darragh Clarke Oracle JDK-8311323 Test java/net/HttpURLConnection/HttpURLConnectionExpectContinueTest.java failed: java.net.BindException: Address already in use
2023/06/21 14:53 Jorn Vernee Oracle N/A Unknown JDK-8311321 VarHandle and slice handle derived from layout are lacking alignment check
2023/06/21 12:34 Vladimir Kempik Syntacore (same) (same) JDK-8310539 RISC-V: String.indexOf intrinsic may produce misaligned memory loads
2023/06/21 09:02 Matthias Baesken SAP (same) (same) JDK-8311319 com/sun/tools/attach/warnings/DynamicLoadWarningTest.java second failure on AIX
2023/06/21 08:13 Per-Ake Minborg Oracle (same) (same) JDK-8311317 Add @sealedGraph for some Panama FFM interfaces
2023/06/21 07:48 Matthias Baesken SAP (same) (same) JDK-8311315 com/sun/tools/attach/warnings/DynamicLoadWarningTest.java fails on AIX
2023/06/20 19:20 Alexey Ivanov Oracle (same) (same) JDK-8311313 ScrollPane insets are incorrect
2023/06/20 17:39 Roger Riggs Oracle (same) (same) JDK-8311310 MIPS builds are broken after JDK-8304913
2023/06/20 16:27 zjx001202 Independent Qi Ao Loongson JDK-8311308 LoongArch64 builds are broken after JDK-8304913
2023/06/20 12:10 David Holmes Oracle (same) (same) JDK-8310443 Clarify EXPERIMENTAL flags comment in hotspot/share/runtime/globals.hpp
2023/06/20 12:02 Jim Laskey Oracle (same) (same) JDK-8310442 Rename JDK-8309595 test to conform
2023/06/20 11:40 Jim Laskey Oracle (same) (same) JDK-8310441 Allow javadoc to process unnamed classes
2023/06/20 10:34 Jan Lahoda Oracle N/A Unknown JDK-8310440 Misplaced "unnamed classes are a preview feature and are disabled by default" error
2023/06/20 01:08 Jaikiran Pai Oracle Christian Stein Oracle JDK-8310439 Update GitHub Actions to use JDK 17 for building jtreg
2023/06/20 01:08 Jaikiran Pai Oracle (same) (same) JDK-8310438 Pin msys2/setup-msys2 github action to a specific commit
2023/06/19 15:29 Erik Gahlin Oracle (same) (same) JDK-8310437 jdk/jfr/event/oldobject/TestArrayInformation.java fails with "Could not find event with class ... as (leak) object"
2023/06/19 14:53 Erik Österlund Oracle (same) (same) JDK-8310436 ZGC: Unbounded asynchronous unmapping can lead to running out of address space
2023/06/19 11:25 Erik Gahlin Oracle (same) (same) JDK-8310435 JFR: View issues
2023/06/19 11:09 Albert Yang Oracle (same) (same) JDK-8310434 ParallelGC young collections very slow in DelayInducer
2023/06/19 08:41 Kim Barrett Oracle (same) (same) JDK-8310433 Incorrect value of 'used' jvmstat counter
2023/06/16 22:44 Philip Race Oracle (same) (same) JDK-8310432 Occasional crashes with pipewire screen capture on Wayland
2023/06/16 21:11 Justin Lu Oracle (same) (same) JDK-8310431 JDK 21 RDP1 L10n resource files update
2023/06/16 10:10 Angelos Bimpoudis Oracle (same) (same) JDK-8310430 Switch with unnamed patterns erroneously non-exhaustive
2023/06/16 00:00 Robert Mckenna Oracle (same) (same) JDK-8310171 Bump version numbers for 21.0.1

No changesets log

JDK-8321530 Release Note: RSA Signature Verification Fails on Signed Data that Does Not Encode Parameters Correctly
JDK-8317100 Release Note: Increase Default Value of the System Property `jdk.jar.maxSignatureFileSize`
JDK-8317095 Release Note: Added Certigna Root CA Certificate
JDK-8312943 12.1.4: Typo in non-normative text explaining candidate main methods
JDK-8312941 Add an anchor to each subcommand option on jfr html page
JDK-8312937 Update the java manpage markdown source for JFR filename expansion
JDK-8312935 StartFlightRecording: consider moving mention of multiple comma-separated parameters to the front
JDK-8312934 Remove spec change docs for JEPs 440 and 441 from the closed repo
JDK-8310450 Restore javac manpage updates
JDK-8310448 Update the index page for specs
JDK-8310447 Update JShell manpage to include TOOLING description
JDK-8310446 Update javac tool page for -proc:full

Committer push log

36649395+airsquared, Independent

Bug Summary
JDK-8315654 jpackage does not work for module projects unless --module-path is specified

Abhishek Kumar, Oracle

Bug Summary
JDK-8314381 [macOS, Accessibility] VoiceOver: No announcements on JRadioButtonMenuItem and JCheckBoxMenuItem

Angelos Bimpoudis, Oracle

Bug Summary
JDK-8314681 Case enumConstant, pattern compilation fails
JDK-8312954 Crash in dominance check when compiling unnamed patterns
JDK-8314680 Multiple patterns without unnamed variables
JDK-8310430 Switch with unnamed patterns erroneously non-exhaustive

Axel Boldt-Christmas, Oracle

Bug Summary
JDK-8311379 assert(reserved_rgn != nullptr) failed: Add committed region, No reserved region found
JDK-8311333 Improve Generational ZGC jtreg testing
JDK-8311366 ProblemList gc/z/TestHighUsage.java with Generational ZGC

Archie Cobbs, Independent

Bug Summary
JDK-8311356 javac rejects semicolons in compilation units with no imports

Alexey Ivanov, Oracle

Bug Summary
JDK-8314941 Ideographic characters aren't stretched by AffineTransform.scale(2, 1)
JDK-8311313 ScrollPane insets are incorrect
JDK-8312901 Wrong visible amount in Adjustable of ScrollPane

Alan Bateman, Oracle

Bug Summary
JDK-8312903 ScopedValue throwing StructureViolationException should be clearer
JDK-8311335 StructuredTaskScope.join description improvements
JDK-8312918 StructuredTaskScope.shutdown does not interrupt newly started threads

Alexandr Scherbatiy, BellSoft

Bug Summary
JDK-8315638 [macos] PrinterJob does not take into account Sides attribute

Alexander Matveev, Oracle

Bug Summary
JDK-8314685 [macos] All signing tests which verifies unsigned app images are failing
JDK-8315414 [macOS] Developer ID Application Certificate not picked up by jpackage if it contains UNICODE characters

Andrew Hughes, Red Hat

Bug Summary
JDK-8315160 GHA: Use GCC Major Version Dependencies Only

Qi Ao, Loongson

Bug Summary
JDK-8315492 The macro definition for LoongArch64 zero build is not accurate.

Albert Yang, Oracle

Bug Summary
JDK-8310434 ParallelGC young collections very slow in DelayInducer

Ben Taylor, Amazon

Bug Summary
JDK-8315054 AsyncGetCallTrace crash on unreadable interpreter method pointer
JDK-8314674 Invalid CEN header (invalid zip64 extra data field size)

Chris Plummer, Oracle

Bug Summary
JDK-8315402 SA fails to properly attach to JVM after having just detached from a different JVM
JDK-8311325 Test vmTestbase/nsk/jdi/MethodExitRequest/addClassExclusionFilter/filter001/TestDescription.java failed: VMDisconnectedException
JDK-8312956 vmTestbase/nsk/jdb/interrupt/interrupt001/interrupt001.java timed out due to missing prompt

Christoph Langer, SAP

Bug Summary
JDK-8313940 [AIX] TestNativeStack.java is failing with exit value 1
JDK-8313942 AIX : test/jdk/java/foreign/TestLayouts.java fails because of different output - expected [[i4](struct)] but found [[I4](struct)]
JDK-8313542 Disable runtime/ErrorHandling/MachCodeFramesInErrorFile.java on ppc64le
JDK-8313937 Exclude failing multicast tests on AIX
JDK-8313538 Exclude java/foreign/TestByteBuffer.java on AIX
JDK-8313936 Fix section label in test/jdk/ProblemList.txt
JDK-8313753 java/lang/ScopedValue/StressStackOverflow.java fails with "-XX:-VMContinuations"
JDK-8313950 java/lang/ScopedValue/StressStackOverflow.java takes 9mins in tier1
JDK-8313754 ProblemList java/lang/ScopedValue/StressStackOverflow.java#default with virtual threads on linux-all
JDK-8313755 serviceability/jvmti/thread/GetStackTrace/getstacktr03/getstacktr03.java failing

Sean Coffey, Oracle

Bug Summary
JDK-8314686 ECKeySizeParameterSpec causes too many exceptions on third party providers

Coleen Phillimore, Oracle

Bug Summary
JDK-8312891 ResourceHashtable failed "assert(~(_allocation_t[0] | allocation_mask) == (uintptr_t)this) failed: lost resource object"

Christian Stein, Oracle

Bug Summary
JDK-8311314 java -help output for --module-path / -p is incomplete

Joe Darcy, Oracle

Bug Summary
JDK-8311345 Add missing file
JDK-8311340 add note about unnamed module to Elements.getAllModuleElements
JDK-8311344 Improve location reporting for javac serial lint warnings
JDK-8311361 Note if implicit annotation processing is being used
JDK-8311364 Type in java.lang.reflect.AccessFlag.METHOD_PARAMETER
JDK-8311351 typo in the parameter name in @throws of ClassDesc::ofDescriptor

Darragh Clarke, Oracle

Bug Summary
JDK-8311323 Test java/net/HttpURLConnection/HttpURLConnectionExpectContinueTest.java failed: java.net.BindException: Address already in use

Daniel Daugherty, Oracle

Bug Summary
JDK-8311368 disable gc/z/TestHighUsage.java
JDK-8311338 JDK21: ProblemList java/lang/ScopedValue/StressStackOverflow.java on generic-x64
JDK-8313535 ProblemList java/util/concurrent/SynchronousQueue/Fairness.java on X64
JDK-8313536 ProblemList java/util/concurrent/tck/JSR166TestCase.java on select platforms
JDK-8311370 ProblemList javax/management/remote/mandatory/connection/ConnectionTest.java with virtual threads on windows-x64
JDK-8311369 ProblemList javax/management/remote/mandatory/connection/DeadLockTest.java with virtual threads on windows-x64
JDK-8311367 ProblemList javax/management/remote/mandatory/subjectDelegation/SubjectDelegation1Test.java on linux-aarch64
JDK-8314433 ProblemList jdk/jfr/tool/TestView.java on macosx-x64
JDK-8311371 ProblemList vmTestbase/nsk/jdb/interrupt/interrupt001/interrupt001.java on linux-all
JDK-8311372 ProblemList vmTestbase/nsk/jvmti/scenarios/capability/CM03/cm03t001/TestDescription.java with Xcomp on macosx-x64

David Holmes, Oracle

Bug Summary
JDK-8310443 Clarify EXPERIMENTAL flags comment in hotspot/share/runtime/globals.hpp
JDK-8314902 Test gc/stringdedup/TestStringDeduplicationAgeThreshold.java#ZGenerational timed out
JDK-8313541 Update nroff pages in JDK 21 before RC

Daniel Jelinski, Oracle

Bug Summary
JDK-8312958 pkcs11 native libraries make JNI calls into java code while holding GC lock

Erik Gahlin, Oracle

Bug Summary
JDK-8310437 jdk/jfr/event/oldobject/TestArrayInformation.java fails with "Could not find event with class ... as (leak) object"
JDK-8311334 jdk/jfr/event/runtime/TestAgentEvent.java fails due to "missing" dynamic JavaAgent
JDK-8311362 jdk/jfr/tool/TestView.java can't find event
JDK-8312899 JFR: Remove t.printStackTrace() in PeriodicEvents
JDK-8310435 JFR: View issues
JDK-8312914 Update jfr man page to include recently added features

Erik Österlund, Oracle

Bug Summary
JDK-8310436 ZGC: Unbounded asynchronous unmapping can lead to running out of address space

Erik Joelsson, Oracle

Bug Summary
JDK-8312897 AC_REQUIRE: `PLATFORM_EXTRACT_TARGET_AND_BUILD' was expanded before it was required

Feilong Jiang, Huawei

Bug Summary
JDK-8311212 Re-enable locked_create_entry symbol check in runtime/NMT/CheckForProperDetailStackTrace.java for RISC-V
JDK-8314690 RISC-V: Incorrect VMReg encoding in RISCV64Frame.java

Frederic Thevenet, Red Hat

Bug Summary
JDK-8311341 JFR: Display N/A for missing data amount

Gui Cao, Independent

Bug Summary
JDK-8314854 RISC-V: -XX:MaxVectorSize does not work as expected
JDK-8312465 TestIRMatching.java fails on RISC-V

Hannes Wallnoefer, Oracle

Bug Summary
JDK-8312888 JavaDoc index comparator is not transitive
JDK-8311343 Limit key characters in static index pages

Hao Sun, ARM

Bug Summary
JDK-8312898 AArch64: [ZGC] Many tests fail with "assert(allocates2(pc)) failed: not in CodeBuffer memory" on some CPUs

jena.nibedita, Oracle

Bug Summary
JDK-8315388 Increase jdk.jar.maxSignatureFileSize default which is too low for JARs such as WhiteSource/Mend unified agent jar

Jan Lahoda, Oracle

Bug Summary
JDK-8312924 Duplicate qualified enum constants not detected
JDK-8311327 Effectivelly final condition not enforced in guards for binding variables from the same case
JDK-8311328 Illegal bytecode for break from if with instanceof pattern matching condition
JDK-8312955 Incorrect exhaustivity computation
JDK-8312923 Incorrect javadoc comment text
JDK-8315670 Incorrect warnings about implicit annotation processing
JDK-8315671 javac -g on a java file which uses unnamed variable leads to ClassFormatError when launching that class
JDK-8313862 javac may crash on a record pattern with too few components
JDK-8310440 Misplaced "unnamed classes are a preview feature and are disabled by default" error
JDK-8313869 Strange error message when switching over long

Jim Laskey, Oracle

Bug Summary
JDK-8310441 Allow javadoc to process unnamed classes
JDK-8314430 Compiler crash when template processor type is a captured wildcard
JDK-8311350 java.util.FormatItemModifier should not be protected
JDK-8310442 Rename JDK-8309595 test to conform
JDK-8314431 String template fails with java.lang.StringIndexOutOfBoundsException if last fragment is UTF16
JDK-8312922 Update man page for javadoc

Justin Lu, Oracle

Bug Summary
JDK-8313935 [Doc] MessageFormat null locale generates NullPointerException
JDK-8312917 [Fmt-Ch] ChoiceFormat claims impossible and unimplemented functionality
JDK-8310431 JDK 21 RDP1 L10n resource files update
JDK-8313944 JDK 21 RDP2 L10n resource files update

Jamil Nimeh, Oracle

Bug Summary
JDK-8311339 Expand timeout windows for tests in JDK-8179502

Joakim Nordström, Oracle

Bug Summary
JDK-8312925 [JFR] Better handling of tampered JFR repository

johny.jose, Oracle

Bug Summary
JDK-8312207 Launching java with large number of jars in classpath with java.protocol.handler.pkgs system property set can lead to StackOverflowError

Jaikiran Pai, Oracle

Bug Summary
JDK-8310438 Pin msys2/setup-msys2 github action to a specific commit
JDK-8311342 Thread.interrupt() method's javadoc has an incorrect {@link}
JDK-8310439 Update GitHub Actions to use JDK 17 for building jtreg

Jorn Vernee, Oracle

Bug Summary
JDK-8311359 Linker.Option.firstVariadicArg should specify which index values are valid
JDK-8311360 Remove 2 malformed java/foreign ProblemList entries
JDK-8313938 Return value corrupted when using CCS + isTrivial (mainline)
JDK-8311321 VarHandle and slice handle derived from layout are lacking alignment check

Jesper Wilhelmsson, Oracle

Bug Summary
JDK-8313946 Remove EA from the JDK 21 version string with first RC promotion on August 10, 2023

Kim Barrett, Oracle

Bug Summary
JDK-8310433 Incorrect value of 'used' jvmstat counter

Kevin Walls, Oracle

Bug Summary
JDK-8311354 ThreadLists.java inconsistent results

Alexander Zuev, Oracle

Bug Summary
JDK-8311337 [macOS, Accessibility] VoiceOver: Incorrect announcements of JRadioButton

Chen Liang, Independent

Bug Summary
JDK-8311374 Clarify API note in Class::getName and MethodType::toMethodDescriptorString
JDK-8311373 Correct range notations in MethodTypeDesc specification

Matthias Baesken, SAP

Bug Summary
JDK-8311378 avoid potential leaks in KeystoreImpl.m related to JNU_CHECK_EXCEPTION early returns
JDK-8313700 c++filt is now ibm-llvm-cxxfilt when using xlc17 / clang on AIX
JDK-8311315 com/sun/tools/attach/warnings/DynamicLoadWarningTest.java fails on AIX
JDK-8311319 com/sun/tools/attach/warnings/DynamicLoadWarningTest.java second failure on AIX
JDK-8311375 Handle problems in core-related tests on macOS when codesign tool does not work
JDK-8313523 Improve assertions in growableArray
JDK-8314257 Improve description of NativeLibrary JFR event
JDK-8314926 increase timeout for jdk/classfile/CorpusTest.java
JDK-8313499 Inform about MaxExpectedDataSegmentSize in case of pthread_create failures on AIX
JDK-8313943 jdk/jdk/jfr/jvm/TestChunkIntegrity.java fails with timeout
JDK-8313511 make JDKOPT_CHECK_CODESIGN_PARAMS more verbose
JDK-8313418 MAP_FAILED definition seems to be obsolete in src/java.desktop/unix/native/common/awt/fontpath.c
JDK-8313298 report some fontconfig related environment variables in hs_err file
JDK-8313508 security/infra/java/security/cert/CertPathValidator/certification/AmazonCA.java fails
JDK-8313301 Some G1 specific tests do not set -XX:+UseG1GC
JDK-8314928 some tests fail in case ipv6 is disabled on the machine
JDK-8315370 use close after failing os::fdopen in vmError and ciEnv

Mandy Chung, Oracle

Bug Summary
JDK-8311346 Clarify the name parameter to Class::forName
JDK-8311377 Clarify the spec of ClassLoader::getClassLoadingLock for non-parallel capable loader
JDK-8312926 Clarify the targetName parameter of Lookup::findClass
JDK-8311347 java/lang/Class/forName/ForNameNames.java fails after being added by JDK-8310242
JDK-8314528 MethodTooLargeException thrown while creating a jlink image

Maurizio Cimadamore, Oracle

Bug Summary
JDK-8312902 Minor doc issue in MemorySegment::copy

Martin Doerr, SAP

Bug Summary
JDK-8315659 C1 compilation crashes in LinearScan::resolve_exception_edge

Markus Grönlund, Oracle

Bug Summary
JDK-8312919 fatal error: Possible safepoint reached by thread that does not allow it
JDK-8312913 JFR TestNativeMemoryUsageEvents fails in huge pages configuration
JDK-8312920 JFR: Missing stack trace during chunk rotation stress
JDK-8312928 JFR: RecordedThread::getOSThreadId() should return -1 if thread is virtual
JDK-8313537 SIGSEGV in jfr.internal.event.EventWriter.putUncheckedByte after JDK-8312086

Naoto Sato, Oracle

Bug Summary
JDK-8311349 DateTimeFormatter date formats (ISO_LOCAL_DATE) separated with hyphen, not dash
JDK-8312894 Remove unused mapping test files

Oli Gillespie, Amazon

Bug Summary
JDK-8315229 JNI NewWeakGlobalRef throws exception for null arg
JDK-8315228 SymbolTable can leak Symbols during cleanup

Patricio Chilano Mateo, Oracle

Bug Summary
JDK-8312900 "assert(!JavaThread::current()->is_interp_only_mode() || !nm->method()->is_continuation_enter_intrinsic() || ContinuationEntry::is_interpreted_call(return_pc)) failed: interp_only_mode but not in enterSpecial interpreted entry" in fixup_callers_callsite
JDK-8312904 runtime/handshake/HandshakeTimeoutTest.java fails with "has not cleared handshake op" and SIGILL
JDK-8315055 SharedRuntime::handle_wrong_method() gets called too often when resolving Continuation.enter

Paul Hohensee, Amazon

Bug Summary
JDK-8313416 MonitoringSupport_lock should be unconditionally initialized after 8304074

Per-Ake Minborg, Oracle

Bug Summary
JDK-8311317 Add @sealedGraph for some Panama FFM interfaces

Pavel Rappo, Oracle

Bug Summary
JDK-8311355 Fix typo in javac man page
JDK-8312887 Fix typos in java.base

Philip Race, Oracle

Bug Summary
JDK-8310432 Occasional crashes with pipewire screen capture on Wayland

Robbin Ehn, Rivos

Bug Summary
JDK-8312908 RISC-V: __builtin___clear_cache can fail silently.
JDK-8311348 RISC-V: Add riscv_hwprobe syscall

Raffaello Giulietti, Oracle

Bug Summary
JDK-8314538 MatchResult produces StringIndexOutOfBoundsException for groups outside match

Rajan Halade, Oracle

Bug Summary
JDK-8315056 Add Certigna Root CA - 2
JDK-8312906 ListKeychainStore.sh fails in some virtualized environments
JDK-8312905 Remove SECOM certificate that is expiring in September 2023
JDK-8311357 sun/security/tools/jarsigner/compatibility/Compatibility.java use wrong key size for EC
JDK-8312883 Verify TLS_ECDH_* cipher suites cannot be negotiated

Roman Marchenko, Azul

Bug Summary
JDK-8315643 SIGSEGV in PhaseIdealLoop::build_loop_late_post_work due to bad immediate dominator info

Robert Mckenna, Oracle

Bug Summary
JDK-8310171 Bump version numbers for 21.0.1

Ravi Reddy, Oracle

Bug Summary
JDK-8314105 java/util/concurrent/ScheduledThreadPoolExecutor/BasicCancelTest.java timed out and also had jcmd pipe errors

Roger Riggs, Oracle

Bug Summary
JDK-8313726 Add missing classpath exception copyright header
JDK-8313934 Clarify return value of Java Time compareTo methods
JDK-8311310 MIPS builds are broken after JDK-8304913

Sergey Bylokhov, Amazon

Bug Summary
JDK-8313965 GCC 7 reports compiler warning in bundled freetype 2.13.0
JDK-8313540 JDK21: ProblemList java/lang/ScopedValue/StressStackOverflow.java on linux-x86
JDK-8315427 MidiSystem.getSoundbank() throws unexpected SecurityException
JDK-8311336 Reuse stale data to improve DNS resolver resiliency

Aleksey Shipilev, Amazon

Bug Summary
JDK-8314945 [TESTBUG] test/hotspot/jtreg/compiler/codecache/CodeCacheFullCountTest.java fails with java.lang.VirtualMachineError
JDK-8314104 Amend TestLoadIndexedMismatch test to target intrinsic directly
JDK-8314017 C1: Incorrect LoadIndexed value numbering
JDK-8315309 C2: Sinking node may cause required cast to be dropped
JDK-8314110 C2: setScopedValueCache intrinsic exposes nullptr pre-values to store barriers
JDK-8314251 DSA does not reset SecureRandom when initSign is called again
JDK-8314254 FileDescriptor.sync should temporarily increase parallelism
JDK-8313696 GCC 6 build failure after JDK-8280982
JDK-8314016 GHA: Bootstrap sysroots with --variant=minbase
JDK-8313699 GHA: Bump GCC versions for July 2023 updates
JDK-8314657 GHA: Cut down cross-compilation sysroots deeper
JDK-8314946 GHA: Drop libfreetype6-dev transitional package in favor of libfreetype-dev
JDK-8315440 GHA: No need for Debian ports keyring installation after JDK-8313701
JDK-8315045 GHA: RISC-V should use the official repository for bootstrap
JDK-8314919 InstanceKlassFlags::print_on doesn't print the flag names
JDK-8314252 java/util/Formatter/Padding.java fails on some Locales
JDK-8315596 jdk/jfr/jvm/TestGetEventWriter.java fails with non-JVMCI GCs
JDK-8314107 JVM should trim the native heap
JDK-8313603 Linux: Provide the option to override the timer slack
JDK-8312921 Memory leak in Java_jdk_internal_org_jline_terminal_impl_jna_linux_CLibraryImpl_ttyname_1r
JDK-8312912 Memory leak in jspawnhelper spawnChild after JDK-8307990
JDK-8314109 New test runtime/os/TestTrimNative.java#trimNative is failing: did not see the expected RSS reduction
JDK-8314947 Print instruction blocks in byte units
JDK-8313305 Reconfigure check should include make/conf/version-numbers.conf
JDK-8313178 Remove unused MemAllocator::obj_memory_range
JDK-8314920 runtime/os/TestTrimNative.java is failing on slow machines
JDK-8314921 Shenandoah: sun/tools/jhsdb/heapconfig/JMapHeapConfigTest.java fails
JDK-8314660 Socket.setOption(TCP_QUICKACK) uses wrong level
JDK-8314256 sun.security.ssl.SSLHandshake.getHandshakeProducer() incorrectly checks handshakeConsumers
JDK-8314253 Test serviceability/dcmd/vm/TrimLibcHeapTest.java failed: RSS use increased
JDK-8314255 Update JMH devkit to 1.37

Sidraya Jayagond, IBM

Bug Summary
JDK-8315143 [s390] Missing return statement after calling jump_to_native_invoker method in generate_method_handle_dispatch.

Stuart Marks, Oracle

Bug Summary
JDK-8312907 Clarify reversed() default methods' implementation requirements
JDK-8312915 fix deficient spliterators for Sequenced Collections

Serguei Spitsyn, Oracle

Bug Summary
JDK-8311326 [REDO] JDK-8307153 JVMTI GetThreadState on carrier should return STATE_WAITING
JDK-8312959 assert(JvmtiEnvBase::environments_might_exist()) failed: to enter event controller, JVM TI environments must exist
JDK-8312930 GetThreadLocalStorage not working for vthreads mounted during JVMTI attach
JDK-8312932 ProblemList serviceability/jvmti/vthread/VThreadTLSTest/VThreadTLSTest.java#id1
JDK-8312884 SIGSEGV in JavaThread::is_interp_only_mode()

Stefan Karlsson, Oracle

Bug Summary
JDK-8314432 Generational ZGC: gc/z/TestSmallHeap.java failed with OutOfMemoryError
JDK-8311353 Generational ZGC: Lock-order asserts in JVMTI IterateThroughHeap
JDK-8313945 Generational ZGC: NMT assert when the heap fails to expand

Thomas Stuefe, Red Hat

Bug Summary
JDK-8312893 (process) jspawnhelper should not use argv[0]
JDK-8315068 [linux] SIGSEGV if kernel was built without hugepage support
JDK-8314918 Fix THP detection on Linux
JDK-8315119 Improve Metaspace test speed
JDK-8315123 JDK-8303215 is incomplete
JDK-8315473 Rename DisableTHPStackMitigation flag to THPStackMitigation
JDK-8315218 TEST_BUG: runtime/os/THPsInThreadStackPreventionTest.java could fail on machine with large number of cores
JDK-8315122 THPs cause huge RSS due to thread start timing issue
JDK-8315124 WSL Linux build crashes after JDK-8310233

Tobias Hartmann, Oracle

Bug Summary
JDK-8311352 [BACKOUT] 8304450: [vectorapi] Refactor VectorShuffle implementation
JDK-8312889 [JVMCI] compiler/runtime/TestConstantDynamic: lookupConstant returned an object of incorrect type: null
JDK-8311332 [JVMCI] race in CallSiteTargetValue recording
JDK-8311331 ARM32: TestBooleanVector crashes after 8300257
JDK-8312886 assert(false) failed: EA: missing memory path
JDK-8313959 C1 should not inline through interface calls with non-subtype receiver
JDK-8311329 C1: Missing receiver null check in Reference::get intrinsic
JDK-8315497 C2 crash due to unexpected exception control flow
JDK-8311363 C2: 8275201 broke constant folding of array store check in some cases
JDK-8311365 C2: assert(false) failed: Bad graph detected in build_loop_late after JDK-8305189
JDK-8311358 C2: assert(false) failed: scalar_input is neither phi nor a matchin reduction
JDK-8311330 C2: assert(final_con == (jlong)final_int) failed: final value should be integer
JDK-8312910 C2: crash in SubTypeCheckNode::sub() at IGVN split if
JDK-8312573 Failure during CompileOnly parsing leads to ShouldNotReachHere
JDK-8311376 guarantee(!HAS_PENDING_EXCEPTION) failed in ExceptionTranslation::doit
JDK-8312885 Incorrect result with unwrapped iotaShuffle.
JDK-8312892 IR framework should not whitelist -XX:-UseTLAB
JDK-8313958 SegmentedCodeCache fails when using large pages
JDK-8314429 SuperWord fails due to CMove without matching Bool pack
JDK-8313539 Temporarily disable "malformed control flow" assert to reduce noise

Thomas Schatzl, Oracle

Bug Summary
JDK-8314577 gc/g1/ihop/TestIHOPStatic.java fails due to extra concurrent mark with -Xcomp

Tyler Steele, IBM

Bug Summary
JDK-8314922 (bf) MappedMemoryUtils passes incorrect arguments to msync (aix)
JDK-8315142 Test java/foreign/TestByteBuffer.java fails: a problem with msync (aix)

Valerie Peng, Oracle

Bug Summary
JDK-8313793 Allocate BadPaddingException only if it will be thrown
JDK-8312957 Concurrency regression in the PBKDF2 key impl of SunJCE provider
JDK-8314970 sun/security/pkcs11/KeyStore/CertChainRemoval.java fails after 8301154

Vladimir Kempik, Syntacore

Bug Summary
JDK-8313695 RISC-V: misaligned memory access in String.Compare intrinsic
JDK-8312389 RISC-V: small improvements to shift immediate instructions
JDK-8310539 RISC-V: String.indexOf intrinsic may produce misaligned memory loads

Vladimir Petko, Canonical

Bug Summary
JDK-8312911 Please disable runtime/jni/nativeStack/TestNativeStack.java on armhf

Weibing Xiao, Oracle

Bug Summary
JDK-8314443 com.sun.jndi.ldap.Connection.cleanup does not close connections on SocketTimeoutErrors
JDK-8315126 The socket is not closed in Connection::createSocket when the handshake failed for LDAP connection

Zhengyu Gu, Independent

Bug Summary
JDK-8312896 Leak class loader constraints

zjx001202, Independent

Bug Summary
JDK-8311308 LoongArch64 builds are broken after JDK-8304913