PUSHES REPORT: 21.0.2

This report shows who pushed the backports to the given release. This usually shows who did the backporting, testing, and review work.

Report generated: Sun Mar 03 07:03:23 CET 2024

Distribution by priority

Count Priority
2 P1
22 P2
69 P3
187 P4
4 P5

Distribution by components

Count Component
284 100% Total
130 45.8% hotspot
53 18.7% hotspot/compiler
44 15.5% hotspot/runtime
13 4.6% hotspot/gc
6 2.1% hotspot/svc
4 1.4% hotspot/jvmti
3 1.1% hotspot
3 1.1% hotspot/test
2 0.7% hotspot/svc-agent
2 0.7% hotspot/jfr
52 18.3% core-libs
11 3.9% core-libs/java.lang
10 3.5% core-libs/java.net
9 3.2% core-libs/java.nio
4 1.4% core-libs/java.util.concurrent
4 1.4% core-libs/java.io
3 1.1% core-libs/java.util.logging
3 1.1% core-libs/java.util
3 1.1% core-libs
2 0.7% core-libs/java.lang.foreign
1 0.4% core-libs/java.rmi
1 0.4% core-libs/java.lang:reflect
1 0.4% core-libs/java.lang.invoke
27 9.5% client-libs
8 2.8% client-libs/2d
7 2.5% client-libs/javax.swing
6 2.1% client-libs
5 1.8% client-libs/java.awt
1 0.4% client-libs/javax.sound
24 8.5% infrastructure
24 8.5% infrastructure/build
23 8.1% tools
10 3.5% tools/javac
5 1.8% tools/jlink
3 1.1% tools/jpackage
2 0.7% tools/jshell
1 0.4% tools/javadoc(tool)
1 0.4% tools/jar
1 0.4% tools
20 7.0% security-libs
11 3.9% security-libs/java.security
3 1.1% security-libs/javax.net.ssl
2 0.7% security-libs/javax.crypto
2 0.7% security-libs
1 0.4% security-libs/jdk.security
1 0.4% security-libs/javax.crypto:pkcs11
8 2.8% core-svc
4 1.4% core-svc/tools
4 1.4% core-svc/debugger

Distribution by affiliation

This Release Pushes

Original Pushes

Count Committer
284 100% Total
88 31.0% Amazon
72 25.4% Aleksey Shipilev
5 1.8% Roy Soumadipta
3 1.1% Roman Kennke
3 1.1% Sergey Bylokhov
2 0.7% Ian Myers
1 0.4% William Kemper
1 0.4% Elif Aslan
1 0.4% Chad Rakoczy
80 28.2% SAP
31 10.9% Matthias Baesken
24 8.5% Christoph Langer
15 5.3% Goetz Lindenmaier
4 1.4% Martin Doerr
2 0.7% Andreas Steiner
2 0.7% Johannes Bechberger
2 0.7% Joachim Kern
69 24.3% Oracle
10 3.5% Alexey Ivanov
8 2.8% Robert Mckenna
7 2.5% Rajan Halade
5 1.8% Jan Lahoda
4 1.4% Ludvig Janiuk
3 1.1% Sean Coffey
3 1.1% Mandy Chung
3 1.1% Manukumar V S
3 1.1% Rajat Mahajan
2 0.7% Angelos Bimpoudis
2 0.7% Brian Burkhalter
2 0.7% Shivangi Gupta
2 0.7% Daniel Fuchs
2 0.7% Tobias Hartmann
2 0.7% Christian Hagedorn
1 0.4% Weijun Wang
1 0.4% Calvin Cheung
1 0.4% Christian Stein
1 0.4% Ravi Reddy
1 0.4% Pavel Rappo
1 0.4% Jayathirth D V
1 0.4% Renjith Kannath Pariyangad
1 0.4% Axel Boldt-Christmas
1 0.4% Jaikiran Pai
1 0.4% Erik Österlund
1 0.4% Ramesh Gangadhar
15 5.3% Independent
4 1.4% Gui Cao
3 1.1% Fei Yang
2 0.7% ier7928
2 0.7% Archie Cobbs
2 0.7% Ilya Gavrilin
1 0.4% Hannes Greule
1 0.4% Laurent Bourgès
14 4.9% Red Hat
5 1.8% Thomas Stuefe
4 1.4% Andrew Leonard
2 0.7% Frederic Thevenet
1 0.4% Severin Gehwolf
1 0.4% Zdenek Zambersky
1 0.4% sxa
4 1.4% IBM
3 1.1% Amit Kumar
1 0.4% Sidraya Jayagond
4 1.4% Rivos
3 1.1% Robbin Ehn
1 0.4% Ludovic Henry
3 1.1% Google
2 0.7% Man Cao
1 0.4% Liam Miller-Cushon
2 0.7% Intel
2 0.7% Sandhya Viswanathan
2 0.7% Syntacore
2 0.7% Vladimir Kempik
1 0.4% Azul
1 0.4% Roman Marchenko
1 0.4% BellSoft
1 0.4% Aleksei Voitylov
1 0.4% Microsoft
1 0.4% v-terrychow
Count Committer
284 100% Total
106 37.3% Oracle
10 3.5% Rajan Halade
6 2.1% Alexey Ivanov
5 1.8% Jan Lahoda
4 1.4% Alan Bateman
3 1.1% Harshitha Onkar
3 1.1% Brian Burkhalter
3 1.1% Ludvig Janiuk
3 1.1% Sean Coffey
3 1.1% Stefan Karlsson
3 1.1% Alex Menkov
3 1.1% Emanuel Peter
3 1.1% Leonid Mesnik
3 1.1% Christian Stein
2 0.7% Calvin Cheung
2 0.7% Roberto Castaneda Lozano
2 0.7% Roger Riggs
2 0.7% Daniel Fuchs
2 0.7% Kevin Walls
2 0.7% Tobias Hartmann
2 0.7% Angelos Bimpoudis
2 0.7% David Holmes
2 0.7% Per-Ake Minborg
2 0.7% Mandy Chung
2 0.7% Christian Hagedorn
1 0.4% Weijun Wang
1 0.4% Sean Mullan
1 0.4% Michael McMahon
1 0.4% Ravi Reddy
1 0.4% Douglas Simon
1 0.4% Pavel Rappo
1 0.4% Jayathirth D V
1 0.4% Leo Korinth
1 0.4% Darragh Clarke
1 0.4% Robert Mckenna
1 0.4% Matthew Donovan
1 0.4% Kim Barrett
1 0.4% Erik Österlund
1 0.4% Erik Joelsson
1 0.4% Rajat Mahajan
1 0.4% Thomas Schatzl
1 0.4% Daniel Daugherty
1 0.4% Magnus Ihse Bursie
1 0.4% Lawrence Andrews
1 0.4% Alexey Semenyuk
1 0.4% Chris Plummer
1 0.4% Prasanta Sadhukhan
1 0.4% Renjith Kannath Pariyangad
1 0.4% Axel Boldt-Christmas
1 0.4% Coleen Phillimore
1 0.4% Kevin Driver
1 0.4% Johan Sjölen
1 0.4% Naoto Sato
1 0.4% Jaikiran Pai
1 0.4% Joe Darcy
1 0.4% daniel.skantz
1 0.4% Serguei Spitsyn
57 20.1% SAP
27 9.5% Matthias Baesken
13 4.6% Christoph Langer
4 1.4% Martin Doerr
4 1.4% Thomas Obermeier
3 1.1% Andreas Steiner
3 1.1% Joachim Kern
2 0.7% Johannes Bechberger
1 0.4% Goetz Lindenmaier
39 13.7% Amazon
22 7.7% Aleksey Shipilev
5 1.8% Roy Soumadipta
4 1.4% Roman Kennke
3 1.1% Sergey Bylokhov
2 0.7% Ian Myers
1 0.4% William Kemper
1 0.4% Xin Liu
1 0.4% Chad Rakoczy
27 9.5% Independent
4 1.4% Gui Cao
4 1.4% mvarada2000
3 1.1% Doug Lea
2 0.7% Quan Anh Mai
2 0.7% Archie Cobbs
1 0.4% Hannes Greule
1 0.4% Zhengyu Gu
1 0.4% Laurent Bourgès
1 0.4% 609083568
1 0.4% 87324768+lawrence-andrew
1 0.4% 145339032+msobiers
1 0.4% dpakri181
1 0.4% Daohan Qu
1 0.4% ier7928
1 0.4% kopp.dev
1 0.4% Ilya Gavrilin
1 0.4% siedlerkiller
26 9.2% Red Hat
9 3.2% Roland Westrelin
8 2.8% Thomas Stuefe
3 1.1% Andrew Leonard
2 0.7% Frederic Thevenet
2 0.7% Severin Gehwolf
1 0.4% Andrew Haley
1 0.4% sxa
8 2.8% Rivos
4 1.4% Robbin Ehn
3 1.1% Tony Printezis
1 0.4% Ludovic Henry
4 1.4% IBM
4 1.4% Amit Kumar
3 1.1% Google
2 0.7% Liam Miller-Cushon
1 0.4% Man Cao
3 1.1% Unknown
3 1.1% N/A
2 0.7% Intel
2 0.7% Sandhya Viswanathan
2 0.7% Loongson
2 0.7% Sun Yaqi
2 0.7% Syntacore
2 0.7% Vladimir Kempik
1 0.4% ARM
1 0.4% Nick Gasson
1 0.4% Azul
1 0.4% Roman Marchenko
1 0.4% BellSoft
1 0.4% Aleksei Voitylov
1 0.4% Huawei
1 0.4% Feilong Jiang
1 0.4% Microsoft
1 0.4% v-terrychow

Chronological push log:

UTC Time This Release Push By Original Push By Bug Summary
Name Affiliation Name Affiliation
2024/01/05 17:57 Tobias Hartmann Oracle (same) (same) JDK-8323082 [BACKOUT] 8318562: Computational test more than 2x slower when AVX instructions are used
2024/01/03 13:30 Ravi Reddy Oracle (same) (same) JDK-8322883 [BACKOUT] 8225377: type annotations are not visible to javac plugins across compilation boundaries
2023/12/14 13:06 Weijun Wang Oracle (same) (same) JDK-8322086 RSA signature verification fails on signed data that does not encode params correctly
2023/11/30 14:15 Roman Kennke Amazon (same) (same) JDK-8321067 Unlock experimental options in EATests.java
2023/11/28 10:32 Christoph Langer SAP (same) (same) JDK-8320869 ProblemList java/lang/invoke/lambda/LambdaFileEncodingSerialization.java on linux-all
2023/11/27 22:12 Martin Doerr SAP (same) (same) JDK-8320812 ppc64 TypeEntries::type_unknown logic looks wrong, missed optimization opportunity
2023/11/27 16:25 Ian Myers Amazon Ian Myers Amazon JDK-8320785 Parallelize sun/security/util/math/TestIntegerModuloP.java
2023/11/27 16:25 Ian Myers Amazon Ian Myers Amazon JDK-8320784 Parallelize gc/stress/TestStressG1Humongous.java test
2023/11/27 16:16 Roman Kennke Amazon (same) (same) JDK-8320783 sun/tools/jhsdb/JStackStressTest.java failed with "InternalError: We should have found a thread that owns the anonymous lock"
2023/11/27 16:12 Aleksey Shipilev Amazon Emanuel Peter Oracle JDK-8320782 ADLC: pass ASSERT and PRODUCT flags
2023/11/27 15:58 Aleksey Shipilev Amazon Andrew Haley Red Hat JDK-8320779 Unbound ScopedValue.get() throws the wrong exception
2023/11/27 15:58 Aleksey Shipilev Amazon Joe Darcy Oracle JDK-8320778 Move most tier 1 vector API regression tests to tier 3
2023/11/27 15:56 Aleksey Shipilev Amazon 145339032+msobiers Independent JDK-8320777 Parallelize sun/security/rsa/SignedObjectChain.java subtests
2023/11/27 15:56 Aleksey Shipilev Amazon Thomas Schatzl Oracle JDK-8320776 Improve performance of Symbol::print_value_on()
2023/11/27 15:55 Aleksey Shipilev Amazon Calvin Cheung Oracle JDK-8320775 Correct the scope of vmtimer in UnregisteredClasses::load_class
2023/11/27 15:53 Roy Soumadipta Amazon (same) (same) JDK-8320774 Parallelize gc/stress/TestStressRSetCoarsening.java test
2023/11/27 14:15 Jan Lahoda Oracle (same) (same) JDK-8320765 jshell - Non-sealed declarations sometimes break a snippet evaluation
2023/11/27 14:15 Jan Lahoda Oracle (same) (same) JDK-8320764 Match on enum constants with body compiles but fails with MatchException
2023/11/27 11:35 Aleksey Shipilev Amazon Roberto Castaneda Lozano Oracle JDK-8320758 [REDO] Generational ZGC: Tests crash with assert(index == 0 || is_power_of_2(index))
2023/11/27 09:06 Axel Boldt-Christmas Oracle (same) (same) JDK-8320742 [AArch64] C2 compilation fails with "Field too big for insn"
2023/11/27 06:00 Gui Cao Independent (same) (same) JDK-8320722 RISC-V: Avoid passing t0 as temp register to MacroAssembler::lightweight_lock/unlock
2023/11/24 08:11 Matthias Baesken SAP (same) (same) JDK-8320693 support loading library members on AIX in os::dll_load
2023/11/22 08:43 Erik Österlund Oracle (same) (same) JDK-8320578 Add missing cross modifying fence in nmethod entry barriers
2023/11/21 16:40 Matthias Baesken SAP (same) (same) JDK-8320531 refresh libraries cache on AIX in print_vm_info
2023/11/21 10:59 Sandhya Viswanathan Intel (same) (same) JDK-8320508 Computational test more than 2x slower when AVX instructions are used
2023/11/21 10:39 Roman Marchenko Azul (same) (same) JDK-8320507 JvmtiEnvBase doesn't zero _ext_event_callbacks
2023/11/21 10:18 Sandhya Viswanathan Intel (same) (same) JDK-8320504 VectorMaskGen clobbers rflags on x86_64
2023/11/21 09:11 Matthias Baesken SAP (same) (same) JDK-8320496 Enhance agentlib:jdwp help output by info about allow option
2023/11/21 09:08 Matthias Baesken SAP (same) (same) JDK-8320488 Add ReleaseIntArrayElements in Java_sun_awt_X11_XlibWrapper_SetBitmapShape XlbWrapper.c to early return
2023/11/21 09:01 Matthias Baesken SAP (same) (same) JDK-8320466 avoid leaks in loadlib_aix.cpp reload_table()
2023/11/21 08:55 Matthias Baesken SAP (same) (same) JDK-8320459 compiler/compilercontrol/TestConflictInlineCommands.java fails intermittent with 'disallowed by CompileCommand' missing from stdout/stderr
2023/11/21 08:18 Christoph Langer SAP Thomas Obermeier SAP JDK-8320457 Fix boundaries of region to be tested with os::is_readable_range
2023/11/21 08:18 Christoph Langer SAP Thomas Obermeier SAP JDK-8320456 Possible out of bounds access in print_pointer_information
2023/11/20 17:56 Rajan Halade Oracle (same) (same) JDK-8320432 Add three eMudhra emSign roots
2023/11/20 15:56 Alexey Ivanov Oracle (same) (same) JDK-8320427 Refactor timeout handler in PassFailJFrame
2023/11/20 15:55 Aleksey Shipilev Amazon (same) (same) JDK-8320426 C1: x86 cmove can use short branches
2023/11/20 15:55 Aleksey Shipilev Amazon (same) (same) JDK-8320425 C1: Replace "cmp reg, 0" with "test reg, reg" on x86
2023/11/20 15:35 Martin Doerr SAP (same) (same) JDK-8320422 Top of lock-stack does not match the unlocked object
2023/11/20 15:32 Alexey Ivanov Oracle (same) (same) JDK-8320420 Use testUI() method of PassFailJFrame.Builder in FileChooserSymLinkTest.java
2023/11/20 15:22 Alexey Ivanov Oracle (same) (same) JDK-8320419 Allow PassFailJFrame.Builder to create test UI
2023/11/20 15:16 Aleksey Shipilev Amazon Darragh Clarke Oracle JDK-8320416 java/lang/Thread/IsAlive.java timed out
2023/11/20 15:16 Aleksey Shipilev Amazon (same) (same) JDK-8320415 GHA: Cross-compile gtest code
2023/11/20 15:08 Alexey Ivanov Oracle (same) (same) JDK-8320414 Update FileChooserSymLinkTest.java to HTML instructions
2023/11/20 14:57 Alexey Ivanov Oracle (same) (same) JDK-8320413 HTML formatting for PassFailJFrame instructions
2023/11/17 14:08 Shivangi Gupta Oracle Magnus Ihse Bursie Oracle JDK-8320316 JAVA_FLAGS removed from jtreg running in JDK-8317039
2023/11/17 14:08 Shivangi Gupta Oracle Ludvig Janiuk Oracle JDK-8320315 Enable specifying the JDK used to run jtreg
2023/11/17 14:03 Alexey Ivanov Oracle 609083568 Independent JDK-8320313 Build failure with GCC8.3.1 after 8313643
2023/11/17 14:03 Alexey Ivanov Oracle Harshitha Onkar Oracle JDK-8320312 Update HarfBuzz to 8.2.2
2023/11/17 10:54 Christoph Langer SAP mvarada2000 Independent JDK-8320307 [AIX] Cleaners.java test failure
2023/11/17 10:51 Christoph Langer SAP Thomas Stuefe Red Hat JDK-8320306 Add user-facing warning if THPs are enabled but cannot be used
2023/11/17 10:51 Christoph Langer SAP Thomas Stuefe Red Hat JDK-8320305 Add regression tests for large page logging and user-facing error messages
2023/11/17 07:15 Robbin Ehn Rivos (same) (same) JDK-8320295 RISC-V: Update hwprobe query for new extensions
2023/11/17 05:10 Rajan Halade Oracle (same) (same) JDK-8320287 Add four DigiCert root certificates
2023/11/16 23:08 Sergey Bylokhov Amazon (same) (same) JDK-8320273 ColorConvertOp.filter for the default destination is too slow
2023/11/16 17:10 Mandy Chung Oracle (same) (same) JDK-8320256 Proxy.newProxyInstance throws NPE if loader is null and interface not visible from class loader
2023/11/16 12:03 sxa Red Hat (same) (same) JDK-8320238 test/jdk/java/io/File/libGetXSpace.c does not compile on Windows 32-bit
2023/11/16 11:56 Amit Kumar IBM (same) (same) JDK-8320236 [s390x] Multiple test failure with LockingMode=2
2023/11/16 11:53 Aleksey Shipilev Amazon Quan Anh Mai Independent JDK-8320235 C2 compilation still fails with "bad AD file"
2023/11/15 20:34 Rajat Mahajan Oracle Harshitha Onkar Oracle JDK-8320203 Update Libpng to 1.6.40
2023/11/15 08:16 Fei Yang Independent Tony Printezis Rivos JDK-8320158 RISC-V: improve MD5 intrinsic
2023/11/15 07:26 Goetz Lindenmaier SAP Joachim Kern SAP JDK-8320153 GtestWrapper crashes with SIGILL in AsyncLogTest::test_asynclog_raw on AIX opt
2023/11/14 21:36 Man Cao Google Serguei Spitsyn Oracle JDK-8320109 missing JVMTI events from vthreads parked during JVMTI attach
2023/11/14 14:52 Matthias Baesken SAP (same) (same) JDK-8320078 Improve exception messages thrown by sun.nio.ch.Net native methods (win)
2023/11/14 14:47 Amit Kumar IBM (same) (same) JDK-8320077 [s390x] Use consistent naming for lightweight locking in MacroAssembler
2023/11/14 14:45 Aleksey Shipilev Amazon (same) (same) JDK-8320076 Atomic gtest should run as TEST_VM to access VM capabilities
2023/11/14 14:45 Aleksey Shipilev Amazon Roland Westrelin Red Hat JDK-8320075 C2: "control input must dominate current control" assert failure
2023/11/14 14:44 Aleksey Shipilev Amazon Stefan Karlsson Oracle JDK-8320074 ContinuationWrapper uses unhandled nullptr oop
2023/11/14 14:39 Jaikiran Pai Oracle (same) (same) JDK-8320072 HttpClient request fails due to connection being considered idle and closed
2023/11/14 14:37 Martin Doerr SAP Amit Kumar IBM JDK-8320071 Utilize existing method frame::interpreter_frame_monitor_size_in_bytes()
2023/11/14 13:37 Pavel Rappo Oracle (same) (same) JDK-8320068 Internal error on spurious markup in a hybrid snippet
2023/11/14 12:56 Matthias Baesken SAP (same) (same) JDK-8320066 increase javacserver connection timeout values and max retry attempts
2023/11/14 12:13 Thomas Stuefe Red Hat (same) (same) JDK-8319922 libCreationTimeHelper.so fails to link in JDK 21
2023/11/14 12:13 Thomas Stuefe Red Hat (same) (same) JDK-8320063 runtime/NMT/VirtualAllocCommitMerge.java may fail if mixing interpreted and compiled native invocations
2023/11/10 15:28 Roman Kennke Amazon N/A Unknown JDK-8319926 Deoptimization results in incorrect lightweight locking stack
2023/11/10 09:49 Aleksey Shipilev Amazon Roberto Castaneda Lozano Oracle JDK-8319887 C2 compilation fails with "Exceeded _node_regs array"
2023/11/10 09:47 Johannes Bechberger SAP (same) (same) JDK-8319886 com/sun/jdi/JdwpOnThrowTest.java failed with "transport error 202: bind failed: Address already in use"
2023/11/10 09:17 Liam Miller-Cushon Google (same) (same) JDK-8319885 type annotations are not visible to javac plugins across compilation boundaries
2023/11/09 16:56 Andrew Leonard Red Hat (same) (same) JDK-8319840 Windows build on WSL broken after JDK-8317340
2023/11/09 15:31 Amit Kumar IBM (same) (same) JDK-8319824 [s390x] Implement alternative fast-locking scheme
2023/11/09 15:29 Andrew Leonard Red Hat (same) (same) JDK-8319823 Windows builds are not reproducible if MS VS compiler install path differs
2023/11/09 07:54 Frederic Thevenet Red Hat (same) (same) JDK-8319774 Change Windows debug symbol files naming to avoid losing info when an executable and a library share the same name
2023/11/09 07:29 Aleksey Shipilev Amazon Quan Anh Mai Independent JDK-8319772 C2 compilation fails with "bad AD file"
2023/11/09 07:28 Aleksey Shipilev Amazon Emanuel Peter Oracle JDK-8319771 C2 SuperWord: wrong result, load should not be moved before store if not comparable
2023/11/09 04:41 Jayathirth D V Oracle (same) (same) JDK-8319769 Additional negative value check in JPEG decoding
2023/11/08 17:42 Alexey Ivanov Oracle Lawrence Andrews Oracle JDK-8319743 Add screen capture functionality to PassFailJFrame
2023/11/08 17:42 Renjith Kannath Pariyangad Oracle Renjith Kannath Pariyangad Oracle JDK-8319742 Invalid TargetDataLine after screen lock when using JFileChooser or COM library
2023/11/08 17:34 Rajan Halade Oracle (same) (same) JDK-8319740 Add Let's Encrypt ISRG Root X2
2023/11/08 15:15 Aleksey Shipilev Amazon Roland Westrelin Red Hat JDK-8319723 PhaseIdealLoop::transform_long_range_checks fails with assert "was tested before"
2023/11/08 14:56 Aleksey Shipilev Amazon Thomas Stuefe Red Hat JDK-8319722 C2: VM may crash after hitting node limit
2023/11/08 14:56 Aleksey Shipilev Amazon David Holmes Oracle JDK-8319721 C2 failed "assert(_stack_guard_state == stack_guard_reserved_disabled) failed: inconsistent state"
2023/11/08 14:52 Aleksey Shipilev Amazon Kim Barrett Oracle JDK-8319720 Build on windows fails after 8316645
2023/11/08 14:52 Aleksey Shipilev Amazon Robbin Ehn Rivos JDK-8319719 RISC-V: Remove dependency on libatomic by adding cmpxchg 1b
2023/11/08 14:51 Aleksey Shipilev Amazon (same) (same) JDK-8319718 [REDO] runtime/InvocationTests spend a lot of time on dependency verification
2023/11/08 13:34 ier7928 Independent (same) (same) JDK-8319712 NMT: summary diff reports threads count incorrectly
2023/11/08 13:33 ier7928 Independent Johan Sjölen Oracle JDK-8319711 Fix memory reporter for thread_count
2023/11/08 13:18 Fei Yang Independent Feilong Jiang Huawei JDK-8319710 RISC-V: Rename *_riscv64.ad files to *_riscv.ad under riscv/gc
2023/11/08 07:32 Goetz Lindenmaier SAP Leo Korinth Oracle JDK-8319688 Fix: make test outputs TEST SUCCESS after unsuccessful exit
2023/11/07 08:35 Johannes Bechberger SAP (same) (same) JDK-8319593 JDWP-agent sends broken exception event with onthrow option
2023/11/06 13:16 Severin Gehwolf Red Hat (same) (same) JDK-8319533 (fs) Add support for BasicFileAttributes.creationTime() for Linux
2023/11/06 08:16 Goetz Lindenmaier SAP Leonid Mesnik Oracle JDK-8319510 OutputAnalyzer.shouldMatchByLine() fails in some cases
2023/11/06 07:56 Goetz Lindenmaier SAP Leonid Mesnik Oracle JDK-8319506 Update applications/scimark/Scimark.java to accept VM flags
2023/11/03 18:20 Andrew Leonard Red Hat Erik Joelsson Oracle JDK-8319418 adlc tries to build with /pathmap but without /experimental:deterministic
2023/11/03 16:22 Andrew Leonard Red Hat (same) (same) JDK-8319411 jrt-fs.jar classes not reproducible between standard and bootcycle builds
2023/11/03 16:09 Calvin Cheung Oracle (same) (same) JDK-8319410 SPECjvm2008/xml.transform with CDS fails with "can't seal package nu.xom"
2023/11/03 13:32 Aleksey Shipilev Amazon (same) (same) JDK-8319385 Enable parallelism in vmTestbase/nsk/monitoring/stress/lowmem tests
2023/11/03 13:25 Martin Doerr SAP (same) (same) JDK-8319384 assert(LockingMode != LM_LIGHTWEIGHT || flag == CCR0) failed: bad condition register
2023/11/03 13:18 Tobias Hartmann Oracle Emanuel Peter Oracle JDK-8319383 C2: add bailout after assert Bad graph detected in build_loop_late
2023/11/02 09:02 Frederic Thevenet Red Hat (same) (same) JDK-8319296 Target OS detection in 'test-prebuilt' makefile target is incorrect when running on MSYS2
2023/11/02 08:29 Matthias Baesken SAP (same) (same) JDK-8319293 compiler/compilercontrol/TestConflictInlineCommands.java fails intermittent with force inline by CompileCommand missing
2023/11/02 08:23 Matthias Baesken SAP (same) (same) JDK-8319292 Adjust describing comment of os_getChildren after 8315026
2023/11/02 07:47 Thomas Stuefe Red Hat (same) (same) JDK-8319288 Class space not marked as such with NMT when CDS is off
2023/11/02 02:03 Gui Cao Independent (same) (same) JDK-8319267 RISC-V: Small refactoring for MacroAssembler::test_bit
2023/11/01 20:27 Goetz Lindenmaier SAP Rajan Halade Oracle JDK-8319250 sun/security/pkcs11/sslecc/ClientJSSEServerJSSE.java fails with ProviderException
2023/11/01 20:26 Goetz Lindenmaier SAP Michael McMahon Oracle JDK-8319249 Code in SendPortZero.java is uncommented even after JDK-8236852 was fixed
2023/11/01 20:24 Goetz Lindenmaier SAP Sun Yaqi Loongson JDK-8319248 java/nio/file/Files/CopyAndMove.java fails when using second test directory
2023/11/01 14:08 Aleksey Shipilev Amazon Roland Westrelin Red Hat JDK-8319227 C2: large byte array clone triggers "failed: malformed control flow" assertion failure on linux-x86
2023/11/01 14:08 Aleksey Shipilev Amazon Roland Westrelin Red Hat JDK-8319226 C2: Load can bypass subtype check that enforces it's from the right object type
2023/11/01 14:01 Aleksey Shipilev Amazon (same) (same) JDK-8319225 Enable parallelism in vmTestbase/nsk/monitoring/stress/thread tests
2023/11/01 14:00 Aleksey Shipilev Amazon (same) (same) JDK-8319223 Enable parallelism in vmTestbase/gc/g1/unloading tests
2023/11/01 14:00 Aleksey Shipilev Amazon (same) (same) JDK-8319222 Enable parallelism in vmTestbase/nsk/monitoring/stress/classload tests
2023/11/01 13:46 Robert Mckenna Oracle Doug Lea Independent JDK-8319221 JDK-8246677 caused 16x performance regression in SynchronousQueue
2023/11/01 13:46 Robert Mckenna Oracle Doug Lea Independent JDK-8319219 java/util/concurrent/SynchronousQueue/Fairness.java failed with "Error: fair=true i=0 j=1"
2023/11/01 13:46 Robert Mckenna Oracle Doug Lea Independent JDK-8319218 LinkedTransferQueue does not respect timeout for poll()
2023/11/01 13:40 Aleksey Shipilev Amazon Sean Mullan Oracle JDK-8319217 NullPointerException in CertStore.getCRLs after 8297955
2023/11/01 13:38 Aleksey Shipilev Amazon Leonid Mesnik Oracle JDK-8319216 java/foreign tests should respect vm flags when start new processes
2023/11/01 13:38 Aleksey Shipilev Amazon Per-Ake Minborg Oracle JDK-8319215 Primitive wrapper caches could be `@Stable`
2023/11/01 13:37 Aleksey Shipilev Amazon (same) (same) JDK-8319214 Rename TestUnstructuredLocking test
2023/11/01 13:37 Aleksey Shipilev Amazon (same) (same) JDK-8319212 make test cannot run .jasm tests directly
2023/11/01 13:36 Aleksey Shipilev Amazon Mandy Chung Oracle JDK-8319210 Improve IllegalAccessException message to include the cause of the exception
2023/10/29 20:44 Goetz Lindenmaier SAP (same) (same) JDK-8319071 [macos] ProblemList java/rmi/registry/multipleRegistries/MultipleRegistries.java
2023/10/26 16:41 Sergey Bylokhov Amazon (same) (same) JDK-8318914 ProblemList containers/docker/TestMemoryAwareness.java on linux-all
2023/10/26 07:35 Hannes Greule Independent (same) (same) JDK-8318881 jcmd GC.heap_dump performance regression after JDK-8292818
2023/10/25 15:52 Manukumar V S Oracle Daniel Daugherty Oracle JDK-8318833 java/awt/Mouse/MouseModifiersUnitTest/MouseModifiersUnitTest_Standard.java fails on macosx-all after JDK-8317751
2023/10/25 15:52 Manukumar V S Oracle 87324768+lawrence-andrew Independent JDK-8318832 ProblemList ConsumeForModalDialogTest.java, MenuItemActivatedTest.java & MouseModifiersUnitTest_Standard.java for windows
2023/10/25 06:49 Matthias Baesken SAP (same) (same) JDK-8318775 Check return values of malloc in native java.base coding
2023/10/25 06:49 Matthias Baesken SAP (same) (same) JDK-8318773 (fs) Check return value of malloc in Java_sun_nio_fs_AixNativeDispatcher_getmntctl()
2023/10/25 06:39 Christoph Langer SAP (same) (same) JDK-8318772 Cleanup indentation in jfc files
2023/10/25 06:38 Christoph Langer SAP Joachim Kern SAP JDK-8318771 com/sun/tools/attach/warnings/DynamicLoadWarningTest.java real fix for failure on AIX
2023/10/24 18:35 Sergey Bylokhov Amazon (same) (same) JDK-8318751 test/hotspot/jtreg/runtime/reflect/ReflectOutOfMemoryError.java may fail if heap is huge
2023/10/24 16:51 Rajan Halade Oracle (same) (same) JDK-8318748 Add Telia Root CA v2
2023/10/24 16:03 Laurent Bourgès Independent (same) (same) JDK-8318739 BasicStroke.createStrokedShape miter-limits failing on small shapes
2023/10/24 15:40 Aleksey Shipilev Amazon (same) (same) JDK-8318734 New parentheses warnings after HarfBuzz 7.2.0 update
2023/10/24 15:37 Aleksey Shipilev Amazon Alex Menkov Oracle JDK-8318733 test hprof lib: invalid array element type from JavaValueArray.elementSize
2023/10/24 15:36 Aleksey Shipilev Amazon Roland Westrelin Red Hat JDK-8318732 C2: assert(wq.size() - before == EMPTY_LOOP_SIZE) failed: expect the EMPTY_LOOP_SIZE nodes of this body if empty
2023/10/24 15:36 Aleksey Shipilev Amazon Coleen Phillimore Oracle JDK-8318731 UseHeavyMonitors not used
2023/10/20 06:46 Matthias Baesken SAP (same) (same) JDK-8318579 make test TEST="jtreg:test/jdk/..." fails on AIX
2023/10/20 05:38 Thomas Stuefe Red Hat (same) (same) JDK-8318576 C2 recompilations cause high memory footprint
2023/10/19 18:47 Alexey Ivanov Oracle Harshitha Onkar Oracle JDK-8318561 javax/swing/JToolBar/4529206/bug4529206.java fails intermittently on Linux
2023/10/19 18:45 Aleksey Shipilev Amazon Nick Gasson ARM JDK-8318560 AArch64: "stop: Header is not fast-locked" with -XX:-UseLSE since JDK-8315880
2023/10/19 18:39 Ludvig Janiuk Oracle (same) (same) JDK-8318558 Remove JT_JAVA dead code in jib-profiles.js
2023/10/19 18:37 Archie Cobbs Independent (same) (same) JDK-8318554 Combinatorial explosion during 'this' escape analysis
2023/10/19 18:34 Aleksey Shipilev Amazon Stefan Karlsson Oracle JDK-8318551 Move the fast locking implementation out of the .ad files
2023/10/19 18:32 Aleksey Shipilev Amazon Roland Westrelin Red Hat JDK-8318549 Endless loop in C2 compilation triggered by AddNode::IdealIL
2023/10/19 18:31 Aleksey Shipilev Amazon Martin Doerr SAP JDK-8318548 Print LockStack in hs_err files
2023/10/19 18:31 Rajan Halade Oracle (same) (same) JDK-8318547 Tests for AffirmTrust roots
2023/10/19 18:31 Aleksey Shipilev Amazon Roman Kennke Amazon JDK-8318546 Add test for unstructured locking
2023/10/19 18:30 Aleksey Shipilev Amazon David Holmes Oracle JDK-8318545 LockStack::contains(oop) fails "assert(t->is_Java_thread()) failed: incorrect cast to JavaThread"
2023/10/19 18:29 Aleksey Shipilev Amazon Kevin Driver Oracle JDK-8318544 SSLEngine throws NPE parsing CertificateRequests
2023/10/19 18:28 Aleksey Shipilev Amazon Alex Menkov Oracle JDK-8318543 test fails "assert(check_alignment(result)) failed: address not aligned: 0x00000008baadbabe"
2023/10/19 18:26 Aleksey Shipilev Amazon Zhengyu Gu Independent JDK-8318542 Shenandoah: Shenandoah degenerated GC and full GC need to cleanup old OopMapCache entries
2023/10/17 08:32 Archie Cobbs Independent (same) (same) JDK-8318288 Assertion error thrown during 'this' escape analysis
2023/10/17 05:10 Christoph Langer SAP (same) (same) JDK-8318212 Exclude java/net/Socket/asyncClose/Race.java on AIX
2023/10/17 05:09 Christoph Langer SAP (same) (same) JDK-8318211 Fix Bug entry for exclusion of runtime/jni/terminatedThread/TestTerminatedThread.java on AIX
2023/10/17 05:09 Christoph Langer SAP mvarada2000 Independent JDK-8318210 [AIX] Problem List runtime/jni/terminatedThread/TestTerminatedThread.java
2023/10/17 05:09 Christoph Langer SAP mvarada2000 Independent JDK-8318209 [aix] Tests failing with JNI attach problems.
2023/10/17 05:08 Christoph Langer SAP dpakri181 Independent JDK-8318208 [PPC] JcmdScale.java Failing on AIX
2023/10/17 05:07 Christoph Langer SAP (same) (same) JDK-8318207 Exclude java/nio/channels/Channels/SocketChannelStreams.java on AIX
2023/10/17 05:07 Christoph Langer SAP mvarada2000 Independent JDK-8318206 [AIX] TestAlwaysPreTouchStacks.java fails due to java.lang.RuntimeException: Did not find expected NMT output
2023/10/16 16:30 Rajan Halade Oracle (same) (same) JDK-8318182 Enhance test/jdk/javax/net/ssl/TLSCommon/SSLEngineTestCase.java to handle default cases
2023/10/16 14:30 Matthias Baesken SAP (same) (same) JDK-8318169 relax the builddir check in make/autoconf/basic.m4
2023/10/16 14:19 Thomas Stuefe Red Hat (same) (same) JDK-8318168 NMT: Make peak values available in release builds
2023/10/16 14:09 Aleksey Shipilev Amazon Xin Liu Amazon JDK-8318167 [GHA] get-bootjdk action should return the abolute path
2023/10/16 14:08 Aleksey Shipilev Amazon Brian Burkhalter Oracle JDK-8318166 test/jdk/java/io/File/TempDirDoesNotExist.java leaves test files behind
2023/10/16 14:08 Aleksey Shipilev Amazon (same) (same) JDK-8318165 Classloading throws exceptions over already pending exceptions
2023/10/16 13:49 Daniel Fuchs Oracle (same) (same) JDK-8318163 Stream::handleReset locks twice
2023/10/16 13:49 Joachim Kern SAP (same) (same) JDK-8318162 ProcessHandle implementation listing processes on AIX should use getprocs64
2023/10/11 05:54 Christoph Langer SAP (same) (same) JDK-8317855 ProblemList sun/tools/jstat/jstatLineCountsX.sh on linux-ppc64le and aix due to JDK-8248691
2023/10/11 05:47 Christoph Langer SAP (same) (same) JDK-8317854 Exclude gtest/GTestWrapper.java on AIX
2023/10/11 05:45 Christoph Langer SAP (same) (same) JDK-8317853 Exclude java/awt/Graphics2D/DrawString/RotTransText.java on linux
2023/10/10 19:50 Ludvig Janiuk Oracle (same) (same) JDK-8317832 Clarify TLABWasteTargetPercent flag
2023/10/10 18:22 Aleksey Shipilev Amazon Severin Gehwolf Red Hat JDK-8317828 containers/docker/TestMemoryWithCgroupV1.java get OOM killed with Parallel GC
2023/10/10 18:12 Goetz Lindenmaier SAP Douglas Simon Oracle JDK-8317826 some JVMCI tests fail when VM options include -XX:+EnableJVMCI
2023/10/10 18:09 Goetz Lindenmaier SAP Chris Plummer Oracle JDK-8317825 JDI AfterThreadDeathTest.java failed due to "FAILED: Did not get expected IllegalThreadStateException on a StepRequest.enable()"
2023/10/10 14:33 Brian Burkhalter Oracle (same) (same) JDK-8317805 (fc) FileChannel.size returns 0 on block special files
2023/10/10 07:16 Aleksey Shipilev Amazon (same) (same) JDK-8317788 Add tests for FileDescriptor.sync
2023/10/10 06:54 Aleksey Shipilev Amazon Tobias Hartmann Oracle JDK-8317787 Incorrect control in LibraryCallKit::inline_native_notify_jvmti_funcs
2023/10/10 06:52 Aleksey Shipilev Amazon Per-Ake Minborg Oracle JDK-8317786 (bf) Concurrency issue in DirectByteBuffer.Deallocator
2023/10/10 06:51 Aleksey Shipilev Amazon Stefan Karlsson Oracle JDK-8317785 Use consistent naming for lightweight locking in MacroAssembler
2023/10/10 06:46 Aleksey Shipilev Amazon (same) (same) JDK-8317783 Sort platform enums and definitions after JDK-8304913 follow-ups
2023/10/05 12:07 Matthias Baesken SAP (same) (same) JDK-8317590 Java_java_util_prefs_FileSystemPreferences_lockFile0 write result errno in missing case
2023/10/05 12:03 Matthias Baesken SAP (same) (same) JDK-8317589 build using devkit on Linux ppc64le RHEL puts path to devkit into libsplashscreen
2023/10/05 11:33 Matthias Baesken SAP (same) (same) JDK-8317585 Handle WideCharToMultiByte return values
2023/10/05 11:28 Matthias Baesken SAP (same) (same) JDK-8317584 sun/security/ssl/SSLSocketImpl/SSLSocketCloseHang.java test fails intermittent with Read timed out
2023/10/05 07:35 Aleksey Shipilev Amazon Alex Menkov Oracle JDK-8317574 assert(!JvmtiExport::can_support_virtual_threads()) with -XX:-DoJVMTIVirtualThreadTransitions
2023/10/05 07:34 Zdenek Zambersky Red Hat Naoto Sato Oracle JDK-8317573 StoreReproducibilityTest fails on some locales
2023/10/04 22:31 Roy Soumadipta Amazon (same) (same) JDK-8317559 Parallelize java/util/concurrent/tck/JSR166TestCase.java
2023/10/04 21:07 Roy Soumadipta Amazon (same) (same) JDK-8317558 Enable parallelism in vmTestbase/nsk/stress/numeric tests
2023/10/04 17:59 Roy Soumadipta Amazon (same) (same) JDK-8317537 Parallelize gc/stress/TestStressIHOPMultiThread.java test
2023/10/04 17:38 Brian Burkhalter Oracle (same) (same) JDK-8317533 ByteArrayInputStream.transferTo causes MaxDirectMemorySize overflow
2023/10/04 12:22 Aleksey Shipilev Amazon Roman Kennke Amazon JDK-8317509 More generic way to handshake GC threads with monitor deflation
2023/10/04 10:47 Christoph Langer SAP (same) (same) JDK-8317505 Exclude java/awt/font/Rotate/RotatedTextTest.java
2023/10/04 10:13 Aleksei Voitylov BellSoft (same) (same) JDK-8317503 RegionMatches1Tests fails if CompactStrings are disabled after JDK-8302163
2023/10/04 09:19 Ilya Gavrilin Independent Tony Printezis Rivos JDK-8317500 RISC-V: use andn / orn in the MD5 instrinsic
2023/10/04 08:58 Aleksey Shipilev Amazon (same) (same) JDK-8317498 Better diagnostic header for VtableStub
2023/10/04 08:23 Ludovic Henry Rivos (same) (same) JDK-8317488 RISC-V: Disable detection of V through HWCAP
2023/10/04 08:20 Robbin Ehn Rivos (same) (same) JDK-8317487 RISC-V: Zero extended narrow oop passed to Atomic::cmpxchg
2023/10/04 07:18 Goetz Lindenmaier SAP Roland Westrelin Red Hat JDK-8317480 assert(cast != nullptr) failed: must have added a cast to pin the node
2023/10/04 07:10 Goetz Lindenmaier SAP Alexey Semenyuk Oracle JDK-8317479 JPackage app-image exe launches multiple exe's in JDK 17+
2023/10/04 07:08 Goetz Lindenmaier SAP Roland Westrelin Red Hat JDK-8317478 C2: assert(u->find_out_with(Op_AddP) == nullptr) failed: more than 2 chained AddP nodes?
2023/10/04 07:06 Goetz Lindenmaier SAP Roland Westrelin Red Hat JDK-8317477 Massive (up to ~30x) increase in C2 compilation time since JDK 17
2023/10/04 07:04 Goetz Lindenmaier SAP daniel.skantz Oracle JDK-8317476 C1: ShortLoopOptimizer might lift instructions before their inputs
2023/10/04 06:56 Vladimir Kempik Syntacore (same) (same) JDK-8317475 RISC-V: llvm build broken
2023/10/04 01:10 Fei Yang Independent Ilya Gavrilin Independent JDK-8317467 RISC-V: Change UseVectorizedMismatchIntrinsic option result to warning
2023/09/28 15:34 Gui Cao Independent (same) (same) JDK-8317258 RISC-V: compiler/vectorapi/VectorCastShape128Test.java fails when using RVV
2023/09/28 14:22 Matthias Baesken SAP (same) (same) JDK-8317252 sun/security/pkcs11/PKCS11Test.java needs adjustment on Linux ppc64le Ubuntu 22
2023/09/28 13:37 Manukumar V S Oracle Prasanta Sadhukhan Oracle JDK-8316965 Open source few swing text/html tests
2023/09/26 14:44 Roy Soumadipta Amazon (same) (same) JDK-8316963 serviceability/sa/TestJmapCoreMetaspace.java should run with -XX:-VerifyDependencies
2023/09/25 20:07 Man Cao Google (same) (same) JDK-8316919 os::write incorrectly handles partial write
2023/09/25 14:19 Alexey Ivanov Oracle (same) (same) JDK-8316904 Test StretchedFontTest.java fails for Baekmuk font
2023/09/25 13:47 Matthias Baesken SAP Rajan Halade Oracle JDK-8316901 Refactor PKCS11Test tests
2023/09/25 13:33 Ludvig Janiuk Oracle Kevin Walls Oracle JDK-8316900 Remove sun/tools/jstatd/TestJstatd* tests from problemlist for Windows.
2023/09/25 07:56 Ludvig Janiuk Oracle Kevin Walls Oracle JDK-8316858 TestJstatdPortAndServer.java failed with "java.rmi.NoSuchObjectException: no such object in table"
2023/09/25 07:07 Matthias Baesken SAP (same) (same) JDK-8316812 Java_sun_awt_windows_ThemeReader_paintBackground release resources in early returns
2023/09/25 07:03 Matthias Baesken SAP (same) (same) JDK-8316811 src/java.desktop/windows/native/libawt/windows/awt_Robot.cpp GetRGBPixels adjust releasing of resources
2023/09/25 06:54 Matthias Baesken SAP (same) (same) JDK-8316810 java/lang/ProcessHandle/TreeTest.java test enhance output of children
2023/09/22 17:56 Rajat Mahajan Oracle N/A Unknown JDK-8316759 Check boxes and radio buttons have rendering issues on Windows in High DPI env
2023/09/22 17:34 Ilya Gavrilin Independent Tony Printezis Rivos JDK-8316757 RISC-V: implement MD5 intrinsic
2023/09/22 15:36 Aleksey Shipilev Amazon Liam Miller-Cushon Google JDK-8316750 ArithmeticException in GaloisCounterMode
2023/09/22 15:36 Aleksey Shipilev Amazon (same) (same) JDK-8316749 Better diagnostic header for CodeBlobs
2023/09/22 15:29 Rajan Halade Oracle (same) (same) JDK-8316748 Framework for CA interoperability testing
2023/09/22 15:17 Aleksey Shipilev Amazon (same) (same) JDK-8316747 PPC builds are broken after JDK-8304913
2023/09/22 08:00 Angelos Bimpoudis Oracle (same) (same) JDK-8316725 Intra-case dominance check fails in the presence of a guard
2023/09/22 07:58 Angelos Bimpoudis Oracle (same) (same) JDK-8316724 Series of colon-style fallthrough switch cases with guards compiled incorrectly
2023/09/21 14:23 Daniel Fuchs Oracle (same) (same) JDK-8316680 SSLFlowDelegate should not log from synchronized block
2023/09/21 13:14 Christoph Langer SAP (same) (same) JDK-8316676 Exclude jdk/jfr/event/runtime/TestResidentSetSizeEvent.java on AIX
2023/09/21 13:12 Christoph Langer SAP (same) (same) JDK-8316675 Exclude java/net/MulticastSocket/Promiscuous.java on AIX
2023/09/21 13:12 Christoph Langer SAP (same) (same) JDK-8316674 Exclude more failing multicast tests on AIX after JDK-8315651
2023/09/21 13:12 Christoph Langer SAP Thomas Obermeier SAP JDK-8316673 Stop hiding AIX specific multicast socket errors via NetworkConfiguration (aix)
2023/09/21 12:34 Andreas Steiner SAP Andreas Steiner SAP JDK-8316668 NM flags handling in configure process
2023/09/21 12:08 Aleksey Shipilev Amazon (same) (same) JDK-8316664 SPARC64 builds are broken after JDK-8304913
2023/09/21 12:07 Matthias Baesken SAP Rajan Halade Oracle JDK-8316663 PKCS11 tests silently skip execution
2023/09/20 15:40 Chad Rakoczy Amazon (same) (same) JDK-8316612 C1: Uninitialized PhiResolver::_loop field
2023/09/20 14:15 Matthias Baesken SAP (same) (same) JDK-8316601 increase timeout of sun/security/tools/jarsigner/Warning.java
2023/09/20 07:29 Matthias Baesken SAP (same) (same) JDK-8316578 ProblemList serviceability/dcmd/gc/RunFinalizationTest.java on AIX
2023/09/19 19:21 Elif Aslan Amazon Daohan Qu Independent JDK-8316550 Incorrect regex in TestMetaSpaceLog.java
2023/09/19 16:11 Sean Coffey Oracle (same) (same) JDK-8316536 Test SignedLoggerFinderTest.java is still failing
2023/09/19 16:00 Sean Coffey Oracle (same) (same) JDK-8316535 SignedLoggerFinderTest.java test failed
2023/09/19 15:47 Sean Coffey Oracle (same) (same) JDK-8316534 Signed jars triggering Logger finder recursion and StackOverflowError
2023/09/19 07:13 Aleksey Shipilev Amazon (same) (same) JDK-8316495 Shenandoah: STW mark should keep nmethod/oops referenced from stack chunk alive
2023/09/19 06:37 Gui Cao Independent (same) (same) JDK-8316491 RISC-V: xxxMaxVectorTestsSmokeTest fails when using RVV
2023/09/15 19:07 Robert Mckenna Oracle Alan Bateman Oracle JDK-8316379 jcmd Thread.dump_to_file slow with millions of virtual threads
2023/09/15 19:03 Robert Mckenna Oracle Alan Bateman Oracle JDK-8316378 VirtualThread.parkNanos timeout adjustment when pinned should be replaced
2023/09/15 18:39 Robert Mckenna Oracle Alan Bateman Oracle JDK-8316377 (dc) DatagramChannel's socket adaptor does not release carrier thread when blocking in receive
2023/09/15 18:30 Robert Mckenna Oracle Alan Bateman Oracle JDK-8316376 Thread.interrupted from virtual thread needlessly resets interrupt status
2023/09/14 08:48 Aleksey Shipilev Amazon (same) (same) JDK-8316282 Infinite permission checking loop in java/net/spi/InetAddressResolverProvider/RuntimePermissionTest
2023/09/13 14:58 Matthias Baesken SAP (same) (same) JDK-8316205 test tools/jpackage/share/RuntimePackageTest.java#id0 fails on RHEL8
2023/09/13 14:35 Aleksey Shipilev Amazon Roger Riggs Oracle JDK-8316203 jdk/internal/util/ArchTest.java fails after JDK-8308452 failed with Method isARM()
2023/09/13 14:35 Aleksey Shipilev Amazon Roger Riggs Oracle JDK-8316202 Extend internal Architecture enum with byte order and address size
2023/09/13 14:18 Matthias Baesken SAP (same) (same) JDK-8316200 RandomTestBsi1999 fails often with timeouts on Linux ppc64le
2023/09/13 14:02 Joachim Kern SAP Thomas Obermeier SAP JDK-8316198 java/nio/channels/DatagramChannel/SendReceiveMaxSize.java fails on AIX due to small default RCVBUF size and different IPv6 Header interpretation
2023/09/13 13:37 Jan Lahoda Oracle (same) (same) JDK-8316195 Verify 4th party information in src/jdk.internal.le/share/legal/jline.md
2023/09/13 10:02 Christoph Langer SAP (same) (same) JDK-8316169 java/lang/ProcessHandle/InfoTest.java fails on Windows when run as user with Administrator privileges
2023/09/12 16:56 William Kemper Amazon (same) (same) JDK-8316134 Shenandoah: Unable to throw OOME on back-to-back Full GCs
2023/09/12 09:22 Jan Lahoda Oracle (same) (same) JDK-8316103 VerifyError when switch statement used with synchronized block
2023/09/12 07:26 Matthias Baesken SAP Sun Yaqi Loongson JDK-8316093 When multiple users run tools/jpackage/share/LicenseTest.java, Permission denied for writing /var/tmp/*.files
2023/09/12 07:16 Matthias Baesken SAP Andreas Steiner SAP JDK-8316092 Add default cups include location for configure on AIX
2023/09/12 07:13 Andreas Steiner SAP Andreas Steiner SAP JDK-8316091 /bin/nm usage in AIX makes needs -X64 flag
2023/09/12 07:07 Matthias Baesken SAP (same) (same) JDK-8316090 Do not run sun/tools/jhsdb tests concurrently
2023/09/11 18:10 Rajat Mahajan Oracle (same) (same) JDK-8316041 Add JRadioButtonMenuItem to bug8031573.java
2023/09/11 10:17 Christian Stein Oracle (same) (same) JDK-8315992 [GHA] Update checkout action to use v4
2023/09/11 09:45 v-terrychow Microsoft (same) (same) JDK-8315991 Add KEEPALIVE Extended Socket Options Support for Windows
2023/09/11 09:18 Aleksey Shipilev Amazon (same) (same) JDK-8315987 CITime misreports code/total nmethod sizes
2023/09/08 20:25 Vladimir Kempik Syntacore (same) (same) JDK-8315957 RISC-V: intrinsic for unsignedMultiplyHigh
2023/09/06 13:11 Robbin Ehn Rivos (same) (same) JDK-8315788 RISC-V: hwprobe query is_set return wrong value
2023/09/06 07:18 Jan Lahoda Oracle (same) (same) JDK-8315746 Erroneous AST missing modifiers for partial input
2023/09/05 15:27 Aleksey Shipilev Amazon Christian Stein Oracle JDK-8315705 Update to use jtreg 7.3.1
2023/09/05 15:27 Mandy Chung Oracle siedlerkiller Independent JDK-8315704 Add SystemModulesPlugin test case that splits module descriptors with new local variables defined by DedupSetBuilder
2023/09/05 15:27 Mandy Chung Oracle kopp.dev Independent JDK-8315703 jlink SystemModulesPlugin incorrectly parses the options
2023/09/05 14:21 Aleksey Shipilev Amazon Christian Stein Oracle JDK-8315699 Update to use jtreg 7.3
2023/09/05 13:01 Robert Mckenna Oracle (same) (same) JDK-8315688 Update jdk21u fix version to 21.0.2
2023/08/24 12:34 Christian Hagedorn Oracle (same) (same) JDK-8314942 [REDO] Enhance AES performance
2023/08/23 09:23 Christian Hagedorn Oracle (same) (same) JDK-8314867 [BACKOUT] 8308682: Enhance AES performance
2023/08/21 07:15 Sidraya Jayagond IBM N/A Unknown JDK-8314631 [s390] Implementation of Foreign Function & Memory API (Preview)
2023/07/30 06:11 Ramesh Gangadhar Oracle Matthew Donovan Oracle JDK-8313377 sun/security/ssl/SSLSocketImpl/BlockedAsyncClose.java fails with jtreg test timeout

No changesets log

JDK-8326832 Release Note: Hotspot `hs_err` Files Now Print the Lock Stack
JDK-8325054 Release Note: Add User Facing Warning If THPs Are Enabled but Cannot Be Used
JDK-8324558 Release Note: NMT: Make Peak Values Available in Release Builds
JDK-8322230 Release Note: TCP_KEEPxxxx Extended Socket Options Are Now Supported on the Windows Platform
JDK-8322226 Release Note: Added Four Root Certificates from DigiCert, Inc.
JDK-8322220 Release Note: Added Three Root Certificates from eMudhra Technologies Limited
JDK-8322026 Release Note: Added Telia Root CA v2 Certificate
JDK-8320963 javac crashes while adding type annotations to the return type of a constructor
JDK-8320670 ZipFile.getManifestName fails during jar verification for Spring Boot
JDK-8319730 Release Note: Added ISRG Root X2 CA Certificate from Let's Encrypt
JDK-8319287 Increase jdk.jar.maxSignatureFileSize default which is too low for JARs such as WhiteSource/Mend unified agent jar
JDK-8319286 Invalid CEN header (invalid zip64 extra data field size)
JDK-8319273 Bump version numbers for 21.0.1
JDK-8318459 Incomplete JSSE docs for FFDHE
JDK-8316336 remove macosx-x64-10.X execution-platfrom in jdk21

Committer push log

Angelos Bimpoudis, Oracle

Bug Summary
JDK-8316725 Intra-case dominance check fails in the presence of a guard
JDK-8316724 Series of colon-style fallthrough switch cases with guards compiled incorrectly

Axel Boldt-Christmas, Oracle

Bug Summary
JDK-8320742 [AArch64] C2 compilation fails with "Field too big for insn"

Archie Cobbs, Independent

Bug Summary
JDK-8318288 Assertion error thrown during 'this' escape analysis
JDK-8318554 Combinatorial explosion during 'this' escape analysis

Alexey Ivanov, Oracle

Bug Summary
JDK-8319743 Add screen capture functionality to PassFailJFrame
JDK-8320419 Allow PassFailJFrame.Builder to create test UI
JDK-8320313 Build failure with GCC8.3.1 after 8313643
JDK-8320413 HTML formatting for PassFailJFrame instructions
JDK-8318561 javax/swing/JToolBar/4529206/bug4529206.java fails intermittently on Linux
JDK-8320427 Refactor timeout handler in PassFailJFrame
JDK-8316904 Test StretchedFontTest.java fails for Baekmuk font
JDK-8320414 Update FileChooserSymLinkTest.java to HTML instructions
JDK-8320312 Update HarfBuzz to 8.2.2
JDK-8320420 Use testUI() method of PassFailJFrame.Builder in FileChooserSymLinkTest.java

Andrew Leonard, Red Hat

Bug Summary
JDK-8319418 adlc tries to build with /pathmap but without /experimental:deterministic
JDK-8319411 jrt-fs.jar classes not reproducible between standard and bootcycle builds
JDK-8319840 Windows build on WSL broken after JDK-8317340
JDK-8319823 Windows builds are not reproducible if MS VS compiler install path differs

Amit Kumar, IBM

Bug Summary
JDK-8319824 [s390x] Implement alternative fast-locking scheme
JDK-8320236 [s390x] Multiple test failure with LockingMode=2
JDK-8320077 [s390x] Use consistent naming for lightweight locking in MacroAssembler

Andreas Steiner, SAP

Bug Summary
JDK-8316091 /bin/nm usage in AIX makes needs -X64 flag
JDK-8316668 NM flags handling in configure process

Aleksei Voitylov, BellSoft

Bug Summary
JDK-8317503 RegionMatches1Tests fails if CompactStrings are disabled after JDK-8302163

Brian Burkhalter, Oracle

Bug Summary
JDK-8317805 (fc) FileChannel.size returns 0 on block special files
JDK-8317533 ByteArrayInputStream.transferTo causes MaxDirectMemorySize overflow

Calvin Cheung, Oracle

Bug Summary
JDK-8319410 SPECjvm2008/xml.transform with CDS fails with "can't seal package nu.xom"

Chad Rakoczy, Amazon

Bug Summary
JDK-8316612 C1: Uninitialized PhiResolver::_loop field

Christian Hagedorn, Oracle

Bug Summary
JDK-8314867 [BACKOUT] 8308682: Enhance AES performance
JDK-8314942 [REDO] Enhance AES performance

Christoph Langer, SAP

Bug Summary
JDK-8320307 [AIX] Cleaners.java test failure
JDK-8318210 [AIX] Problem List runtime/jni/terminatedThread/TestTerminatedThread.java
JDK-8318206 [AIX] TestAlwaysPreTouchStacks.java fails due to java.lang.RuntimeException: Did not find expected NMT output
JDK-8318209 [aix] Tests failing with JNI attach problems.
JDK-8318208 [PPC] JcmdScale.java Failing on AIX
JDK-8320305 Add regression tests for large page logging and user-facing error messages
JDK-8320306 Add user-facing warning if THPs are enabled but cannot be used
JDK-8318772 Cleanup indentation in jfc files
JDK-8318771 com/sun/tools/attach/warnings/DynamicLoadWarningTest.java real fix for failure on AIX
JDK-8317854 Exclude gtest/GTestWrapper.java on AIX
JDK-8317505 Exclude java/awt/font/Rotate/RotatedTextTest.java
JDK-8317853 Exclude java/awt/Graphics2D/DrawString/RotTransText.java on linux
JDK-8316675 Exclude java/net/MulticastSocket/Promiscuous.java on AIX
JDK-8318212 Exclude java/net/Socket/asyncClose/Race.java on AIX
JDK-8318207 Exclude java/nio/channels/Channels/SocketChannelStreams.java on AIX
JDK-8316676 Exclude jdk/jfr/event/runtime/TestResidentSetSizeEvent.java on AIX
JDK-8316674 Exclude more failing multicast tests on AIX after JDK-8315651
JDK-8320457 Fix boundaries of region to be tested with os::is_readable_range
JDK-8318211 Fix Bug entry for exclusion of runtime/jni/terminatedThread/TestTerminatedThread.java on AIX
JDK-8316169 java/lang/ProcessHandle/InfoTest.java fails on Windows when run as user with Administrator privileges
JDK-8320456 Possible out of bounds access in print_pointer_information
JDK-8320869 ProblemList java/lang/invoke/lambda/LambdaFileEncodingSerialization.java on linux-all
JDK-8317855 ProblemList sun/tools/jstat/jstatLineCountsX.sh on linux-ppc64le and aix due to JDK-8248691
JDK-8316673 Stop hiding AIX specific multicast socket errors via NetworkConfiguration (aix)

Sean Coffey, Oracle

Bug Summary
JDK-8316534 Signed jars triggering Logger finder recursion and StackOverflowError
JDK-8316535 SignedLoggerFinderTest.java test failed
JDK-8316536 Test SignedLoggerFinderTest.java is still failing

Christian Stein, Oracle

Bug Summary
JDK-8315992 [GHA] Update checkout action to use v4

Liam Miller-Cushon, Google

Bug Summary
JDK-8319885 type annotations are not visible to javac plugins across compilation boundaries

Daniel Fuchs, Oracle

Bug Summary
JDK-8316680 SSLFlowDelegate should not log from synchronized block
JDK-8318163 Stream::handleReset locks twice

Elif Aslan, Amazon

Bug Summary
JDK-8316550 Incorrect regex in TestMetaSpaceLog.java

Erik Österlund, Oracle

Bug Summary
JDK-8320578 Add missing cross modifying fence in nmethod entry barriers

Frederic Thevenet, Red Hat

Bug Summary
JDK-8319774 Change Windows debug symbol files naming to avoid losing info when an executable and a library share the same name
JDK-8319296 Target OS detection in 'test-prebuilt' makefile target is incorrect when running on MSYS2

Fei Yang, Independent

Bug Summary
JDK-8317467 RISC-V: Change UseVectorizedMismatchIntrinsic option result to warning
JDK-8320158 RISC-V: improve MD5 intrinsic
JDK-8319710 RISC-V: Rename *_riscv64.ad files to *_riscv.ad under riscv/gc

Gui Cao, Independent

Bug Summary
JDK-8320722 RISC-V: Avoid passing t0 as temp register to MacroAssembler::lightweight_lock/unlock
JDK-8317258 RISC-V: compiler/vectorapi/VectorCastShape128Test.java fails when using RVV
JDK-8319267 RISC-V: Small refactoring for MacroAssembler::test_bit
JDK-8316491 RISC-V: xxxMaxVectorTestsSmokeTest fails when using RVV

Goetz Lindenmaier, SAP

Bug Summary
JDK-8319071 [macos] ProblemList java/rmi/registry/multipleRegistries/MultipleRegistries.java
JDK-8317480 assert(cast != nullptr) failed: must have added a cast to pin the node
JDK-8317476 C1: ShortLoopOptimizer might lift instructions before their inputs
JDK-8317478 C2: assert(u->find_out_with(Op_AddP) == nullptr) failed: more than 2 chained AddP nodes?
JDK-8319249 Code in SendPortZero.java is uncommented even after JDK-8236852 was fixed
JDK-8319688 Fix: make test outputs TEST SUCCESS after unsuccessful exit
JDK-8320153 GtestWrapper crashes with SIGILL in AsyncLogTest::test_asynclog_raw on AIX opt
JDK-8319248 java/nio/file/Files/CopyAndMove.java fails when using second test directory
JDK-8317825 JDI AfterThreadDeathTest.java failed due to "FAILED: Did not get expected IllegalThreadStateException on a StepRequest.enable()"
JDK-8317479 JPackage app-image exe launches multiple exe's in JDK 17+
JDK-8317477 Massive (up to ~30x) increase in C2 compilation time since JDK 17
JDK-8319510 OutputAnalyzer.shouldMatchByLine() fails in some cases
JDK-8317826 some JVMCI tests fail when VM options include -XX:+EnableJVMCI
JDK-8319250 sun/security/pkcs11/sslecc/ClientJSSEServerJSSE.java fails with ProviderException
JDK-8319506 Update applications/scimark/Scimark.java to accept VM flags

Hannes Greule, Independent

Bug Summary
JDK-8318881 jcmd GC.heap_dump performance regression after JDK-8292818

ier7928, Independent

Bug Summary
JDK-8319711 Fix memory reporter for thread_count
JDK-8319712 NMT: summary diff reports threads count incorrectly

Ilya Gavrilin, Independent

Bug Summary
JDK-8316757 RISC-V: implement MD5 intrinsic
JDK-8317500 RISC-V: use andn / orn in the MD5 instrinsic

Ian Myers, Amazon

Bug Summary
JDK-8320784 Parallelize gc/stress/TestStressG1Humongous.java test
JDK-8320785 Parallelize sun/security/util/math/TestIntegerModuloP.java

Johannes Bechberger, SAP

Bug Summary
JDK-8319886 com/sun/jdi/JdwpOnThrowTest.java failed with "transport error 202: bind failed: Address already in use"
JDK-8319593 JDWP-agent sends broken exception event with onthrow option

Jayathirth D V, Oracle

Bug Summary
JDK-8319769 Additional negative value check in JPEG decoding

Joachim Kern, SAP

Bug Summary
JDK-8316198 java/nio/channels/DatagramChannel/SendReceiveMaxSize.java fails on AIX due to small default RCVBUF size and different IPv6 Header interpretation
JDK-8318162 ProcessHandle implementation listing processes on AIX should use getprocs64

Jan Lahoda, Oracle

Bug Summary
JDK-8315746 Erroneous AST missing modifiers for partial input
JDK-8320765 jshell - Non-sealed declarations sometimes break a snippet evaluation
JDK-8320764 Match on enum constants with body compiles but fails with MatchException
JDK-8316195 Verify 4th party information in src/jdk.internal.le/share/legal/jline.md
JDK-8316103 VerifyError when switch statement used with synchronized block

Jaikiran Pai, Oracle

Bug Summary
JDK-8320072 HttpClient request fails due to connection being considered idle and closed

Laurent Bourgès, Independent

Bug Summary
JDK-8318739 BasicStroke.createStrokedShape miter-limits failing on small shapes

Ludovic Henry, Rivos

Bug Summary
JDK-8317488 RISC-V: Disable detection of V through HWCAP

Ludvig Janiuk, Oracle

Bug Summary
JDK-8317832 Clarify TLABWasteTargetPercent flag
JDK-8318558 Remove JT_JAVA dead code in jib-profiles.js
JDK-8316900 Remove sun/tools/jstatd/TestJstatd* tests from problemlist for Windows.
JDK-8316858 TestJstatdPortAndServer.java failed with "java.rmi.NoSuchObjectException: no such object in table"

Man Cao, Google

Bug Summary
JDK-8320109 missing JVMTI events from vthreads parked during JVMTI attach
JDK-8316919 os::write incorrectly handles partial write

Matthias Baesken, SAP

Bug Summary
JDK-8318773 (fs) Check return value of malloc in Java_sun_nio_fs_AixNativeDispatcher_getmntctl()
JDK-8316092 Add default cups include location for configure on AIX
JDK-8320488 Add ReleaseIntArrayElements in Java_sun_awt_X11_XlibWrapper_SetBitmapShape XlbWrapper.c to early return
JDK-8319292 Adjust describing comment of os_getChildren after 8315026
JDK-8320466 avoid leaks in loadlib_aix.cpp reload_table()
JDK-8317589 build using devkit on Linux ppc64le RHEL puts path to devkit into libsplashscreen
JDK-8318775 Check return values of malloc in native java.base coding
JDK-8320459 compiler/compilercontrol/TestConflictInlineCommands.java fails intermittent with 'disallowed by CompileCommand' missing from stdout/stderr
JDK-8319293 compiler/compilercontrol/TestConflictInlineCommands.java fails intermittent with force inline by CompileCommand missing
JDK-8316090 Do not run sun/tools/jhsdb tests concurrently
JDK-8320496 Enhance agentlib:jdwp help output by info about allow option
JDK-8317585 Handle WideCharToMultiByte return values
JDK-8320078 Improve exception messages thrown by sun.nio.ch.Net native methods (win)
JDK-8320066 increase javacserver connection timeout values and max retry attempts
JDK-8316601 increase timeout of sun/security/tools/jarsigner/Warning.java
JDK-8316810 java/lang/ProcessHandle/TreeTest.java test enhance output of children
JDK-8317590 Java_java_util_prefs_FileSystemPreferences_lockFile0 write result errno in missing case
JDK-8316812 Java_sun_awt_windows_ThemeReader_paintBackground release resources in early returns
JDK-8318579 make test TEST="jtreg:test/jdk/..." fails on AIX
JDK-8316663 PKCS11 tests silently skip execution
JDK-8316578 ProblemList serviceability/dcmd/gc/RunFinalizationTest.java on AIX
JDK-8316200 RandomTestBsi1999 fails often with timeouts on Linux ppc64le
JDK-8316901 Refactor PKCS11Test tests
JDK-8320531 refresh libraries cache on AIX in print_vm_info
JDK-8318169 relax the builddir check in make/autoconf/basic.m4
JDK-8316811 src/java.desktop/windows/native/libawt/windows/awt_Robot.cpp GetRGBPixels adjust releasing of resources
JDK-8317252 sun/security/pkcs11/PKCS11Test.java needs adjustment on Linux ppc64le Ubuntu 22
JDK-8317584 sun/security/ssl/SSLSocketImpl/SSLSocketCloseHang.java test fails intermittent with Read timed out
JDK-8320693 support loading library members on AIX in os::dll_load
JDK-8316205 test tools/jpackage/share/RuntimePackageTest.java#id0 fails on RHEL8
JDK-8316093 When multiple users run tools/jpackage/share/LicenseTest.java, Permission denied for writing /var/tmp/*.files

Mandy Chung, Oracle

Bug Summary
JDK-8315704 Add SystemModulesPlugin test case that splits module descriptors with new local variables defined by DedupSetBuilder
JDK-8315703 jlink SystemModulesPlugin incorrectly parses the options
JDK-8320256 Proxy.newProxyInstance throws NPE if loader is null and interface not visible from class loader

Martin Doerr, SAP

Bug Summary
JDK-8319384 assert(LockingMode != LM_LIGHTWEIGHT || flag == CCR0) failed: bad condition register
JDK-8320812 ppc64 TypeEntries::type_unknown logic looks wrong, missed optimization opportunity
JDK-8320422 Top of lock-stack does not match the unlocked object
JDK-8320071 Utilize existing method frame::interpreter_frame_monitor_size_in_bytes()

Manukumar V S, Oracle

Bug Summary
JDK-8318833 java/awt/Mouse/MouseModifiersUnitTest/MouseModifiersUnitTest_Standard.java fails on macosx-all after JDK-8317751
JDK-8316965 Open source few swing text/html tests
JDK-8318832 ProblemList ConsumeForModalDialogTest.java, MenuItemActivatedTest.java & MouseModifiersUnitTest_Standard.java for windows

Pavel Rappo, Oracle

Bug Summary
JDK-8320068 Internal error on spurious markup in a hybrid snippet

Robbin Ehn, Rivos

Bug Summary
JDK-8315788 RISC-V: hwprobe query is_set return wrong value
JDK-8320295 RISC-V: Update hwprobe query for new extensions
JDK-8317487 RISC-V: Zero extended narrow oop passed to Atomic::cmpxchg

Ramesh Gangadhar, Oracle

Bug Summary
JDK-8313377 sun/security/ssl/SSLSocketImpl/BlockedAsyncClose.java fails with jtreg test timeout

Rajan Halade, Oracle

Bug Summary
JDK-8320287 Add four DigiCert root certificates
JDK-8319740 Add Let's Encrypt ISRG Root X2
JDK-8318748 Add Telia Root CA v2
JDK-8320432 Add three eMudhra emSign roots
JDK-8318182 Enhance test/jdk/javax/net/ssl/TLSCommon/SSLEngineTestCase.java to handle default cases
JDK-8316748 Framework for CA interoperability testing
JDK-8318547 Tests for AffirmTrust roots

Renjith Kannath Pariyangad, Oracle

Bug Summary
JDK-8319742 Invalid TargetDataLine after screen lock when using JFileChooser or COM library

Roman Kennke, Amazon

Bug Summary
JDK-8319926 Deoptimization results in incorrect lightweight locking stack
JDK-8320783 sun/tools/jhsdb/JStackStressTest.java failed with "InternalError: We should have found a thread that owns the anonymous lock"
JDK-8321067 Unlock experimental options in EATests.java

Rajat Mahajan, Oracle

Bug Summary
JDK-8316041 Add JRadioButtonMenuItem to bug8031573.java
JDK-8316759 Check boxes and radio buttons have rendering issues on Windows in High DPI env
JDK-8320203 Update Libpng to 1.6.40

Roman Marchenko, Azul

Bug Summary
JDK-8320507 JvmtiEnvBase doesn't zero _ext_event_callbacks

Robert Mckenna, Oracle

Bug Summary
JDK-8316377 (dc) DatagramChannel's socket adaptor does not release carrier thread when blocking in receive
JDK-8319219 java/util/concurrent/SynchronousQueue/Fairness.java failed with "Error: fair=true i=0 j=1"
JDK-8316379 jcmd Thread.dump_to_file slow with millions of virtual threads
JDK-8319221 JDK-8246677 caused 16x performance regression in SynchronousQueue
JDK-8319218 LinkedTransferQueue does not respect timeout for poll()
JDK-8316376 Thread.interrupted from virtual thread needlessly resets interrupt status
JDK-8315688 Update jdk21u fix version to 21.0.2
JDK-8316378 VirtualThread.parkNanos timeout adjustment when pinned should be replaced

Roy Soumadipta, Amazon

Bug Summary
JDK-8317558 Enable parallelism in vmTestbase/nsk/stress/numeric tests
JDK-8317537 Parallelize gc/stress/TestStressIHOPMultiThread.java test
JDK-8320774 Parallelize gc/stress/TestStressRSetCoarsening.java test
JDK-8317559 Parallelize java/util/concurrent/tck/JSR166TestCase.java
JDK-8316963 serviceability/sa/TestJmapCoreMetaspace.java should run with -XX:-VerifyDependencies

Ravi Reddy, Oracle

Bug Summary
JDK-8322883 [BACKOUT] 8225377: type annotations are not visible to javac plugins across compilation boundaries

Sergey Bylokhov, Amazon

Bug Summary
JDK-8320273 ColorConvertOp.filter for the default destination is too slow
JDK-8318914 ProblemList containers/docker/TestMemoryAwareness.java on linux-all
JDK-8318751 test/hotspot/jtreg/runtime/reflect/ReflectOutOfMemoryError.java may fail if heap is huge

Severin Gehwolf, Red Hat

Bug Summary
JDK-8319533 (fs) Add support for BasicFileAttributes.creationTime() for Linux

Aleksey Shipilev, Amazon

Bug Summary
JDK-8317786 (bf) Concurrency issue in DirectByteBuffer.Deallocator
JDK-8318167 [GHA] get-bootjdk action should return the abolute path
JDK-8320758 [REDO] Generational ZGC: Tests crash with assert(index == 0 || is_power_of_2(index))
JDK-8319718 [REDO] runtime/InvocationTests spend a lot of time on dependency verification
JDK-8318560 AArch64: "stop: Header is not fast-locked" with -XX:-UseLSE since JDK-8315880
JDK-8318546 Add test for unstructured locking
JDK-8317788 Add tests for FileDescriptor.sync
JDK-8320782 ADLC: pass ASSERT and PRODUCT flags
JDK-8316750 ArithmeticException in GaloisCounterMode
JDK-8317574 assert(!JvmtiExport::can_support_virtual_threads()) with -XX:-DoJVMTIVirtualThreadTransitions
JDK-8320076 Atomic gtest should run as TEST_VM to access VM capabilities
JDK-8316749 Better diagnostic header for CodeBlobs
JDK-8317498 Better diagnostic header for VtableStub
JDK-8319720 Build on windows fails after 8316645
JDK-8320425 C1: Replace "cmp reg, 0" with "test reg, reg" on x86
JDK-8320426 C1: x86 cmove can use short branches
JDK-8319772 C2 compilation fails with "bad AD file"
JDK-8319887 C2 compilation fails with "Exceeded _node_regs array"
JDK-8320235 C2 compilation still fails with "bad AD file"
JDK-8319721 C2 failed "assert(_stack_guard_state == stack_guard_reserved_disabled) failed: inconsistent state"
JDK-8319771 C2 SuperWord: wrong result, load should not be moved before store if not comparable
JDK-8320075 C2: "control input must dominate current control" assert failure
JDK-8318732 C2: assert(wq.size() - before == EMPTY_LOOP_SIZE) failed: expect the EMPTY_LOOP_SIZE nodes of this body if empty
JDK-8319227 C2: large byte array clone triggers "failed: malformed control flow" assertion failure on linux-x86
JDK-8319226 C2: Load can bypass subtype check that enforces it's from the right object type
JDK-8319722 C2: VM may crash after hitting node limit
JDK-8315987 CITime misreports code/total nmethod sizes
JDK-8318165 Classloading throws exceptions over already pending exceptions
JDK-8317828 containers/docker/TestMemoryWithCgroupV1.java get OOM killed with Parallel GC
JDK-8320074 ContinuationWrapper uses unhandled nullptr oop
JDK-8320775 Correct the scope of vmtimer in UnregisteredClasses::load_class
JDK-8319223 Enable parallelism in vmTestbase/gc/g1/unloading tests
JDK-8319222 Enable parallelism in vmTestbase/nsk/monitoring/stress/classload tests
JDK-8319385 Enable parallelism in vmTestbase/nsk/monitoring/stress/lowmem tests
JDK-8319225 Enable parallelism in vmTestbase/nsk/monitoring/stress/thread tests
JDK-8318549 Endless loop in C2 compilation triggered by AddNode::IdealIL
JDK-8316202 Extend internal Architecture enum with byte order and address size
JDK-8320415 GHA: Cross-compile gtest code
JDK-8319210 Improve IllegalAccessException message to include the cause of the exception
JDK-8320776 Improve performance of Symbol::print_value_on()
JDK-8317787 Incorrect control in LibraryCallKit::inline_native_notify_jvmti_funcs
JDK-8316282 Infinite permission checking loop in java/net/spi/InetAddressResolverProvider/RuntimePermissionTest
JDK-8319216 java/foreign tests should respect vm flags when start new processes
JDK-8320416 java/lang/Thread/IsAlive.java timed out
JDK-8316203 jdk/internal/util/ArchTest.java fails after JDK-8308452 failed with Method isARM()
JDK-8318545 LockStack::contains(oop) fails "assert(t->is_Java_thread()) failed: incorrect cast to JavaThread"
JDK-8319212 make test cannot run .jasm tests directly
JDK-8317509 More generic way to handshake GC threads with monitor deflation
JDK-8320778 Move most tier 1 vector API regression tests to tier 3
JDK-8318551 Move the fast locking implementation out of the .ad files
JDK-8318734 New parentheses warnings after HarfBuzz 7.2.0 update
JDK-8319217 NullPointerException in CertStore.getCRLs after 8297955
JDK-8320777 Parallelize sun/security/rsa/SignedObjectChain.java subtests
JDK-8319723 PhaseIdealLoop::transform_long_range_checks fails with assert "was tested before"
JDK-8316747 PPC builds are broken after JDK-8304913
JDK-8319215 Primitive wrapper caches could be `@Stable`
JDK-8318548 Print LockStack in hs_err files
JDK-8319214 Rename TestUnstructuredLocking test
JDK-8319719 RISC-V: Remove dependency on libatomic by adding cmpxchg 1b
JDK-8318542 Shenandoah: Shenandoah degenerated GC and full GC need to cleanup old OopMapCache entries
JDK-8316495 Shenandoah: STW mark should keep nmethod/oops referenced from stack chunk alive
JDK-8317783 Sort platform enums and definitions after JDK-8304913 follow-ups
JDK-8316664 SPARC64 builds are broken after JDK-8304913
JDK-8318544 SSLEngine throws NPE parsing CertificateRequests
JDK-8318543 test fails "assert(check_alignment(result)) failed: address not aligned: 0x00000008baadbabe"
JDK-8318733 test hprof lib: invalid array element type from JavaValueArray.elementSize
JDK-8318166 test/jdk/java/io/File/TempDirDoesNotExist.java leaves test files behind
JDK-8320779 Unbound ScopedValue.get() throws the wrong exception
JDK-8315699 Update to use jtreg 7.3
JDK-8315705 Update to use jtreg 7.3.1
JDK-8317785 Use consistent naming for lightweight locking in MacroAssembler
JDK-8318731 UseHeavyMonitors not used

Sidraya Jayagond, IBM

Bug Summary
JDK-8314631 [s390] Implementation of Foreign Function & Memory API (Preview)

Shivangi Gupta, Oracle

Bug Summary
JDK-8320315 Enable specifying the JDK used to run jtreg
JDK-8320316 JAVA_FLAGS removed from jtreg running in JDK-8317039

Thomas Stuefe, Red Hat

Bug Summary
JDK-8318576 C2 recompilations cause high memory footprint
JDK-8319288 Class space not marked as such with NMT when CDS is off
JDK-8319922 libCreationTimeHelper.so fails to link in JDK 21
JDK-8318168 NMT: Make peak values available in release builds
JDK-8320063 runtime/NMT/VirtualAllocCommitMerge.java may fail if mixing interpreted and compiled native invocations

Sandhya Viswanathan, Intel

Bug Summary
JDK-8320508 Computational test more than 2x slower when AVX instructions are used
JDK-8320504 VectorMaskGen clobbers rflags on x86_64

sxa, Red Hat

Bug Summary
JDK-8320238 test/jdk/java/io/File/libGetXSpace.c does not compile on Windows 32-bit

Tobias Hartmann, Oracle

Bug Summary
JDK-8323082 [BACKOUT] 8318562: Computational test more than 2x slower when AVX instructions are used
JDK-8319383 C2: add bailout after assert Bad graph detected in build_loop_late

v-terrychow, Microsoft

Bug Summary
JDK-8315991 Add KEEPALIVE Extended Socket Options Support for Windows

Vladimir Kempik, Syntacore

Bug Summary
JDK-8315957 RISC-V: intrinsic for unsignedMultiplyHigh
JDK-8317475 RISC-V: llvm build broken

Weijun Wang, Oracle

Bug Summary
JDK-8322086 RSA signature verification fails on signed data that does not encode params correctly

William Kemper, Amazon

Bug Summary
JDK-8316134 Shenandoah: Unable to throw OOME on back-to-back Full GCs

Zdenek Zambersky, Red Hat

Bug Summary
JDK-8317573 StoreReproducibilityTest fails on some locales