PUSHES REPORT: 21.0.3

This report shows who pushed the backports to the given release. This usually shows who did the backporting, testing, and review work.

Report generated: Fri Mar 01 07:25:15 CET 2024

Distribution by priority

Count Priority
3 P1
19 P2
61 P3
179 P4
7 P5

Distribution by components

Count Component
269 100% Total
141 52.4% hotspot
44 16.4% hotspot/runtime
43 16.0% hotspot/compiler
36 13.4% hotspot/gc
7 2.6% hotspot/test
3 1.1% hotspot/svc-agent
2 0.7% hotspot/jfr
2 0.7% hotspot/svc
2 0.7% hotspot/other
1 0.4% hotspot/jvmti
1 0.4% hotspot
38 14.1% core-libs
7 2.6% core-libs/java.io
5 1.9% core-libs/java.util:i18n
4 1.5% core-libs/java.nio
4 1.5% core-libs/java.net
4 1.5% core-libs/java.lang
3 1.1% core-libs/java.lang.foreign
2 0.7% core-libs/java.util.concurrent
2 0.7% core-libs/java.time
1 0.4% core-libs/javax.script
1 0.4% core-libs/java.util
1 0.4% core-libs/java.nio.charsets
1 0.4% core-libs
1 0.4% core-libs/java.text
1 0.4% core-libs/javax.naming
1 0.4% core-libs/java.util.jar
26 9.7% client-libs
15 5.6% client-libs/javax.swing
4 1.5% client-libs/2d
4 1.5% client-libs/java.awt
1 0.4% client-libs
1 0.4% client-libs/javax.sound
1 0.4% client-libs/javax.accessibility
24 8.9% security-libs
10 3.7% security-libs/java.security
6 2.2% security-libs/javax.crypto:pkcs11
3 1.1% security-libs
2 0.7% security-libs/javax.net.ssl
1 0.4% security-libs/javax.smartcardio
1 0.4% security-libs/javax.xml.crypto
1 0.4% security-libs/javax.security
13 4.8% infrastructure
12 4.5% infrastructure/build
1 0.4% infrastructure/release_eng
13 4.8% tools
10 3.7% tools/javac
2 0.7% tools/javadoc(tool)
1 0.4% tools/jar
12 4.5% core-svc
4 1.5% core-svc/debugger
4 1.5% core-svc/java.lang.management
3 1.1% core-svc/tools
1 0.4% core-svc/java.lang.instrument
1 0.4% install
1 0.4% install/test
1 0.4% xml
1 0.4% xml/jaxp

Distribution by affiliation

This Release Pushes

Original Pushes

Count Committer
269 100% Total
139 51.7% SAP
98 36.4% Goetz Lindenmaier
19 7.1% Matthias Baesken
7 2.6% Andrew Lu
4 1.5% Amos SHI
4 1.5% Christoph Langer
3 1.1% Joachim Kern
2 0.7% Martin Doerr
1 0.4% Richard Reingruber
1 0.4% Johannes Bechberger
82 30.5% Amazon
65 24.2% Aleksey Shipilev
7 2.6% Sergey Bylokhov
4 1.5% William Kemper
2 0.7% Dan Lutker
2 0.7% Elif Aslan
1 0.4% Oli Gillespie
1 0.4% Evgeny Astigeevich
14 5.2% Red Hat
6 2.2% Sonia Zaldana Calles
2 0.7% Andrew Leonard
2 0.7% Jonathan Dowland
1 0.4% Martin Balao
1 0.4% Frederic Thevenet
1 0.4% Andrew Hughes
1 0.4% Severin Gehwolf
9 3.3% Oracle
2 0.7% Christian Hagedorn
2 0.7% Ravi Reddy
1 0.4% Weijun Wang
1 0.4% Manukumar V S
1 0.4% Tobias Hartmann
1 0.4% Darragh Clarke
1 0.4% Ramesh Gangadhar
6 2.2% Independent
3 1.1% Gui Cao
1 0.4% Chris Hegarty
1 0.4% anton.hagerstrand
1 0.4% Ilya Gavrilin
3 1.1% Alibaba
3 1.1% Liang Mao
3 1.1% Azul
2 0.7% Olga Mikhaltcova
1 0.4% Jan Kratochvil
3 1.1% Microsoft
3 1.1% George Adams
2 0.7% Fujitsu
1 0.4% Takuya Kiriyama
1 0.4% Kimura Yukihiro
2 0.7% IBM
1 0.4% Ichiroh Takiguchi
1 0.4% psoujany
2 0.7% Intel
2 0.7% Sandhya Viswanathan
1 0.4% DataDog
1 0.4% Jaroslav Bachorík
1 0.4% Google
1 0.4% Liam Miller-Cushon
1 0.4% Loongson
1 0.4% Sun Yaqi
1 0.4% Unknown
1 0.4% syan
Count Committer
269 100% Total
162 60.2% Oracle
15 5.6% Leo Korinth
13 4.8% Leonid Mesnik
8 3.0% Justin Lu
7 2.6% Christian Hagedorn
6 2.2% Matthew Donovan
6 2.2% Emanuel Peter
6 2.2% Prasanta Sadhukhan
5 1.9% Weijun Wang
5 1.9% Tobias Hartmann
4 1.5% Brian Burkhalter
4 1.5% Naoto Sato
3 1.1% Stefan Karlsson
3 1.1% Abhishek Kumar
3 1.1% Thomas Schatzl
3 1.1% Angelos Bimpoudis
3 1.1% Jan Lahoda
3 1.1% David Holmes
3 1.1% Mikhailo Seledtsov
2 0.7% Patricio Chilano Mateo
2 0.7% Calvin Cheung
2 0.7% Mark Powers
2 0.7% Darragh Clarke
2 0.7% Daniel Fuchs
2 0.7% Gergö Barany
2 0.7% Alexander Zvegintsev
2 0.7% johny.jose
2 0.7% Damon Fenacci
2 0.7% Vicente Arturo Romero Zaldivar
2 0.7% Renjith Kannath Pariyangad
2 0.7% Weibing Xiao
1 0.4% Harshitha Onkar
1 0.4% Mark Sheppard
1 0.4% Sean Mullan
1 0.4% Alan Bateman
1 0.4% Evgeny Nikitin
1 0.4% Ravi Reddy
1 0.4% Sean Coffey
1 0.4% Pavel Rappo
1 0.4% Maurizio Cimadamore
1 0.4% Roger Riggs
1 0.4% Mahendra Chhipa
1 0.4% Jim Laskey
1 0.4% Valerie Peng
1 0.4% Tobias Holenstein
1 0.4% Kevin Walls
1 0.4% Erik Österlund
1 0.4% Jorn Vernee
1 0.4% Dean Long
1 0.4% Alex Menkov
1 0.4% Rajat Mahajan
1 0.4% Paul Sandoz
1 0.4% Magnus Ihse Bursie
1 0.4% Daniel Jelinski
1 0.4% Chris Plummer
1 0.4% Ioi Lam
1 0.4% Rajan Halade
1 0.4% Ravi Gupta
1 0.4% Axel Boldt-Christmas
1 0.4% Damon Nguyen
1 0.4% Matias Saavedra Silva
1 0.4% Alexey Ivanov
1 0.4% Vladimir Kozlov
1 0.4% Jaikiran Pai
1 0.4% Jamil Nimeh
1 0.4% Alisen Chung
1 0.4% Mikael Vidstedt
1 0.4% Philip Race
1 0.4% Viktor Klang
32 11.9% Amazon
20 7.4% Aleksey Shipilev
4 1.5% William Kemper
3 1.1% Sergey Bylokhov
2 0.7% Elif Aslan
1 0.4% Yi-Fan Tsai
1 0.4% Xin Liu
1 0.4% Evgeny Astigeevich
29 10.8% SAP
17 6.3% Matthias Baesken
4 1.5% Christoph Langer
4 1.5% Joachim Kern
2 0.7% Goetz Lindenmaier
1 0.4% Martin Doerr
1 0.4% Richard Reingruber
14 5.2% Independent
3 1.1% Guoxiong Li
2 0.7% Gui Cao
1 0.4% ae40515
1 0.4% Artem Semenov
1 0.4% Chris Hegarty
1 0.4% Daohan Qu
1 0.4% Eirik Bjørsnøs
1 0.4% gregor
1 0.4% 7039722+JonasNorlinder
1 0.4% ckozak
1 0.4% Ilya Gavrilin
10 3.7% Red Hat
2 0.7% Andrew Leonard
2 0.7% Thomas Stuefe
2 0.7% Roland Westrelin
1 0.4% Martin Balao
1 0.4% Frederic Thevenet
1 0.4% Andrew Hughes
1 0.4% Severin Gehwolf
4 1.5% IBM
1 0.4% Ichiroh Takiguchi
1 0.4% gaurav.chaudhari
1 0.4% psoujany
1 0.4% Varada M
3 1.1% Azul
2 0.7% Olga Mikhaltcova
1 0.4% Ekaterina Vergizova
3 1.1% Intel
2 0.7% Sandhya Viswanathan
1 0.4% Scott Gibbons
2 0.7% ARM
1 0.4% Hao Sun
1 0.4% Pengfei Li
2 0.7% Alibaba
1 0.4% yansendao.ysd
1 0.4% xingqizheng.xqz
2 0.7% Fujitsu
2 0.7% Kimura Yukihiro
1 0.4% @gentoo.org
1 0.4% sam
1 0.4% DataDog
1 0.4% Jaroslav Bachorík
1 0.4% Google
1 0.4% Liam Miller-Cushon
1 0.4% Loongson
1 0.4% Leslie Zhai
1 0.4% Microsoft
1 0.4% George Adams
1 0.4% Tencent
1 0.4% Jie Fu

Chronological push log:

UTC Time This Release Push By Original Push By Bug Summary
Name Affiliation Name Affiliation
2024/02/27 09:50 Christoph Langer SAP (same) (same) JDK-8326771 java/awt/font/JNICheck/FreeTypeScalerJNICheck.java still fails with JNI warning on some Windows configurations
2024/02/27 09:24 Matthias Baesken SAP Thomas Stuefe Red Hat JDK-8326765 Make TrimNativeHeapInterval a product switch
2024/02/26 18:15 Sergey Bylokhov Amazon Rajat Mahajan Oracle JDK-8326695 JDK-8294427 breaks Windows L&F on all older Windows versions
2024/02/26 11:03 Matthias Baesken SAP (same) (same) JDK-8326662 crashes in docker container tests on Linuxppc64le Power8 machines
2024/02/26 10:53 Matthias Baesken SAP (same) (same) JDK-8326657 [AIX] use fclose after fopen in read_psinfo
2024/02/26 07:21 Andrew Lu SAP Alexey Ivanov Oracle JDK-8326637 Allow PassFailJFrame to accept single window creator
2024/02/23 09:11 Christoph Langer SAP (same) (same) JDK-8326565 Remove obsolete comments for class sun.security.ssl.SunJSSE
2024/02/23 07:50 Matthias Baesken SAP Leonid Mesnik Oracle JDK-8326555 gtest wrappers should be marked as flagless
2024/02/23 07:43 Martin Balao Red Hat (same) (same) JDK-8326554 CKA_TOKEN private and secret keys are not necessarily sensitive
2024/02/22 13:43 psoujany IBM (same) (same) JDK-8326490 Interactive component with ARIA role 'tabpanel' does not have a programmatically associated name
2024/02/22 09:25 Aleksey Shipilev Amazon Rajan Halade Oracle JDK-8326476 Add Certainly roots R1 and E1
2024/02/22 09:24 Aleksey Shipilev Amazon Axel Boldt-Christmas Oracle JDK-8326475 ZGC fails assert(index == 0 || is_power_of_2(index)) failed: Incorrect load shift: 11
2024/02/22 09:07 Andrew Lu SAP Alexander Zvegintsev Oracle JDK-8326474 Open source several AWT applet tests
2024/02/21 13:55 syan Unknown yansendao.ysd Alibaba JDK-8326415 [TESTBUG]testMemoryFailCount in jdk/internal/platform/docker/TestDockerMemoryMetrics.java always fail because OOM killed
2024/02/21 09:53 Liang Mao Alibaba Guoxiong Li Independent JDK-8326393 Generational ZGC: Clearing All SoftReferences log line lacks GCId
2024/02/21 09:52 Darragh Clarke Oracle (same) (same) JDK-8326392 java/net/HttpURLConnection/HttpURLConnectionExpectContinueTest.java fails intermittently in timeout
2024/02/20 11:26 Ilya Gavrilin Independent (same) (same) JDK-8326320 RISC-V: Tune costs for shuffles with no conversion
2024/02/19 15:47 Evgeny Astigeevich Amazon (same) (same) JDK-8326217 AArch64: crypto pmull based CRC32/CRC32C intrinsics clobber V8-V15 registers
2024/02/19 15:40 Aleksey Shipilev Amazon Jorn Vernee Oracle JDK-8326215 Fallback linker passes bad JNI handle
2024/02/19 09:51 Joachim Kern SAP (same) (same) JDK-8326156 [AIX] Find a better way to mimic dl handle equality
2024/02/19 08:30 Aleksey Shipilev Amazon Emanuel Peter Oracle JDK-8326134 C2: allocate PhaseIdealLoop::_loop_or_ctrl from C->comp_arena()
2024/02/19 07:32 Aleksey Shipilev Amazon Maurizio Cimadamore Oracle JDK-8326131 java/foreign/TestLinker.java failed with "error occurred while instantiating class TestLinker: null"
2024/02/19 07:32 Amos SHI SAP Prasanta Sadhukhan Oracle JDK-8326130 Open source swing security manager test
2024/02/16 17:21 Sergey Bylokhov Amazon (same) (same) JDK-8326072 Enable "maybe-uninitialized" warning for FreeType 2.13.1
2024/02/16 02:30 Sergey Bylokhov Amazon (same) (same) JDK-8326008 Parallelize sun/java2d/marlin/ClipShapeTest.java
2024/02/15 13:41 Andrew Hughes Red Hat (same) (same) JDK-8325958 PlatformPCSC should load versioned so
2024/02/15 09:07 Aleksey Shipilev Amazon Thomas Stuefe Red Hat JDK-8325933 NMT detail report slow or hangs for large number of mappings
2024/02/15 08:49 Aleksey Shipilev Amazon (same) (same) JDK-8325930 Introduce test keyword for tests that need external dependencies
2024/02/15 08:49 Aleksey Shipilev Amazon (same) (same) JDK-8325929 ClassLoaderData::print_on should print address of class loader
2024/02/14 11:53 Aleksey Shipilev Amazon Paul Sandoz Oracle JDK-8325856 [vectorapi] Bounds checking issues when accessing memory segments
2024/02/14 11:42 Aleksey Shipilev Amazon Leonid Mesnik Oracle JDK-8325855 update jcstress to 0.16
2024/02/14 11:41 Aleksey Shipilev Amazon Jie Fu Tencent JDK-8325854 Invalid test group of lib-test after JDK-8323515
2024/02/14 11:41 Aleksey Shipilev Amazon (same) (same) JDK-8325853 Create test alias "all" for all test roots
2024/02/13 10:58 George Adams Microsoft Christoph Langer SAP JDK-8325733 GHA: JDK-8325194 causes a regression
2024/02/13 10:58 George Adams Microsoft (same) (same) JDK-8325732 GHA: Add macOS M1 testing
2024/02/13 08:54 Matthias Baesken SAP (same) (same) JDK-8325720 [AIX] adjust os_posix after JDK-8318696
2024/02/12 15:28 Andrew Leonard Red Hat (same) (same) JDK-8325646 DevKit build gcc libraries contain full paths to source location
2024/02/12 15:18 Andrew Leonard Red Hat (same) (same) JDK-8325642 Library debug files contain non-reproducible full gcc include paths
2024/02/12 10:41 George Adams Microsoft Mikael Vidstedt Oracle JDK-8325619 GHA: Bump macOS and Xcode versions
2024/02/09 22:36 Dan Lutker Amazon johny.jose Oracle JDK-8325582 (tz) Update Timezone Data to 2024a
2024/02/08 20:45 Sergey Bylokhov Amazon Hao Sun ARM JDK-8325524 AArch64: [TESTBUG] compiler/intrinsics/sha/cli/TestUseSHA3IntrinsicsOptionOnSupportedCPU.java fails on Neoverse N2 and V1
2024/02/08 11:25 Matthias Baesken SAP (same) (same) JDK-8325486 [aix] Implement support for reporting swap space in jdk.management
2024/02/08 10:22 Matthias Baesken SAP (same) (same) JDK-8325480 use mem_unit when working with sysinfo memory and swap related information
2024/02/08 10:20 Matthias Baesken SAP (same) (same) JDK-8325479 runtime/Thread/ThreadCountLimit.java fails intermittently on AIX
2024/02/08 09:27 Aleksey Shipilev Amazon (same) (same) JDK-8325475 Zero: Misplaced CX8 enablement flag
2024/02/08 09:27 Aleksey Shipilev Amazon (same) (same) JDK-8325474 Zero: Support 8-byte cmpxchg
2024/02/07 07:44 Aleksey Shipilev Amazon (same) (same) JDK-8325389 Fallback implementations for 64-bit Atomic::{add,xchg} on 32-bit platforms
2024/02/06 15:59 Aleksey Shipilev Amazon Sean Coffey Oracle JDK-8325339 Test java/security/cert/CertPathBuilder/akiExt/AKISerialNumber.java is failing
2024/02/06 15:58 Aleksey Shipilev Amazon (same) (same) JDK-8325338 Shenandoah: Remove ShenandoahSuspendibleWorkers flag
2024/02/06 15:56 Aleksey Shipilev Amazon Stefan Karlsson Oracle JDK-8325336 Generational ZGC: Relocation selection must join the STS
2024/02/06 12:56 Matthias Baesken SAP (same) (same) JDK-8325323 Simplify shared lib name handling code in some tests
2024/02/05 12:38 Goetz Lindenmaier SAP Pengfei Li ARM JDK-8325243 [TESTBUG] Remove "@requires vm.flagless" from jtreg vectorization tests
2024/02/03 21:38 Aleksey Shipilev Amazon Magnus Ihse Bursie Oracle JDK-8325197 Capture hotspot replay files in GHA
2024/02/03 21:37 Aleksey Shipilev Amazon (same) (same) JDK-8325196 GHA: Avoid multiple test suites per job
2024/02/03 10:00 Aleksey Shipilev Amazon (same) (same) JDK-8325193 Zero: Use __atomic built-ins for atomic RMW operations
2024/01/31 13:06 Joachim Kern SAP (same) (same) JDK-8325048 com/sun/jdi/JdwpAllowTest.java shows failures on AIX if prefixLen of mask is larger than 32 in IPv6 case
2024/01/31 12:58 Aleksey Shipilev Amazon Christian Hagedorn Oracle JDK-8325046 C2: assert(n->in(0) == nullptr) failed: divisions with zero check should already have bailed out earlier in split-if
2024/01/31 12:53 Amos SHI SAP Prasanta Sadhukhan Oracle JDK-8325045 Open source swing text/html and tree test
2024/01/30 21:13 Olga Mikhaltcova Azul (same) (same) JDK-8325000 RISC-V: implement ensureMaterializedForStackWalk intrinsic
2024/01/30 09:46 Aleksey Shipilev Amazon Christian Hagedorn Oracle JDK-8324934 C2: assert(cmp != nullptr && cmp->Opcode() == Op_Cmp(bt)) failed: no exit test
2024/01/30 09:26 Goetz Lindenmaier SAP Brian Burkhalter Oracle JDK-8324932 Files/probeContentType/Basic.java fails on latest Windows 11 - content type mismatch
2024/01/30 09:25 Goetz Lindenmaier SAP Daniel Jelinski Oracle JDK-8324931 Remove pkcs11/Cipher/TestKATForGCM.java from ProblemList
2024/01/30 08:18 Amos SHI SAP Prasanta Sadhukhan Oracle JDK-8324912 Open source few more headless Swing misc tests
2024/01/30 08:17 Amos SHI SAP Brian Burkhalter Oracle JDK-8324895 java/io/File/createTempFile/SpecialTempFile.java fails in Windows 11
2024/01/29 14:30 Gui Cao Independent xingqizheng.xqz Alibaba JDK-8324847 RISC-V: Incorrect implementation in VM_Version::parse_satp_mode
2024/01/29 09:12 Aleksey Shipilev Amazon (same) (same) JDK-8324826 GHA: Generic jtreg errors are not reported
2024/01/29 08:23 Andrew Lu SAP Abhishek Kumar Oracle JDK-8324819 Open source few swing JList and JMenuBar tests
2024/01/26 16:11 anton.hagerstrand Independent ckozak Independent JDK-8324773 JFR: Periodic tasks aren't orphaned between recordings
2024/01/26 02:17 Andrew Lu SAP Justin Lu Oracle JDK-8324747 ISO 4217 Amendment 176 Update
2024/01/26 02:15 Andrew Lu SAP Ravi Gupta Oracle JDK-8324746 Write a test to check textArea triggers MouseEntered/MouseExited events properly
2024/01/25 20:10 William Kemper Amazon (same) (same) JDK-8324738 Shenandoah: Remove unused code
2024/01/25 09:20 Liang Mao Alibaba Guoxiong Li Independent JDK-8324712 Generational ZGC: ZPageSizeMedium should be set before MaxTenuringThreshold
2024/01/25 09:05 Goetz Lindenmaier SAP Matthew Donovan Oracle JDK-8324705 sun/security/pkcs11 tests fail on Linux RHEL 8.6 and newer
2024/01/24 19:24 Aleksey Shipilev Amazon (same) (same) JDK-8324663 Shenandoah: Remove ShenandoahLoopOptsAfterExpansion flag
2024/01/24 17:36 Aleksey Shipilev Amazon (same) (same) JDK-8324654 Shenandoah: Remove ShenandoahElasticTLAB flag
2024/01/24 16:56 Aleksey Shipilev Amazon Vladimir Kozlov Oracle JDK-8324652 Issue store-store barrier after re-materializing objects during deoptimization
2024/01/24 12:40 Aleksey Shipilev Amazon (same) (same) JDK-8324622 Require platforms to define DEFAULT_CACHE_LINE_SIZE
2024/01/24 12:39 Aleksey Shipilev Amazon Tobias Hartmann Oracle JDK-8324621 compiler/tiered/LevelTransitionTest.java fails with -XX:CompileThreshold=100 -XX:TieredStopAtLevel=1
2024/01/23 08:38 Aleksey Shipilev Amazon David Holmes Oracle JDK-8324485 JNI invocation of an abstract instance method corrupts the stack
2024/01/23 08:26 Aleksey Shipilev Amazon (same) (same) JDK-8324476 Incorrect LoaderConstraintTable::add_entry after JDK-8298468
2024/01/23 08:25 Sun Yaqi Loongson Stefan Karlsson Oracle JDK-8324473 Generational ZGC: The SoftMaxHeapSize might be wrong when CDS decreases the MaxHeapSize
2024/01/23 08:06 Matthias Baesken SAP sam @gentoo.org JDK-8324439 Do not use LFS64 symbols on Linux
2024/01/23 08:05 Goetz Lindenmaier SAP Matthew Donovan Oracle JDK-8324438 Skip pkcs11 tests on linux-aarch64
2024/01/23 08:05 Goetz Lindenmaier SAP Matthew Donovan Oracle JDK-8324437 sun/security/pkcs11 tests fail on OL 7.9 aarch64
2024/01/23 07:59 Goetz Lindenmaier SAP Weijun Wang Oracle JDK-8324436 Compatibility.java reads both stdout and stderr of JdkUtils
2024/01/23 07:55 Goetz Lindenmaier SAP Justin Lu Oracle JDK-8324434 Tests in Locale should have more descriptive names
2024/01/22 10:37 Olga Mikhaltcova Azul (same) (same) JDK-8324297 RISC-V: implement roundD/roundF intrinsics
2024/01/22 08:43 Andrew Lu SAP Renjith Kannath Pariyangad Oracle JDK-8324285 WheelModifier.java fails by timeout
2024/01/22 08:43 Goetz Lindenmaier SAP Mahendra Chhipa Oracle JDK-8324284 Binary files in JAXP test should be removed
2024/01/22 08:18 Aleksey Shipilev Amazon Viktor Klang Oracle JDK-8324278 java/util/concurrent/ConcurrentLinkedQueue/WhiteBox.java shows intermittent failures on linux ppc64le and aarch64
2024/01/19 15:48 Goetz Lindenmaier SAP Matthew Donovan Oracle JDK-8324217 Support for NSS tests on aarch64 platforms
2024/01/19 15:47 Johannes Bechberger SAP Artem Semenov Independent JDK-8324216 [macos14] Expand/collapse a JTree using keyboard freezes the application in macOS 14 Sonoma
2024/01/19 09:35 Liang Mao Alibaba Guoxiong Li Independent JDK-8324201 Generational ZGC: Use ZFragmentationLimit and ZYoungCompactionLimit as percentage instead of multiples
2024/01/18 16:03 Goetz Lindenmaier SAP Matthias Baesken SAP JDK-8324158 filter out harmful -std* flags added by autoconf from CXX
2024/01/18 14:54 Richard Reingruber SAP (same) (same) JDK-8324143 Parallel: Implement better work distribution for large object arrays in old gen
2024/01/18 14:23 Goetz Lindenmaier SAP Damon Nguyen Oracle JDK-8324140 JButton ignores margin when painting HTML text
2024/01/18 14:21 Goetz Lindenmaier SAP David Holmes Oracle JDK-8324139 Modify runtime/ErrorHandling/TestDwarf.java to split dwarf and decoder testing
2024/01/18 14:21 Goetz Lindenmaier SAP Brian Burkhalter Oracle JDK-8324138 (fs) Move toRealPath tests in java/nio/file/Path/Misc.java to separate JUnit 5 test
2024/01/18 14:18 Goetz Lindenmaier SAP Justin Lu Oracle JDK-8324137 Additional refactoring of Locale tests to JUnit
2024/01/18 08:36 Matthias Baesken SAP (same) (same) JDK-8324120 fix typo hpage_pdm_size
2024/01/18 08:36 Matthias Baesken SAP (same) (same) JDK-8324119 os::Linux::print_system_memory_info enhance the THP output with /sys/kernel/mm/transparent_hugepage/hpage_pmd_size
2024/01/18 03:49 Chris Hegarty Independent (same) (same) JDK-8323678 LinkedTransferQueue add and put methods call overridable offer
2024/01/17 21:31 Goetz Lindenmaier SAP Eirik Bjørsnøs Independent JDK-8324063 Speed up test/jdk/java/util/zip/ZipFile/TestTooManyEntries.java and clarify its purpose
2024/01/17 21:26 Goetz Lindenmaier SAP Daniel Fuchs Oracle JDK-8324061 Test logic for BODY_CF in AbstractThrowingSubscribers.java is wrong
2024/01/17 21:22 Goetz Lindenmaier SAP Leslie Zhai Loongson JDK-8324058 Disable runtime/os/TestTracePageSizes.java for ShenandoahGC
2024/01/17 21:22 Goetz Lindenmaier SAP Roger Riggs Oracle JDK-8324057 CloseRace.java#id0 fails transiently on libgraal
2024/01/17 21:16 Goetz Lindenmaier SAP Justin Lu Oracle JDK-8324055 Refactor Currency tests to use JUnit
2024/01/17 21:14 Goetz Lindenmaier SAP Emanuel Peter Oracle JDK-8324054 IR verification fails because IR dump is chopped up
2024/01/17 18:17 William Kemper Amazon (same) (same) JDK-8324045 Shenandoah: Unused memory in regions compacted during a full GC should be mangled
2024/01/17 16:11 Sonia Zaldana Calles Red Hat Justin Lu Oracle JDK-8324038 ChoiceFormat patterns are not well tested
2024/01/17 16:10 Sonia Zaldana Calles Red Hat Abhishek Kumar Oracle JDK-8324037 Open source few swing JInternalFrame and JMenuBar tests
2024/01/17 16:07 Sonia Zaldana Calles Red Hat Renjith Kannath Pariyangad Oracle JDK-8324036 Improve stability of WheelModifier.java test
2024/01/17 16:07 Sonia Zaldana Calles Red Hat Alexander Zvegintsev Oracle JDK-8324035 Popups that request focus are not shown on Linux with Wayland
2024/01/17 16:02 William Kemper Amazon (same) (same) JDK-8324034 Shenandoah: Heap could be corrupted by oom during evacuation
2024/01/17 15:18 Aleksey Shipilev Amazon Roland Westrelin Red Hat JDK-8324000 C2 compilation fails with "Bad immediate dominator info"
2024/01/17 08:34 Matthias Baesken SAP Alex Menkov Oracle JDK-8323962 com/sun/jdi/JdwpAllowTest.java fails on Alpine 3.17 / 3.18
2024/01/17 08:01 Andrew Lu SAP Prasanta Sadhukhan Oracle JDK-8323955 Open source few headless Swing misc tests
2024/01/16 16:06 Aleksey Shipilev Amazon Jan Lahoda Oracle JDK-8323816 javac with annotation processor throws AssertionError: Filling jrt:/... during JarFileObject[/...]
2024/01/16 14:25 Goetz Lindenmaier SAP Naoto Sato Oracle JDK-8323808 test/jdk/sun/nio/cs/TestCharsetMapping.java is spuriously passing
2024/01/16 09:04 Goetz Lindenmaier SAP Weibing Xiao Oracle JDK-8323777 Better Error Handling for Jar Tool When Processing Non-existent Files
2024/01/16 09:02 Goetz Lindenmaier SAP Weijun Wang Oracle JDK-8323776 Update XML Security for Java to 3.0.3
2024/01/16 08:34 Aleksey Shipilev Amazon (same) (same) JDK-8323770 Shenandoah: Enable ShenandoahVerifyOptoBarriers in debug builds
2024/01/16 08:33 Aleksey Shipilev Amazon (same) (same) JDK-8323769 Shenandoah: Remove ShenandoahUnloadClassesFrequency support
2024/01/16 08:22 Aleksey Shipilev Amazon (same) (same) JDK-8323767 Shenandoah: Remove ShenandoahSelfFixing flag
2024/01/15 19:20 Aleksey Shipilev Amazon (same) (same) JDK-8323750 Unneccesary CodeBlob lookup in CompiledIC::internal_set_ic_destination
2024/01/15 19:17 Aleksey Shipilev Amazon Jim Laskey Oracle JDK-8323749 StringBuffer.repeat does not work correctly after toString() was called
2024/01/15 15:16 Aleksey Shipilev Amazon Jan Lahoda Oracle JDK-8323737 yield .class not parsed correctly.
2024/01/15 15:15 Christoph Langer SAP Varada M IBM JDK-8323736 AIX: pthreads created by foreign test library don't work as expected
2024/01/11 07:30 Goetz Lindenmaier SAP Gergö Barany Oracle JDK-8323567 Increase timeout for JDK tests that are close to the limit when run with libgraal
2024/01/11 07:26 Goetz Lindenmaier SAP Matthew Donovan Oracle JDK-8323565 java/security/cert/CertPathValidator/OCSP/OCSPTimeout.java fails with RuntimeException Server not ready
2024/01/11 07:23 Goetz Lindenmaier SAP Alan Bateman Oracle JDK-8323564 Test java/lang/Thread/virtual/JfrEvents::testVirtualThreadPinned failed
2024/01/10 15:30 Matthias Baesken SAP (same) (same) JDK-8323533 prioritize /etc/os-release over /etc/SuSE-release in hs_err/info output
2024/01/10 12:19 Elif Aslan Amazon (same) (same) JDK-8323513 Enable parallelism in vmTestbase/nsk/stress/jni tests
2024/01/10 12:19 Elif Aslan Amazon (same) (same) JDK-8323512 Enable parallelism in vmTestbase/nsk/stress/threads tests
2024/01/10 01:06 Ichiroh Takiguchi IBM (same) (same) JDK-8323433 Chinese characters in RTF are not decoded
2024/01/09 17:24 Dan Lutker Amazon johny.jose Oracle JDK-8323341 (tz) Update Timezone Data to 2023d
2024/01/09 17:21 Aleksey Shipilev Amazon Calvin Cheung Oracle JDK-8323339 CDSProtectionDomain::get_shared_protection_domain should check for exception
2024/01/09 16:24 Aleksey Shipilev Amazon Erik Österlund Oracle JDK-8323329 Generational ZGC: ZColorStoreGoodOopClosure is only valid for young objects
2024/01/09 15:32 Goetz Lindenmaier SAP Justin Lu Oracle JDK-8323323 Refactor java.util.Currency:i18n shell tests to plain java tests
2024/01/09 15:17 Goetz Lindenmaier SAP Mark Powers Oracle JDK-8323303 NSS tests failing on OL9 linux-aarch64 hosts
2024/01/09 09:09 William Kemper Amazon (same) (same) JDK-8323267 Shenandoah: Encountered reference count always attributed to first worker thread
2024/01/09 09:05 Aleksey Shipilev Amazon Tobias Hartmann Oracle JDK-8323266 [AArch64] C1 compilation fails because monitor offset in OSR buffer is too large for immediate
2024/01/09 08:48 Aleksey Shipilev Amazon Pavel Rappo Oracle JDK-8323262 ConcurrentModificationException from IndexWriter
2024/01/08 16:36 Aleksey Shipilev Amazon (same) (same) JDK-8323193 Zero: Use atomic built-ins for 64-bit accesses
2024/01/08 12:08 Aleksey Shipilev Amazon Angelos Bimpoudis Oracle JDK-8323176 Compiler should accept final variable in Record Pattern
2024/01/08 10:33 Oli Gillespie Amazon Scott Gibbons Intel JDK-8323161 Data loss in AVX3 Base64 decoding
2024/01/08 09:22 Goetz Lindenmaier SAP Mikhailo Seledtsov Oracle JDK-8323153 Simplify at-requires checkDockerSupport()
2024/01/08 09:20 Goetz Lindenmaier SAP Tobias Hartmann Oracle JDK-8323152 Stress mode to randomize incremental inlining decision
2024/01/08 09:20 Goetz Lindenmaier SAP Abhishek Kumar Oracle JDK-8323151 TestFileChooserSingleDirectorySelection.java fails with "getSelectedFiles returned empty array"
2024/01/08 09:13 Goetz Lindenmaier SAP Emanuel Peter Oracle JDK-8323148 C2 SuperWord: wrong result with hand unrolled loops
2024/01/08 09:08 Goetz Lindenmaier SAP Christian Hagedorn Oracle JDK-8323145 TestStressIGVNAndCCP.java failed with different IGVN traces for the same seed
2024/01/08 09:07 Goetz Lindenmaier SAP Philip Race Oracle JDK-8323143 [test bug] javax/swing/JTableHeader/6889007/bug6889007.java fails
2024/01/08 07:15 Goetz Lindenmaier SAP Justin Lu Oracle JDK-8323126 Several java/util tests should be updated to accept VM flags
2024/01/08 07:03 Goetz Lindenmaier SAP Leo Korinth Oracle JDK-8323124 Fix build failures caused by 8315097
2024/01/08 07:03 Goetz Lindenmaier SAP Leo Korinth Oracle JDK-8323123 Rename createJavaProcessBuilder
2024/01/06 12:14 Gui Cao Independent (same) (same) JDK-8323098 RISC-V: Enable fast class initialization checks
2024/01/05 17:57 Tobias Hartmann Oracle (same) (same) JDK-8324004 [BACKOUT] 8318562: Computational test more than 2x slower when AVX instructions are used
2024/01/05 15:32 Jonathan Dowland Red Hat Harshitha Onkar Oracle JDK-8323070 Open source several Swing Text related tests
2024/01/05 09:59 Aleksey Shipilev Amazon (same) (same) JDK-8323054 GHA: Parallelize hotspot_compiler test jobs
2024/01/05 09:59 Aleksey Shipilev Amazon Ioi Lam Oracle JDK-8323053 Add man page doc for -XX:+VerifySharedSpaces
2024/01/05 09:59 Aleksey Shipilev Amazon Jan Lahoda Oracle JDK-8323052 ThisEscapeAnalyzer crashes for erroneous code
2024/01/05 09:58 Aleksey Shipilev Amazon Thomas Schatzl Oracle JDK-8323049 Unexpected internal name for Filler array klass causes error in VisualVM
2024/01/05 09:58 Aleksey Shipilev Amazon Tobias Hartmann Oracle JDK-8323048 Crash in ciKlass::is_subtype_of because TypeAryPtr::_klass is not initialized
2024/01/04 19:17 Sergey Bylokhov Amazon Mark Powers Oracle JDK-8323015 NPE in PKCS7.parseOldSignedData
2024/01/04 09:11 Jonathan Dowland Red Hat Prasanta Sadhukhan Oracle JDK-8322999 [macos14] javax/swing/JMenuItem/4654927/bug4654927.java: component must be showing on the screen to determine its location
2024/01/04 09:02 Aleksey Shipilev Amazon Roland Westrelin Red Hat JDK-8322998 C2: remove copy-by-value of GrowableArray for InterfaceSet
2024/01/03 21:00 Sergey Bylokhov Amazon ae40515 Independent JDK-8322975 The SendRawSysexMessage test may cause a JVM crash
2024/01/03 13:30 Ravi Reddy Oracle (same) (same) JDK-8324003 [BACKOUT] 8225377: type annotations are not visible to javac plugins across compilation boundaries
2024/01/03 12:38 Aleksey Shipilev Amazon Patricio Chilano Mateo Oracle JDK-8322942 release _object in ObjectMonitor dtor to avoid races
2024/01/02 20:55 Sergey Bylokhov Amazon (same) (same) JDK-8322872 support latest VS2022 MSC_VER in abstract_vm_version.cpp
2024/01/02 16:58 Jan Kratochvil Azul Xin Liu Amazon JDK-8322862 hotspot can't compile with the latest of gtest because of
2023/12/31 09:26 Christoph Langer SAP (same) (same) JDK-8322794 Clean up code after JDK-8322417
2023/12/30 17:36 Sandhya Viswanathan Intel (same) (same) JDK-8322792 Some intrinsics/stubs missing vzeroupper on x86_64
2023/12/30 15:12 Goetz Lindenmaier SAP Christian Hagedorn Oracle JDK-8322791 C2: RepeatCompilation compiler directive does not choose stress seed randomly
2023/12/29 14:13 Goetz Lindenmaier SAP Thomas Schatzl Oracle JDK-8322780 CompilerThread leaks CodeBlob memory when dynamically stopping compiler thread in non-product
2023/12/29 14:13 Goetz Lindenmaier SAP Leo Korinth Oracle JDK-8322778 GC: Make TestArrayAllocatorMallocLimit use createTestJvm
2023/12/29 14:11 Goetz Lindenmaier SAP Valerie Peng Oracle JDK-8322777 PKCS11 tests fail with NSS 3.91
2023/12/29 14:09 Goetz Lindenmaier SAP Emanuel Peter Oracle JDK-8322776 C2 SuperWord: wrong result with -XX:+UseVectorCmov -XX:+UseCMoveUnconditionally
2023/12/29 14:07 Goetz Lindenmaier SAP Damon Fenacci Oracle JDK-8322775 runtime/ErrorHandling/TestAbortVmOnException.java times out due to core dumps taking a long time on OSX
2023/12/29 14:07 Goetz Lindenmaier SAP Calvin Cheung Oracle JDK-8322774 Memory leak related to ClassLoader::update_class_path_entry_list
2023/12/28 12:26 Goetz Lindenmaier SAP Patricio Chilano Mateo Oracle JDK-8322756 AArch64: VMError::print_native_stack() crashes on Java native method frame
2023/12/28 12:25 Goetz Lindenmaier SAP Damon Fenacci Oracle JDK-8322755 C1: -XX:AbortVMOnException does not work if all methods in the call stack are compiled with C1 and there are no exception handlers
2023/12/24 10:45 Goetz Lindenmaier SAP Weibing Xiao Oracle JDK-8322731 File.mkdirs() occasionally fails to create folders on Windows shared folder
2023/12/24 10:44 Goetz Lindenmaier SAP Matthias Baesken SAP JDK-8322729 Exclude sun/security/pkcs11/sslecc/ClientJSSEServerJSSE.java on Linux ppc64le
2023/12/23 10:56 Goetz Lindenmaier SAP gregor Independent JDK-8322715 Fix comment typo in PKCS12Passwd.java
2023/12/23 10:54 Goetz Lindenmaier SAP Leonid Mesnik Oracle JDK-8322713 3 sun/tools tests ignore VM flags
2023/12/23 10:51 Goetz Lindenmaier SAP Leonid Mesnik Oracle JDK-8322710 8 sun/management/jmxremote tests ignore VM flags
2023/12/22 18:11 Aleksey Shipilev Amazon Jamil Nimeh Oracle JDK-8322700 C2: Missing ChaCha20 stub for x86_32 leads to crashes
2023/12/22 18:11 Sandhya Viswanathan Intel (same) (same) JDK-8322699 Incorrect x86 instruction encoding for VSIB addressing mode
2023/12/22 15:54 Martin Doerr SAP Joachim Kern SAP JDK-8322695 [AIX] Dont mix os::dll_load() with direct dlclose() calls
2023/12/22 10:27 Goetz Lindenmaier SAP (same) (same) JDK-8322688 Problem list gc/TestAllocHumongousFragment.java subtests for 8298781
2023/12/22 10:25 Goetz Lindenmaier SAP (same) (same) JDK-8322686 Console read line with zero out should zero out when throwing exception
2023/12/22 10:23 Goetz Lindenmaier SAP Thomas Schatzl Oracle JDK-8322683 jdk/jfr/event/gc/collection/TestGCCauseWith[Serial|Parallel].java : GC cause 'GCLocker Initiated GC' not in the valid causes
2023/12/22 10:20 Goetz Lindenmaier SAP Weijun Wang Oracle JDK-8322681 jtreg is confused when folder name is the same as the test name
2023/12/22 10:19 Goetz Lindenmaier SAP Leo Korinth Oracle JDK-8322679 G1: Make TestMaxNewSize use createTestJvm
2023/12/22 10:15 Goetz Lindenmaier SAP Leonid Mesnik Oracle JDK-8322678 Mark com/sun/management/HotSpotDiagnosticMXBean/CheckOrigin.java as vm.flagless
2023/12/22 10:11 Goetz Lindenmaier SAP Mikhailo Seledtsov Oracle JDK-8322677 runtime/ErrorHandling/ tests ignore external VM flags
2023/12/22 10:10 Goetz Lindenmaier SAP Leonid Mesnik Oracle JDK-8322676 Mark runtime/CommandLine/ tests as flagless
2023/12/22 10:08 Goetz Lindenmaier SAP Christian Hagedorn Oracle JDK-8322674 [IR Framework] Some internal IR Framework tests are failing after JDK-8310308 on PPC and Cascade Lake
2023/12/22 10:08 Goetz Lindenmaier SAP Emanuel Peter Oracle JDK-8322673 IR Framework: check for type and size of vector nodes
2023/12/22 10:05 Goetz Lindenmaier SAP Kimura Yukihiro Fujitsu JDK-8322672 Some tests in serviceability area fail on localized Windows platform
2023/12/22 01:51 Gui Cao Independent (same) (same) JDK-8322658 test runtime/Unsafe/InternalErrorTest.java timeout on linux-riscv64 platform
2023/12/21 16:26 Liam Miller-Cushon Google (same) (same) JDK-8322642 Missing array bounds check in ClassReader.parameter
2023/12/21 13:28 Jaroslav Bachorík DataDog (same) (same) JDK-8322635 Accessing jmethodID might lead to spurious crashes
2023/12/21 11:36 Goetz Lindenmaier SAP Naoto Sato Oracle JDK-8322628 Console read line with zero out should zero out underlying buffer in JLine (redux)
2023/12/21 11:24 Goetz Lindenmaier SAP Dean Long Oracle JDK-8322626 SIGSEGV in ciVirtualCallTypeData::translate_from
2023/12/21 11:23 Goetz Lindenmaier SAP Kevin Walls Oracle JDK-8322625 MonitorVmStartTerminate.java timed out
2023/12/21 11:22 Goetz Lindenmaier SAP Leonid Mesnik Oracle JDK-8322624 sun/jvmstat/monitor/MonitoredVm/MonitorVmStartTerminate.java ignores VM flags
2023/12/21 11:20 Goetz Lindenmaier SAP Leo Korinth Oracle JDK-8322623 G1: Make TestG1ConcRefinementThreads use createTestJvm
2023/12/21 11:18 Goetz Lindenmaier SAP Leo Korinth Oracle JDK-8322622 G1: Make TestG1HeapRegionSize use createTestJvm
2023/12/21 11:16 Goetz Lindenmaier SAP Leo Korinth Oracle JDK-8322621 G1: Make TestG1PercentageOptions use createTestJvm
2023/12/21 11:14 Goetz Lindenmaier SAP Leo Korinth Oracle JDK-8322620 G1: Make TestG1RemSetFlags use createTestJvm
2023/12/21 11:12 Goetz Lindenmaier SAP Leo Korinth Oracle JDK-8322618 GC: Make TestHeapFreeRatio use createTestJvm
2023/12/21 11:10 Goetz Lindenmaier SAP Leo Korinth Oracle JDK-8322616 Parallel: Make TestInitialTenuringThreshold use createTestJvm
2023/12/21 11:08 Goetz Lindenmaier SAP Leo Korinth Oracle JDK-8322615 GC: Make TestXXXHeapSizeFlags use createTestJvm
2023/12/21 11:06 Goetz Lindenmaier SAP Leonid Mesnik Oracle JDK-8322614 4 sun/management/jdp tests ignore VM flags
2023/12/21 11:04 Goetz Lindenmaier SAP Leonid Mesnik Oracle JDK-8322613 serviceability/sa/jmap-hprof/JMapHProfLargeHeapTest.java times out after JDK-8314829
2023/12/21 11:02 Goetz Lindenmaier SAP Leonid Mesnik Oracle JDK-8322612 serviceability/sa/jmap-hprof/JMapHProfLargeHeapTest.java ignores vm flags
2023/12/21 11:00 Goetz Lindenmaier SAP Matias Saavedra Silva Oracle JDK-8322611 Add test for dump of resolved references
2023/12/21 10:58 Goetz Lindenmaier SAP Mikhailo Seledtsov Oracle JDK-8322610 NMT tests ignore vm flags
2023/12/21 10:48 Goetz Lindenmaier SAP Leonid Mesnik Oracle JDK-8322607 [REDO] serviceability/jdwp/AllModulesCommandTest.java ignores VM flags
2023/12/21 10:35 Goetz Lindenmaier SAP Leonid Mesnik Oracle JDK-8322604 Update com/sun/jdi/ProcessAttachTest.java to use ProcessTools.createTestJvm(..)
2023/12/21 10:29 Goetz Lindenmaier SAP Chris Plummer Oracle JDK-8322602 Some jdk/sun/tools/jhsdb tests don't pass test JVM args to the debuggee JVM
2023/12/21 10:10 Goetz Lindenmaier SAP Jaikiran Pai Oracle JDK-8322600 Remove remaining usages of -Xdebug from test/hotspot/jtreg
2023/12/21 10:08 Goetz Lindenmaier SAP Daohan Qu Independent JDK-8322599 Remove obsolete code and comments in TestLVT.java
2023/12/20 23:00 Takuya Kiriyama Fujitsu Justin Lu Oracle JDK-8322574 KeytoolReaderP12Test.java fail on localized Windows platform
2023/12/20 15:23 Sonia Zaldana Calles Red Hat Sean Mullan Oracle JDK-8322558 DHEKeySizing.java should be modified to use TLS versions TLSv1, TLSv1.1, TLSv1.2
2023/12/20 11:32 Matthias Baesken SAP (same) (same) JDK-8322541 test/jdk/com/sun/jndi/ldap/LdapPoolTimeoutTest.java fails with ConnectException: Connection timed out: no further information
2023/12/19 15:14 Matthias Baesken SAP (same) (same) JDK-8322471 handle setsocktopt return values
2023/12/19 13:55 Frederic Thevenet Red Hat (same) (same) JDK-8322462 Add a configure option to explicitly set CompanyName property in VersionInfo resource for Windows exe/dll
2023/12/19 13:21 Aleksey Shipilev Amazon Ekaterina Vergizova Azul JDK-8322421 Configurable InlineCacheBuffer size
2023/12/19 10:30 Aleksey Shipilev Amazon Angelos Bimpoudis Oracle JDK-8322396 Non-verifiable code is emitted when two guards declare pattern variables in colon-switch
2023/12/19 10:29 Aleksey Shipilev Amazon Vicente Arturo Romero Zaldivar Oracle JDK-8322395 NPE in JavacProcessingEnvironment for missing enum constructor body
2023/12/19 10:23 Aleksey Shipilev Amazon Stefan Karlsson Oracle JDK-8322394 Move StackWatermark handling out of LockStack::contains
2023/12/19 10:23 Aleksey Shipilev Amazon David Holmes Oracle JDK-8322393 Enhance class initialization logging
2023/12/19 10:21 Aleksey Shipilev Amazon Daniel Fuchs Oracle JDK-8322392 java/nio/channels/DatagramChannel/Connect.java timed out
2023/12/19 10:21 Aleksey Shipilev Amazon Darragh Clarke Oracle JDK-8322391 java/net/Socket/Timeouts.java fails with AssertionError on test temporal post condition
2023/12/19 10:19 Aleksey Shipilev Amazon Brian Burkhalter Oracle JDK-8322390 test/jdk/jdk/internal/math/FloatingDecimal/TestFloatingDecimal should use RandomFactory
2023/12/19 10:19 Aleksey Shipilev Amazon Mark Sheppard Oracle JDK-8322389 Test java/net/Inet6Address/serialize/Inet6AddressSerializationTest.java fails due to dynamic reconfigurations of network interface during test
2023/12/19 10:17 Aleksey Shipilev Amazon Angelos Bimpoudis Oracle JDK-8322388 javac erroneously allows "final" in front of a record pattern
2023/12/19 10:12 Aleksey Shipilev Amazon 7039722+JonasNorlinder Independent JDK-8322387 Generational ZGC: Strong OopStorage stats reported as weak roots
2023/12/19 09:24 Goetz Lindenmaier SAP gaurav.chaudhari IBM JDK-8322380 Fixup of jar filename typo in BadFactoryTest.sh
2023/12/19 09:21 Goetz Lindenmaier SAP Weijun Wang Oracle JDK-8322379 Update Public Suffix List to b5bf572
2023/12/19 09:17 Goetz Lindenmaier SAP Tobias Holenstein Oracle JDK-8322378 compiler/interpreter/TestVerifyStackAfterDeopt.java failed with SIGBUS in PcDescContainer::find_pc_desc_internal
2023/12/19 09:14 Goetz Lindenmaier SAP Alisen Chung Oracle JDK-8322376 Update FreeType to 2.13.2
2023/12/19 09:08 Goetz Lindenmaier SAP Leo Korinth Oracle JDK-8322375 GC: Make TestCompressedClassFlags use createTestJvm
2023/12/19 09:06 Goetz Lindenmaier SAP Leo Korinth Oracle JDK-8322373 GC: Make TestDisableDefaultGC use createTestJvm
2023/12/19 09:02 Goetz Lindenmaier SAP Leo Korinth Oracle JDK-8322370 G1: Make TestG1ConcMarkStepDurationMillis use createTestJvm
2023/12/19 08:59 Goetz Lindenmaier SAP Leo Korinth Oracle JDK-8322368 Parallel: Make TestAggressiveHeap use createTestJvm
2023/12/19 08:58 Goetz Lindenmaier SAP Evgeny Nikitin Oracle JDK-8322367 3 compiler tests ignore vm flags
2023/12/19 08:56 Goetz Lindenmaier SAP Yi-Fan Tsai Amazon JDK-8322365 5 compiled/codecache tests ignore VM flags
2023/12/19 08:23 Matthias Baesken SAP (same) (same) JDK-8322361 refresh libraries cache on AIX in VMError::report
2023/12/18 15:53 Kimura Yukihiro Fujitsu (same) (same) JDK-8322301 jdk/java/lang/instrument/BootClassPath/BootClassPathTest.sh fails on Japanese Windows
2023/12/18 11:04 Joachim Kern SAP (same) (same) JDK-8322277 runtime/posixSig/TestPosixSig.java intermittent timeouts on UNIX
2023/12/16 10:39 Goetz Lindenmaier SAP Naoto Sato Oracle JDK-8322245 Console read line with zero out should zero out underlying buffer in JLine
2023/12/15 16:53 Sonia Zaldana Calles Red Hat Emanuel Peter Oracle JDK-8322213 TestUnorderedReduction.java fails with -XX:MaxVectorSize=32 and -XX:+AlignVector
2023/12/15 08:00 Matthias Baesken SAP (same) (same) JDK-8322164 Adjust hs_err output in malloc/mmap error cases
2023/12/14 20:13 Goetz Lindenmaier SAP Naoto Sato Oracle JDK-8322131 Console read line with zero out should zero out underlying buffer
2023/12/14 20:11 Goetz Lindenmaier SAP Leonid Mesnik Oracle JDK-8322130 Enable CreateCoredumpOnCrash for testing in makefiles
2023/12/14 19:21 Goetz Lindenmaier SAP Gergö Barany Oracle JDK-8322105 java/lang/ref/ReachabilityFenceTest.java should run with -Xbatch
2023/12/14 16:33 Martin Doerr SAP (same) (same) JDK-8322099 [PPC64][ZGC] C1 generates wrong code for atomics
2023/12/14 15:03 Matthias Baesken SAP (same) (same) JDK-8322093 exclude compiler/vectorapi/reshape/TestVectorReinterpret.java on ppc64(le) platforms
2023/12/14 13:06 Weijun Wang Oracle (same) (same) JDK-8324002 RSA signature verification fails on signed data that does not encode params correctly
2023/12/13 14:54 Severin Gehwolf Red Hat (same) (same) JDK-8321894 Bump update version for OpenJDK: 21.0.3
2023/11/29 09:33 Ravi Reddy Oracle Vicente Arturo Romero Zaldivar Oracle JDK-8324032 javac crashes while adding type annotations to the return type of a constructor
2023/09/28 15:08 Manukumar V S Oracle Prasanta Sadhukhan Oracle JDK-8324024 Open source few swing text/html tests
2023/08/24 12:34 Christian Hagedorn Oracle (same) (same) JDK-8324023 [REDO] Enhance AES performance
2023/08/23 09:23 Christian Hagedorn Oracle (same) (same) JDK-8324019 [BACKOUT] 8308682: Enhance AES performance
2023/07/30 06:11 Ramesh Gangadhar Oracle Matthew Donovan Oracle JDK-8324012 sun/security/ssl/SSLSocketImpl/BlockedAsyncClose.java fails with jtreg test timeout

No changesets log

JDK-8320871 Release Note: Align `javac` with the Java Language Specification by Rejecting `final` in Record Patterns

Committer push log

Andrew Leonard, Red Hat

Bug Summary
JDK-8325646 DevKit build gcc libraries contain full paths to source location
JDK-8325642 Library debug files contain non-reproducible full gcc include paths

Andrew Hughes, Red Hat

Bug Summary
JDK-8325958 PlatformPCSC should load versioned so

Andrew Lu, SAP

Bug Summary
JDK-8326637 Allow PassFailJFrame to accept single window creator
JDK-8324747 ISO 4217 Amendment 176 Update
JDK-8323955 Open source few headless Swing misc tests
JDK-8324819 Open source few swing JList and JMenuBar tests
JDK-8326474 Open source several AWT applet tests
JDK-8324285 WheelModifier.java fails by timeout
JDK-8324746 Write a test to check textArea triggers MouseEntered/MouseExited events properly

anton.hagerstrand, Independent

Bug Summary
JDK-8324773 JFR: Periodic tasks aren't orphaned between recordings

Amos SHI, SAP

Bug Summary
JDK-8324895 java/io/File/createTempFile/SpecialTempFile.java fails in Windows 11
JDK-8324912 Open source few more headless Swing misc tests
JDK-8326130 Open source swing security manager test
JDK-8325045 Open source swing text/html and tree test

Christian Hagedorn, Oracle

Bug Summary
JDK-8324019 [BACKOUT] 8308682: Enhance AES performance
JDK-8324023 [REDO] Enhance AES performance

Chris Hegarty, Independent

Bug Summary
JDK-8323678 LinkedTransferQueue add and put methods call overridable offer

Christoph Langer, SAP

Bug Summary
JDK-8323736 AIX: pthreads created by foreign test library don't work as expected
JDK-8322794 Clean up code after JDK-8322417
JDK-8326771 java/awt/font/JNICheck/FreeTypeScalerJNICheck.java still fails with JNI warning on some Windows configurations
JDK-8326565 Remove obsolete comments for class sun.security.ssl.SunJSSE

Liam Miller-Cushon, Google

Bug Summary
JDK-8322642 Missing array bounds check in ClassReader.parameter

Darragh Clarke, Oracle

Bug Summary
JDK-8326392 java/net/HttpURLConnection/HttpURLConnectionExpectContinueTest.java fails intermittently in timeout

Dan Lutker, Amazon

Bug Summary
JDK-8323341 (tz) Update Timezone Data to 2023d
JDK-8325582 (tz) Update Timezone Data to 2024a

Evgeny Astigeevich, Amazon

Bug Summary
JDK-8326217 AArch64: crypto pmull based CRC32/CRC32C intrinsics clobber V8-V15 registers

Elif Aslan, Amazon

Bug Summary
JDK-8323513 Enable parallelism in vmTestbase/nsk/stress/jni tests
JDK-8323512 Enable parallelism in vmTestbase/nsk/stress/threads tests

Frederic Thevenet, Red Hat

Bug Summary
JDK-8322462 Add a configure option to explicitly set CompanyName property in VersionInfo resource for Windows exe/dll

Gui Cao, Independent

Bug Summary
JDK-8323098 RISC-V: Enable fast class initialization checks
JDK-8324847 RISC-V: Incorrect implementation in VM_Version::parse_satp_mode
JDK-8322658 test runtime/Unsafe/InternalErrorTest.java timeout on linux-riscv64 platform

George Adams, Microsoft

Bug Summary
JDK-8325732 GHA: Add macOS M1 testing
JDK-8325619 GHA: Bump macOS and Xcode versions
JDK-8325733 GHA: JDK-8325194 causes a regression

Goetz Lindenmaier, SAP

Bug Summary
JDK-8324138 (fs) Move toRealPath tests in java/nio/file/Path/Misc.java to separate JUnit 5 test
JDK-8322367 3 compiler tests ignore vm flags
JDK-8322713 3 sun/tools tests ignore VM flags
JDK-8322614 4 sun/management/jdp tests ignore VM flags
JDK-8322365 5 compiled/codecache tests ignore VM flags
JDK-8322710 8 sun/management/jmxremote tests ignore VM flags
JDK-8322674 [IR Framework] Some internal IR Framework tests are failing after JDK-8310308 on PPC and Cascade Lake
JDK-8322607 [REDO] serviceability/jdwp/AllModulesCommandTest.java ignores VM flags
JDK-8323143 [test bug] javax/swing/JTableHeader/6889007/bug6889007.java fails
JDK-8325243 [TESTBUG] Remove "@requires vm.flagless" from jtreg vectorization tests
JDK-8322756 AArch64: VMError::print_native_stack() crashes on Java native method frame
JDK-8322611 Add test for dump of resolved references
JDK-8324137 Additional refactoring of Locale tests to JUnit
JDK-8323777 Better Error Handling for Jar Tool When Processing Non-existent Files
JDK-8324284 Binary files in JAXP test should be removed
JDK-8322755 C1: -XX:AbortVMOnException does not work if all methods in the call stack are compiled with C1 and there are no exception handlers
JDK-8322776 C2 SuperWord: wrong result with -XX:+UseVectorCmov -XX:+UseCMoveUnconditionally
JDK-8323148 C2 SuperWord: wrong result with hand unrolled loops
JDK-8322791 C2: RepeatCompilation compiler directive does not choose stress seed randomly
JDK-8324057 CloseRace.java#id0 fails transiently on libgraal
JDK-8324436 Compatibility.java reads both stdout and stderr of JdkUtils
JDK-8322378 compiler/interpreter/TestVerifyStackAfterDeopt.java failed with SIGBUS in PcDescContainer::find_pc_desc_internal
JDK-8322780 CompilerThread leaks CodeBlob memory when dynamically stopping compiler thread in non-product
JDK-8322131 Console read line with zero out should zero out underlying buffer
JDK-8322245 Console read line with zero out should zero out underlying buffer in JLine
JDK-8322628 Console read line with zero out should zero out underlying buffer in JLine (redux)
JDK-8322686 Console read line with zero out should zero out when throwing exception
JDK-8324058 Disable runtime/os/TestTracePageSizes.java for ShenandoahGC
JDK-8322130 Enable CreateCoredumpOnCrash for testing in makefiles
JDK-8322729 Exclude sun/security/pkcs11/sslecc/ClientJSSEServerJSSE.java on Linux ppc64le
JDK-8322731 File.mkdirs() occasionally fails to create folders on Windows shared folder
JDK-8324932 Files/probeContentType/Basic.java fails on latest Windows 11 - content type mismatch
JDK-8324158 filter out harmful -std* flags added by autoconf from CXX
JDK-8323124 Fix build failures caused by 8315097
JDK-8322715 Fix comment typo in PKCS12Passwd.java
JDK-8322380 Fixup of jar filename typo in BadFactoryTest.sh
JDK-8322623 G1: Make TestG1ConcRefinementThreads use createTestJvm
JDK-8322370 G1: Make TestG1ConcMarkStepDurationMillis use createTestJvm
JDK-8322622 G1: Make TestG1HeapRegionSize use createTestJvm
JDK-8322621 G1: Make TestG1PercentageOptions use createTestJvm
JDK-8322620 G1: Make TestG1RemSetFlags use createTestJvm
JDK-8322679 G1: Make TestMaxNewSize use createTestJvm
JDK-8322778 GC: Make TestArrayAllocatorMallocLimit use createTestJvm
JDK-8322375 GC: Make TestCompressedClassFlags use createTestJvm
JDK-8322373 GC: Make TestDisableDefaultGC use createTestJvm
JDK-8322618 GC: Make TestHeapFreeRatio use createTestJvm
JDK-8322615 GC: Make TestXXXHeapSizeFlags use createTestJvm
JDK-8323567 Increase timeout for JDK tests that are close to the limit when run with libgraal
JDK-8322673 IR Framework: check for type and size of vector nodes
JDK-8324054 IR verification fails because IR dump is chopped up
JDK-8322105 java/lang/ref/ReachabilityFenceTest.java should run with -Xbatch
JDK-8323565 java/security/cert/CertPathValidator/OCSP/OCSPTimeout.java fails with RuntimeException Server not ready
JDK-8324140 JButton ignores margin when painting HTML text
JDK-8322683 jdk/jfr/event/gc/collection/TestGCCauseWith[Serial|Parallel].java : GC cause 'GCLocker Initiated GC' not in the valid causes
JDK-8322681 jtreg is confused when folder name is the same as the test name
JDK-8322678 Mark com/sun/management/HotSpotDiagnosticMXBean/CheckOrigin.java as vm.flagless
JDK-8322676 Mark runtime/CommandLine/ tests as flagless
JDK-8322774 Memory leak related to ClassLoader::update_class_path_entry_list
JDK-8324139 Modify runtime/ErrorHandling/TestDwarf.java to split dwarf and decoder testing
JDK-8322625 MonitorVmStartTerminate.java timed out
JDK-8322610 NMT tests ignore vm flags
JDK-8323303 NSS tests failing on OL9 linux-aarch64 hosts
JDK-8322368 Parallel: Make TestAggressiveHeap use createTestJvm
JDK-8322616 Parallel: Make TestInitialTenuringThreshold use createTestJvm
JDK-8322777 PKCS11 tests fail with NSS 3.91
JDK-8322688 Problem list gc/TestAllocHumongousFragment.java subtests for 8298781
JDK-8324055 Refactor Currency tests to use JUnit
JDK-8323323 Refactor java.util.Currency:i18n shell tests to plain java tests
JDK-8322599 Remove obsolete code and comments in TestLVT.java
JDK-8324931 Remove pkcs11/Cipher/TestKATForGCM.java from ProblemList
JDK-8322600 Remove remaining usages of -Xdebug from test/hotspot/jtreg
JDK-8323123 Rename createJavaProcessBuilder
JDK-8322677 runtime/ErrorHandling/ tests ignore external VM flags
JDK-8322775 runtime/ErrorHandling/TestAbortVmOnException.java times out due to core dumps taking a long time on OSX
JDK-8322612 serviceability/sa/jmap-hprof/JMapHProfLargeHeapTest.java ignores vm flags
JDK-8322613 serviceability/sa/jmap-hprof/JMapHProfLargeHeapTest.java times out after JDK-8314829
JDK-8323126 Several java/util tests should be updated to accept VM flags
JDK-8322626 SIGSEGV in ciVirtualCallTypeData::translate_from
JDK-8323153 Simplify at-requires checkDockerSupport()
JDK-8324438 Skip pkcs11 tests on linux-aarch64
JDK-8322602 Some jdk/sun/tools/jhsdb tests don't pass test JVM args to the debuggee JVM
JDK-8322672 Some tests in serviceability area fail on localized Windows platform
JDK-8324063 Speed up test/jdk/java/util/zip/ZipFile/TestTooManyEntries.java and clarify its purpose
JDK-8323152 Stress mode to randomize incremental inlining decision
JDK-8322624 sun/jvmstat/monitor/MonitoredVm/MonitorVmStartTerminate.java ignores VM flags
JDK-8324705 sun/security/pkcs11 tests fail on Linux RHEL 8.6 and newer
JDK-8324437 sun/security/pkcs11 tests fail on OL 7.9 aarch64
JDK-8324217 Support for NSS tests on aarch64 platforms
JDK-8323564 Test java/lang/Thread/virtual/JfrEvents::testVirtualThreadPinned failed
JDK-8324061 Test logic for BODY_CF in AbstractThrowingSubscribers.java is wrong
JDK-8323808 test/jdk/sun/nio/cs/TestCharsetMapping.java is spuriously passing
JDK-8323151 TestFileChooserSingleDirectorySelection.java fails with "getSelectedFiles returned empty array"
JDK-8324434 Tests in Locale should have more descriptive names
JDK-8323145 TestStressIGVNAndCCP.java failed with different IGVN traces for the same seed
JDK-8322604 Update com/sun/jdi/ProcessAttachTest.java to use ProcessTools.createTestJvm(..)
JDK-8322376 Update FreeType to 2.13.2
JDK-8322379 Update Public Suffix List to b5bf572
JDK-8323776 Update XML Security for Java to 3.0.3

Ilya Gavrilin, Independent

Bug Summary
JDK-8326320 RISC-V: Tune costs for shuffles with no conversion

Ichiroh Takiguchi, IBM

Bug Summary
JDK-8323433 Chinese characters in RTF are not decoded

Jaroslav Bachorík, DataDog

Bug Summary
JDK-8322635 Accessing jmethodID might lead to spurious crashes

Johannes Bechberger, SAP

Bug Summary
JDK-8324216 [macos14] Expand/collapse a JTree using keyboard freezes the application in macOS 14 Sonoma

Jonathan Dowland, Red Hat

Bug Summary
JDK-8322999 [macos14] javax/swing/JMenuItem/4654927/bug4654927.java: component must be showing on the screen to determine its location
JDK-8323070 Open source several Swing Text related tests

Joachim Kern, SAP

Bug Summary
JDK-8326156 [AIX] Find a better way to mimic dl handle equality
JDK-8325048 com/sun/jdi/JdwpAllowTest.java shows failures on AIX if prefixLen of mask is larger than 32 in IPv6 case
JDK-8322277 runtime/posixSig/TestPosixSig.java intermittent timeouts on UNIX

Jan Kratochvil, Azul

Bug Summary
JDK-8322862 hotspot can't compile with the latest of gtest because of

Takuya Kiriyama, Fujitsu

Bug Summary
JDK-8322574 KeytoolReaderP12Test.java fail on localized Windows platform

Kimura Yukihiro, Fujitsu

Bug Summary
JDK-8322301 jdk/java/lang/instrument/BootClassPath/BootClassPathTest.sh fails on Japanese Windows

Liang Mao, Alibaba

Bug Summary
JDK-8326393 Generational ZGC: Clearing All SoftReferences log line lacks GCId
JDK-8324201 Generational ZGC: Use ZFragmentationLimit and ZYoungCompactionLimit as percentage instead of multiples
JDK-8324712 Generational ZGC: ZPageSizeMedium should be set before MaxTenuringThreshold

Matthias Baesken, SAP

Bug Summary
JDK-8325720 [AIX] adjust os_posix after JDK-8318696
JDK-8325486 [aix] Implement support for reporting swap space in jdk.management
JDK-8326657 [AIX] use fclose after fopen in read_psinfo
JDK-8322164 Adjust hs_err output in malloc/mmap error cases
JDK-8323962 com/sun/jdi/JdwpAllowTest.java fails on Alpine 3.17 / 3.18
JDK-8326662 crashes in docker container tests on Linuxppc64le Power8 machines
JDK-8324439 Do not use LFS64 symbols on Linux
JDK-8322093 exclude compiler/vectorapi/reshape/TestVectorReinterpret.java on ppc64(le) platforms
JDK-8324120 fix typo hpage_pdm_size
JDK-8326555 gtest wrappers should be marked as flagless
JDK-8322471 handle setsocktopt return values
JDK-8326765 Make TrimNativeHeapInterval a product switch
JDK-8324119 os::Linux::print_system_memory_info enhance the THP output with /sys/kernel/mm/transparent_hugepage/hpage_pmd_size
JDK-8323533 prioritize /etc/os-release over /etc/SuSE-release in hs_err/info output
JDK-8322361 refresh libraries cache on AIX in VMError::report
JDK-8325479 runtime/Thread/ThreadCountLimit.java fails intermittently on AIX
JDK-8325323 Simplify shared lib name handling code in some tests
JDK-8322541 test/jdk/com/sun/jndi/ldap/LdapPoolTimeoutTest.java fails with ConnectException: Connection timed out: no further information
JDK-8325480 use mem_unit when working with sysinfo memory and swap related information

Martin Balao, Red Hat

Bug Summary
JDK-8326554 CKA_TOKEN private and secret keys are not necessarily sensitive

Martin Doerr, SAP

Bug Summary
JDK-8322695 [AIX] Dont mix os::dll_load() with direct dlclose() calls
JDK-8322099 [PPC64][ZGC] C1 generates wrong code for atomics

Manukumar V S, Oracle

Bug Summary
JDK-8324024 Open source few swing text/html tests

Oli Gillespie, Amazon

Bug Summary
JDK-8323161 Data loss in AVX3 Base64 decoding

Olga Mikhaltcova, Azul

Bug Summary
JDK-8325000 RISC-V: implement ensureMaterializedForStackWalk intrinsic
JDK-8324297 RISC-V: implement roundD/roundF intrinsics

psoujany, IBM

Bug Summary
JDK-8326490 Interactive component with ARIA role 'tabpanel' does not have a programmatically associated name

Ravi Reddy, Oracle

Bug Summary
JDK-8324032 javac crashes while adding type annotations to the return type of a constructor

Ramesh Gangadhar, Oracle

Bug Summary
JDK-8324012 sun/security/ssl/SSLSocketImpl/BlockedAsyncClose.java fails with jtreg test timeout

Ravi Reddy, Oracle

Bug Summary
JDK-8324003 [BACKOUT] 8225377: type annotations are not visible to javac plugins across compilation boundaries

Richard Reingruber, SAP

Bug Summary
JDK-8324143 Parallel: Implement better work distribution for large object arrays in old gen

Sergey Bylokhov, Amazon

Bug Summary
JDK-8325524 AArch64: [TESTBUG] compiler/intrinsics/sha/cli/TestUseSHA3IntrinsicsOptionOnSupportedCPU.java fails on Neoverse N2 and V1
JDK-8326072 Enable "maybe-uninitialized" warning for FreeType 2.13.1
JDK-8326695 JDK-8294427 breaks Windows L&F on all older Windows versions
JDK-8323015 NPE in PKCS7.parseOldSignedData
JDK-8326008 Parallelize sun/java2d/marlin/ClipShapeTest.java
JDK-8322872 support latest VS2022 MSC_VER in abstract_vm_version.cpp
JDK-8322975 The SendRawSysexMessage test may cause a JVM crash

Severin Gehwolf, Red Hat

Bug Summary
JDK-8321894 Bump update version for OpenJDK: 21.0.3

Aleksey Shipilev, Amazon

Bug Summary
JDK-8323266 [AArch64] C1 compilation fails because monitor offset in OSR buffer is too large for immediate
JDK-8325856 [vectorapi] Bounds checking issues when accessing memory segments
JDK-8326476 Add Certainly roots R1 and E1
JDK-8323053 Add man page doc for -XX:+VerifySharedSpaces
JDK-8324000 C2 compilation fails with "Bad immediate dominator info"
JDK-8326134 C2: allocate PhaseIdealLoop::_loop_or_ctrl from C->comp_arena()
JDK-8324934 C2: assert(cmp != nullptr && cmp->Opcode() == Op_Cmp(bt)) failed: no exit test
JDK-8325046 C2: assert(n->in(0) == nullptr) failed: divisions with zero check should already have bailed out earlier in split-if
JDK-8322700 C2: Missing ChaCha20 stub for x86_32 leads to crashes
JDK-8322998 C2: remove copy-by-value of GrowableArray for InterfaceSet
JDK-8325197 Capture hotspot replay files in GHA
JDK-8323339 CDSProtectionDomain::get_shared_protection_domain should check for exception
JDK-8325929 ClassLoaderData::print_on should print address of class loader
JDK-8323176 Compiler should accept final variable in Record Pattern
JDK-8324621 compiler/tiered/LevelTransitionTest.java fails with -XX:CompileThreshold=100 -XX:TieredStopAtLevel=1
JDK-8323262 ConcurrentModificationException from IndexWriter
JDK-8322421 Configurable InlineCacheBuffer size
JDK-8323048 Crash in ciKlass::is_subtype_of because TypeAryPtr::_klass is not initialized
JDK-8325853 Create test alias "all" for all test roots
JDK-8322393 Enhance class initialization logging
JDK-8325389 Fallback implementations for 64-bit Atomic::{add,xchg} on 32-bit platforms
JDK-8326215 Fallback linker passes bad JNI handle
JDK-8325336 Generational ZGC: Relocation selection must join the STS
JDK-8322387 Generational ZGC: Strong OopStorage stats reported as weak roots
JDK-8323329 Generational ZGC: ZColorStoreGoodOopClosure is only valid for young objects
JDK-8325196 GHA: Avoid multiple test suites per job
JDK-8324826 GHA: Generic jtreg errors are not reported
JDK-8323054 GHA: Parallelize hotspot_compiler test jobs
JDK-8324476 Incorrect LoaderConstraintTable::add_entry after JDK-8298468
JDK-8325930 Introduce test keyword for tests that need external dependencies
JDK-8325854 Invalid test group of lib-test after JDK-8323515
JDK-8324652 Issue store-store barrier after re-materializing objects during deoptimization
JDK-8326131 java/foreign/TestLinker.java failed with "error occurred while instantiating class TestLinker: null"
JDK-8322391 java/net/Socket/Timeouts.java fails with AssertionError on test temporal post condition
JDK-8322392 java/nio/channels/DatagramChannel/Connect.java timed out
JDK-8324278 java/util/concurrent/ConcurrentLinkedQueue/WhiteBox.java shows intermittent failures on linux ppc64le and aarch64
JDK-8322388 javac erroneously allows "final" in front of a record pattern
JDK-8323816 javac with annotation processor throws AssertionError: Filling jrt:/... during JarFileObject[/...]
JDK-8324485 JNI invocation of an abstract instance method corrupts the stack
JDK-8322394 Move StackWatermark handling out of LockStack::contains
JDK-8325933 NMT detail report slow or hangs for large number of mappings
JDK-8322396 Non-verifiable code is emitted when two guards declare pattern variables in colon-switch
JDK-8322395 NPE in JavacProcessingEnvironment for missing enum constructor body
JDK-8322942 release _object in ObjectMonitor dtor to avoid races
JDK-8324622 Require platforms to define DEFAULT_CACHE_LINE_SIZE
JDK-8323770 Shenandoah: Enable ShenandoahVerifyOptoBarriers in debug builds
JDK-8324654 Shenandoah: Remove ShenandoahElasticTLAB flag
JDK-8324663 Shenandoah: Remove ShenandoahLoopOptsAfterExpansion flag
JDK-8323767 Shenandoah: Remove ShenandoahSelfFixing flag
JDK-8325338 Shenandoah: Remove ShenandoahSuspendibleWorkers flag
JDK-8323769 Shenandoah: Remove ShenandoahUnloadClassesFrequency support
JDK-8323749 StringBuffer.repeat does not work correctly after toString() was called
JDK-8322389 Test java/net/Inet6Address/serialize/Inet6AddressSerializationTest.java fails due to dynamic reconfigurations of network interface during test
JDK-8325339 Test java/security/cert/CertPathBuilder/akiExt/AKISerialNumber.java is failing
JDK-8322390 test/jdk/jdk/internal/math/FloatingDecimal/TestFloatingDecimal should use RandomFactory
JDK-8323052 ThisEscapeAnalyzer crashes for erroneous code
JDK-8323049 Unexpected internal name for Filler array klass causes error in VisualVM
JDK-8323750 Unneccesary CodeBlob lookup in CompiledIC::internal_set_ic_destination
JDK-8325855 update jcstress to 0.16
JDK-8323737 yield .class not parsed correctly.
JDK-8325475 Zero: Misplaced CX8 enablement flag
JDK-8325474 Zero: Support 8-byte cmpxchg
JDK-8325193 Zero: Use __atomic built-ins for atomic RMW operations
JDK-8323193 Zero: Use atomic built-ins for 64-bit accesses
JDK-8326475 ZGC fails assert(index == 0 || is_power_of_2(index)) failed: Incorrect load shift: 11

Sun Yaqi, Loongson

Bug Summary
JDK-8324473 Generational ZGC: The SoftMaxHeapSize might be wrong when CDS decreases the MaxHeapSize

Sandhya Viswanathan, Intel

Bug Summary
JDK-8322699 Incorrect x86 instruction encoding for VSIB addressing mode
JDK-8322792 Some intrinsics/stubs missing vzeroupper on x86_64

syan, Unknown

Bug Summary
JDK-8326415 [TESTBUG]testMemoryFailCount in jdk/internal/platform/docker/TestDockerMemoryMetrics.java always fail because OOM killed

Sonia Zaldana Calles, Red Hat

Bug Summary
JDK-8324038 ChoiceFormat patterns are not well tested
JDK-8322558 DHEKeySizing.java should be modified to use TLS versions TLSv1, TLSv1.1, TLSv1.2
JDK-8324036 Improve stability of WheelModifier.java test
JDK-8324037 Open source few swing JInternalFrame and JMenuBar tests
JDK-8324035 Popups that request focus are not shown on Linux with Wayland
JDK-8322213 TestUnorderedReduction.java fails with -XX:MaxVectorSize=32 and -XX:+AlignVector

Tobias Hartmann, Oracle

Bug Summary
JDK-8324004 [BACKOUT] 8318562: Computational test more than 2x slower when AVX instructions are used

Weijun Wang, Oracle

Bug Summary
JDK-8324002 RSA signature verification fails on signed data that does not encode params correctly

William Kemper, Amazon

Bug Summary
JDK-8323267 Shenandoah: Encountered reference count always attributed to first worker thread
JDK-8324034 Shenandoah: Heap could be corrupted by oom during evacuation
JDK-8324738 Shenandoah: Remove unused code
JDK-8324045 Shenandoah: Unused memory in regions compacted during a full GC should be mangled