PUSHES REPORT: 21.0.4

This report shows who pushed the backports to the given release. This usually shows who did the backporting, testing, and review work.

Report generated: Sat Jul 13 06:14:38 CEST 2024

Distribution by priority

Count Priority
3 P1
13 P2
60 P3
248 P4
8 P5

Distribution by components

Count Component
332 100% Total
155 46.7% hotspot
58 17.5% hotspot/runtime
39 11.7% hotspot/compiler
32 9.6% hotspot/gc
10 3.0% hotspot/jfr
7 2.1% hotspot/test
5 1.5% hotspot/svc
2 0.6% hotspot/jvmti
2 0.6% hotspot/other
75 22.6% core-libs
18 5.4% core-libs/java.lang
11 3.3% core-libs/java.net
8 2.4% core-libs/java.util:i18n
7 2.1% core-libs/java.nio
5 1.5% core-libs
5 1.5% core-libs/java.util.jar
4 1.2% core-libs/java.lang:class_loading
3 0.9% core-libs/java.util
3 0.9% core-libs/java.text
2 0.6% core-libs/java.util.logging
1 0.3% core-libs/java.rmi
1 0.3% core-libs/javax.script
1 0.3% core-libs/java.util.concurrent
1 0.3% core-libs/java.io:serialization
1 0.3% core-libs/java.lang.invoke
1 0.3% core-libs/java.lang.module
1 0.3% core-libs/java.util:collections
1 0.3% core-libs/java.lang:reflect
1 0.3% core-libs/javax.naming
43 13.0% client-libs
18 5.4% client-libs/javax.swing
13 3.9% client-libs/java.awt
6 1.8% client-libs/2d
5 1.5% client-libs
1 0.3% client-libs/javax.accessibility
17 5.1% security-libs
10 3.0% security-libs/java.security
3 0.9% security-libs/javax.net.ssl
2 0.6% security-libs/javax.security
1 0.3% security-libs/jdk.security
1 0.3% security-libs
17 5.1% tools
7 2.1% tools/jpackage
3 0.9% tools/javac
3 0.9% tools
2 0.6% tools/jlink
1 0.3% tools/javadoc(tool)
1 0.3% tools/launcher
14 4.2% infrastructure
12 3.6% infrastructure/build
2 0.6% infrastructure/release_eng
9 2.7% core-svc
3 0.9% core-svc/debugger
2 0.6% core-svc/java.lang.instrument
1 0.3% core-svc/tools
1 0.3% core-svc/javax.management
1 0.3% core-svc
1 0.3% core-svc/java.lang.management
1 0.3% docs
1 0.3% docs/guides
1 0.3% other-libs
1 0.3% other-libs/other

Distribution by affiliation

This Release Pushes

Original Pushes

Count Committer
332 100% Total
189 56.9% SAP
114 34.3% Goetz Lindenmaier
25 7.5% Andrew Lu
23 6.9% Matthias Baesken
13 3.9% Amos SHI
6 1.8% Christoph Langer
6 1.8% Martin Doerr
1 0.3% Richard Reingruber
1 0.3% Joachim Kern
71 21.4% Amazon
51 15.4% Aleksey Shipilev
4 1.2% Oli Gillespie
4 1.2% Elif Aslan
4 1.2% Sergey Bylokhov
2 0.6% William Kemper
2 0.6% Dan Lutker
1 0.3% Roy Soumadipta
1 0.3% Ben Taylor
1 0.3% acmoraru
1 0.3% Chad Rakoczy
28 8.4% Red Hat
15 4.5% Sonia Zaldana Calles
4 1.2% ariasdereyna
3 0.9% Robert Toyonaga
1 0.3% Andrew Leonard
1 0.3% Ashutosh Mehra
1 0.3% Jonathan Dowland
1 0.3% Severin Gehwolf
1 0.3% Thomas Stuefe
1 0.3% Jiří Vaněk
17 5.1% Alibaba
8 2.4% Sendao Yan
6 1.8% Liang Mao
3 0.9% Long Yang
9 2.7% Independent
6 1.8% Gui Cao
2 0.6% Zhengyu Gu
1 0.3% 103394724+kurashige23
6 1.8% IBM
4 1.2% Amit Kumar
1 0.3% Suchismith Roy
1 0.3% Sidraya Jayagond
3 0.9% Azul
3 0.9% Jan Kratochvil
2 0.6% BellSoft
2 0.6% Alexandr Scherbatiy
2 0.6% Canonical
2 0.6% Vladimir Petko
2 0.6% Rivos
1 0.3% Ludovic Henry
1 0.3% Robbin Ehn
1 0.3% Ampere
1 0.3% Patrick Zhang
1 0.3% Fujitsu
1 0.3% Takuya Kiriyama
1 0.3% Oracle
1 0.3% Bernhard Urban-Forster
Count Committer
332 100% Total
197 59.3% Oracle
21 6.3% Thomas Schatzl
12 3.6% Alan Bateman
12 3.6% Leonid Mesnik
10 3.0% Stefan Karlsson
10 3.0% Justin Lu
8 2.4% Mandy Chung
7 2.1% Harshitha Onkar
6 1.8% Matthew Donovan
6 1.8% Prasanta Sadhukhan
6 1.8% Jaikiran Pai
5 1.5% Alexey Semenyuk
3 0.9% Patricio Chilano Mateo
3 0.9% Douglas Simon
3 0.9% Darragh Clarke
3 0.9% Jim Laskey
3 0.9% Abhishek Kumar
3 0.9% Alexander Zuev
3 0.9% Lance Andersen
3 0.9% Rajan Halade
3 0.9% Christian Hagedorn
3 0.9% Philip Race
2 0.6% Brian Burkhalter
2 0.6% Tejesh R
2 0.6% Sean Coffey
2 0.6% Leo Korinth
2 0.6% Roger Riggs
2 0.6% Eric Nothum
2 0.6% Emanuel Peter
2 0.6% Magnus Ihse Bursie
2 0.6% Erik Gahlin
2 0.6% Lawrence Andrews
2 0.6% Chris Plummer
2 0.6% Coleen Phillimore
2 0.6% Kevin Driver
2 0.6% Alexey Ivanov
2 0.6% Johan Sjölen
2 0.6% Afshin Zafari
2 0.6% Alisen Chung
2 0.6% Jesper Wilhelmsson
1 0.3% Markus Grönlund
1 0.3% Michael McMahon
1 0.3% Albert Yang
1 0.3% Evgeny Nikitin
1 0.3% Daniel Fuchs
1 0.3% Tobias Hartmann
1 0.3% Alexander Zvegintsev
1 0.3% Adam Sotona
1 0.3% Kim Barrett
1 0.3% Erik Österlund
1 0.3% Jorn Vernee
1 0.3% Erik Joelsson
1 0.3% Rajat Mahajan
1 0.3% Bill Huang
1 0.3% Prajwal Kumaraswamy
1 0.3% Jan Lahoda
1 0.3% Daniel Jelinski
1 0.3% Prasadarao Koppula
1 0.3% Vicente Arturo Romero Zaldivar
1 0.3% Mikhailo Seledtsov
1 0.3% Tim Prinzing
1 0.3% Renjith Kannath Pariyangad
1 0.3% Axel Boldt-Christmas
1 0.3% Dmitry Markov
1 0.3% Naoto Sato
1 0.3% Jonathan Gibbons
1 0.3% Joe Darcy
1 0.3% Alexander Matveev
37 11.1% SAP
21 6.3% Matthias Baesken
8 2.4% Christoph Langer
3 0.9% Martin Doerr
2 0.6% Goetz Lindenmaier
2 0.6% Richard Reingruber
1 0.3% Joachim Kern
29 8.7% Amazon
13 3.9% Aleksey Shipilev
4 1.2% Elif Aslan
3 0.9% Oli Gillespie
3 0.9% Sergey Bylokhov
2 0.6% William Kemper
2 0.6% Chad Rakoczy
1 0.3% Roy Soumadipta
1 0.3% Roman Kennke
17 5.1% Independent
7 2.1% Eirik Bjørsnøs
3 0.9% Zhengyu Gu
2 0.6% Gui Cao
2 0.6% Guoxiong Li
1 0.3% Qing Xiao
1 0.3% 103394724+kurashige23
1 0.3% REDMOND+singhnitin
16 4.8% Red Hat
5 1.5% Thomas Stuefe
4 1.2% Roland Westrelin
2 0.6% Robert Toyonaga
1 0.3% Andrew Haley
1 0.3% Andrew Leonard
1 0.3% Sonia Zaldana Calles
1 0.3% Ashutosh Mehra
1 0.3% Jiří Vaněk
11 3.3% Alibaba
5 1.5% Sendao Yan
3 0.9% Long Yang
2 0.6% Wang Zhuo
1 0.3% Qizheng Xing
7 2.1% IBM
3 0.9% Amit Kumar
2 0.6% Sidraya Jayagond
1 0.3% Suchismith Roy
1 0.3% Varada M
4 1.2% Rivos
4 1.2% Robbin Ehn
3 0.9% Huawei
3 0.9% Hamlin Li
2 0.6% BellSoft
1 0.3% Alexandr Scherbatiy
1 0.3% Boris Ulasevich
1 0.3% @gentoo.org
1 0.3% sam
1 0.3% @imt-soft.com
1 0.3% songpv
1 0.3% ARM
1 0.3% Hao Sun
1 0.3% Ampere
1 0.3% Patrick Zhang
1 0.3% Azul
1 0.3% Jan Kratochvil
1 0.3% Fujitsu
1 0.3% Takuya Kiriyama
1 0.3% Loongson
1 0.3% Sun Yaqi
1 0.3% Unknown
1 0.3% N/A
1 0.3% VMWare
1 0.3% Vyom Tewari

Chronological push log:

UTC Time Priority Component Bug Summary This Release Push By Original Push By
Name Affiliation Name Affiliation
2024/06/25 03:55 P3 security-libs/jdk.security JDK-8334914 Mark tests in jdk_security_infra group as manual Sendao Yan Alibaba Rajan Halade Oracle
2024/05/29 06:56 P3 client-libs/javax.swing JDK-8333142 Null icon returned for .exe without custom icon Martin Doerr SAP Alexander Zuev Oracle
2024/05/28 18:36 P2 hotspot/gc JDK-8333111 Crash in XMark::follow_array Ashutosh Mehra Red Hat (same) (same)
2024/05/28 07:14 P4 tools/launcher JDK-8333027 libjli GetApplicationHome cleanups and enhance jli tracing Matthias Baesken SAP (same) (same)
2024/05/28 02:00 P4 hotspot/gc JDK-8333012 Test gc/g1/TestHumongousAllocConcurrentStart.java fails with -XX:TieredStopAtLevel=3 Andrew Lu SAP Thomas Schatzl Oracle
2024/05/27 22:15 P2 tools/jpackage JDK-8333011 dpkg appears to have problems resolving symbolically linked native libraries Vladimir Petko Canonical Alexey Semenyuk Oracle
2024/05/27 10:17 P4 hotspot/runtime JDK-8332972 unify os::dont_yield and os::naked_yield across Posix platforms Matthias Baesken SAP (same) (same)
2024/05/23 20:29 P3 hotspot/gc JDK-8332845 Parallel: Parallel GC resizes heap even if -Xms = -Xmx Ben Taylor Amazon Zhengyu Gu Independent
2024/05/23 12:27 P4 hotspot/runtime JDK-8332822 hserr generic events - add entry for the before_exit calls Matthias Baesken SAP (same) (same)
2024/05/23 12:25 P4 hotspot/runtime JDK-8332821 hs errfile generic events - move memory protections and nmethod flushes to separate sections Matthias Baesken SAP (same) (same)
2024/05/23 09:24 P4 hotspot/gc JDK-8332804 Update GC tests to use execute[Limited]TestJava Martin Doerr SAP Stefan Karlsson Oracle
2024/05/23 09:21 P3 hotspot/test JDK-8332802 test/hotspot/jtreg/applications/ctw/modules/jdk_crypto_ec.java cannot handle empty modules Andrew Lu SAP Leonid Mesnik Oracle
2024/05/23 09:21 P4 tools/jpackage JDK-8332800 [macos] Test tools/jpackage/macosx/MacAppStoreJlinkOptionsTest.java timed out on macOS Andrew Lu SAP Alexander Matveev Oracle
2024/05/23 08:47 P3 hotspot/gc JDK-8332793 Threads::print_on() tries to print CPU time for terminated GC threads Liang Mao Alibaba Richard Reingruber SAP
2024/05/23 08:47 P4 hotspot/gc JDK-8332792 Fix ZPhysicalMemorySegment::_end type Liang Mao Alibaba Axel Boldt-Christmas Oracle
2024/05/23 02:00 P4 tools/jpackage JDK-8332767 tools/jpackage/share/RuntimeImageTest.java fails with -XX:+UseZGC Andrew Lu SAP Alexey Semenyuk Oracle
2024/05/21 20:38 P3 hotspot/runtime JDK-8332636 Linux arm32 build fails after 8292591 Sergey Bylokhov Amazon (same) (same)
2024/05/21 20:19 P4 core-svc JDK-8332634 Problemlist serviceability/dcmd/gc/RunFinalizationTest.java on generic-all Sendao Yan Alibaba (same) (same)
2024/05/21 09:56 P4 hotspot/compiler JDK-8332601 Add more test cases for JDK-8319372 Andrew Lu SAP Christian Hagedorn Oracle
2024/05/17 14:07 P3 security-libs/java.security JDK-8332480 Add GlobalSign 2 TLS root certificates ariasdereyna Red Hat Rajan Halade Oracle
2024/05/17 08:05 P4 hotspot/compiler JDK-8332444 Improve the tests of test/hotspot/jtreg/compiler/intrinsics/float16 Andrew Lu SAP Hamlin Li Huawei
2024/05/17 07:54 P4 hotspot/runtime JDK-8332440 avoid alignment checks in UBSAN enabled build Matthias Baesken SAP (same) (same)
2024/05/17 07:45 P4 hotspot/compiler JDK-8332436 Print additional debug information when hitting assert(in_hash) Matthias Baesken SAP Eric Nothum Oracle
2024/05/16 21:52 P4 core-libs/java.net JDK-8332422 Uncontrolled memory consumption in SSLFlowDelegate.Reader Martin Doerr SAP Jaikiran Pai Oracle
2024/05/16 02:02 P4 hotspot/gc JDK-8332338 TestPLABResize.java and TestPLABPromotion.java are failing intermittently Andrew Lu SAP Leonid Mesnik Oracle
2024/05/15 11:48 P4 hotspot/runtime JDK-8332296 hs_err file event log entry for thread adding/removing should print current thread Matthias Baesken SAP (same) (same)
2024/05/15 11:43 P4 core-libs/java.util.jar JDK-8332295 avoid signed integer overflows in zip_util.c readCen / hashN Matthias Baesken SAP (same) (same)
2024/05/15 11:41 P4 hotspot/runtime JDK-8332294 UBSan enabled build fails in adlc on macOS Matthias Baesken SAP (same) (same)
2024/05/15 11:05 P4 hotspot/runtime JDK-8332291 Remove unnecessary template parameter lists in GrowableArray Jan Kratochvil Azul Kim Barrett Oracle
2024/05/15 11:05 P4 infrastructure/build JDK-8332290 error: template-id not allowed for constructor/destructor in C++20 Jan Kratochvil Azul (same) (same)
2024/05/15 10:14 P4 hotspot/runtime JDK-8332285 On Linux aarch64, CDS archives should be using 64K alignment by default Thomas Stuefe Red Hat (same) (same)
2024/05/15 09:16 P3 core-libs/java.util JDK-8332279 jdk.internal.util.ReferencedKeySet::add using wrong test Aleksey Shipilev Amazon Jim Laskey Oracle
2024/05/15 08:37 P3 hotspot/jfr JDK-8332276 jdk/jfr/api/consumer/recordingstream/TestSetEndTime.java timed out Andrew Lu SAP Erik Gahlin Oracle
2024/05/14 09:05 P4 client-libs JDK-8332192 Compilation failures in java.desktop module with gcc 14 Jan Kratochvil Azul sam @gentoo.org
2024/05/13 20:22 P4 hotspot/compiler JDK-8332168 Some jtreg tests failing on x86 with error 'unrecognized VM options' (C2 flags) Sendao Yan Alibaba REDMOND+singhnitin Independent
2024/05/13 20:22 P3 security-libs/java.security JDK-8332167 sun/security/mscapi/KeytoolChangeAlias.java fails with "Alias <246810> does not exist" Sendao Yan Alibaba Matthew Donovan Oracle
2024/05/13 09:02 P4 hotspot/runtime JDK-8332134 NMT: Change MallocMemorySnapshot to simplify code. Aleksey Shipilev Amazon Johan Sjölen Oracle
2024/05/13 09:00 P4 core-libs/java.lang JDK-8332133 Improve jspawnhelper version checks Chad Rakoczy Amazon (same) (same)
2024/05/10 06:41 P4 hotspot/runtime JDK-8332024 Linux ppc64le compile warning with clang in os_linux_ppc.cpp Matthias Baesken SAP (same) (same)
2024/05/09 09:38 P4 core-libs/java.net JDK-8331991 Reduce runtime and improve efficiency of KeepAliveTest Christoph Langer SAP (same) (same)
2024/05/09 09:38 P4 core-libs/java.net JDK-8331989 Use pattern matching for instanceof in KeepAliveCache Christoph Langer SAP (same) (same)
2024/05/07 13:20 P3 hotspot/gc JDK-8331845 G1: Heap resizing at Remark does not take existing eden regions into account Liang Mao Alibaba Thomas Schatzl Oracle
2024/05/07 13:17 P4 hotspot/gc JDK-8331844 ParallelGC: Forwarded objects found during heap inspection Liang Mao Alibaba Roman Kennke Amazon
2024/05/07 09:47 P3 core-libs/java.util JDK-8331783 Move ReferencedKeyMap to jdk.internal so it may be shared Aleksey Shipilev Amazon Jim Laskey Oracle
2024/05/07 08:20 P4 hotspot/gc JDK-8331768 Add bulk removal of dead nmethods during class unloading Goetz Lindenmaier SAP Thomas Schatzl Oracle
2024/05/07 08:19 P4 hotspot/runtime JDK-8331767 Improve error reporting for uncaught native exceptions on Windows Goetz Lindenmaier SAP Jorn Vernee Oracle
2024/05/06 11:49 P4 hotspot/gc JDK-8331722 TestStringDeduplicationInterned.java waits for the wrong condition acmoraru Amazon Stefan Karlsson Oracle
2024/05/06 08:39 P4 infrastructure/build JDK-8331639 [21u]: Bump GHA bootstrap JDK to 21.0.3 Christoph Langer SAP (same) (same)
2024/05/06 08:37 P3 hotspot/compiler JDK-8331712 C2 SuperWord: disable vectorization for large stride and scale Aleksey Shipilev Amazon Emanuel Peter Oracle
2024/05/06 08:27 P4 hotspot/compiler JDK-8331710 [s390x] Intrinsify recursive ObjectMonitor locking Amit Kumar IBM (same) (same)
2024/05/06 08:17 P4 hotspot/other JDK-8331709 [s390x] update block-comments to make code consistent Amit Kumar IBM (same) (same)
2024/05/06 08:15 P3 hotspot/compiler JDK-8331707 [S390] Need to bailout cleanly if creation of stubs fails when code cache is out of space Amit Kumar IBM (same) (same)
2024/05/06 08:13 P4 docs/guides JDK-8331706 :tier1 target explanation in doc/testing.md is incorrect Sendao Yan Alibaba (same) (same)
2024/05/06 08:07 P4 tools JDK-8331705 Illegal accesses in Java_jdk_internal_org_jline_terminal_impl_jna_linux_CLibraryImpl_ioctl0 Aleksey Shipilev Amazon Jan Lahoda Oracle
2024/05/06 06:30 P3 hotspot/runtime JDK-8331696 [AIX] Allow loading of different members of same shared library archive Joachim Kern SAP (same) (same)
2024/05/05 04:27 P4 hotspot/compiler JDK-8331689 RISC-V: Save and restore FRM in the call stub Gui Cao Independent Hamlin Li Huawei
2024/05/03 06:22 P4 hotspot/compiler JDK-8331621 Insertion of free code blobs into code cache can be very slow during class unloading Goetz Lindenmaier SAP Thomas Schatzl Oracle
2024/05/02 14:14 P2 hotspot/gc JDK-8331574 Parallel: Parallel GC throws OOM before heap is fully expanded Zhengyu Gu Independent (same) (same)
2024/05/02 12:27 P3 hotspot/compiler JDK-8331561 C2: "negative trip count?" assert failure in profile predicate code Aleksey Shipilev Amazon Roland Westrelin Red Hat
2024/05/02 08:27 P4 hotspot/compiler JDK-8331545 C2: possible overflow in PhaseIdealLoop::extract_long_range_checks() Aleksey Shipilev Amazon Roland Westrelin Red Hat
2024/05/02 08:27 P3 hotspot/compiler JDK-8331544 SIGFPE in PhaseIdealLoop::extract_long_range_checks Aleksey Shipilev Amazon Roland Westrelin Red Hat
2024/04/30 19:35 P4 hotspot/compiler JDK-8331455 ODR violation in macroAssembler_aarch64.cpp Bernhard Urban-Forster Oracle Andrew Haley Red Hat
2024/04/30 14:03 P4 hotspot/gc JDK-8331423 Parallel: Remove PSAdaptiveSizePolicy::should_full_GC Zhengyu Gu Independent Albert Yang Oracle
2024/04/30 09:00 P4 hotspot/runtime JDK-8331397 [s390x] TestSigInfoInHsErrFile.java Failure Amit Kumar IBM Sidraya Jayagond IBM
2024/04/29 16:04 P4 hotspot/runtime JDK-8331335 Upcall stub might go undetected when freezing frames Aleksey Shipilev Amazon Patricio Chilano Mateo Oracle
2024/04/29 15:43 P4 hotspot/compiler JDK-8331328 C2: bailout message broken: ResourceArea allocated string used after free Aleksey Shipilev Amazon Emanuel Peter Oracle
2024/04/29 13:45 P2 hotspot/gc JDK-8331309 Epsilon: Premature OOM when allocating object larger than uncommitted heap size Aleksey Shipilev Amazon Guoxiong Li Independent
2024/04/29 10:01 P5 hotspot/runtime JDK-8331288 RISC-V: Range check auipc + signed 12 imm instruction Robbin Ehn Rivos (same) (same)
2024/04/29 09:19 P4 hotspot/gc JDK-8331282 Harmonize executeTestJvm with create[Limited]TestJavaProcessBuilder Goetz Lindenmaier SAP Stefan Karlsson Oracle
2024/04/29 08:34 P4 infrastructure/build JDK-8331269 createJMHBundle.sh support configurable maven repo mirror Sendao Yan Alibaba (same) (same)
2024/04/29 08:33 P4 tools/javac JDK-8331268 SourceExample.SOURCE_14 comment should refer to 'switch expressions' instead of 'text blocks' Aleksey Shipilev Amazon Eirik Bjørsnøs Independent
2024/04/29 08:33 P4 tools/javac JDK-8331267 Refactor test/langtools/tools/javac/versions/Versions.java Aleksey Shipilev Amazon Joe Darcy Oracle
2024/04/29 04:13 P4 client-libs/2d JDK-8331254 Add a test to check default rendering engine Sergey Bylokhov Amazon (same) (same)
2024/04/28 21:48 P4 client-libs/java.awt JDK-8331236 [macos14] Problem list tests which fail due to macOS bug described in JDK-8322653 Amos SHI SAP Harshitha Onkar Oracle
2024/04/26 11:14 P4 hotspot/runtime JDK-8331192 [nmt] Multiple issues with peak accounting ariasdereyna Red Hat Thomas Stuefe Red Hat
2024/04/26 09:17 P4 client-libs/javax.swing JDK-8331174 Open source several Swing HTMLDocument related tests Jonathan Dowland Red Hat Harshitha Onkar Oracle
2024/04/25 09:30 P4 core-libs/java.util.logging JDK-8331116 StackOverflowError when starting Apache Tomcat with signed jar Aleksey Shipilev Amazon Sean Coffey Oracle
2024/04/25 08:55 P4 hotspot/runtime JDK-8331107 ConcurrentHashTable::statistics_calculate synchronization is expensive Aleksey Shipilev Amazon Erik Österlund Oracle
2024/04/25 08:11 P4 core-libs/java.net JDK-8331103 java/net/httpclient/ManyRequest.java should not use "localhost" in URIs Aleksey Shipilev Amazon Daniel Fuchs Oracle
2024/04/25 08:11 P4 hotspot/svc JDK-8331102 Improve heap dump performance by optimizing archived object checks Aleksey Shipilev Amazon (same) (same)
2024/04/25 08:02 P4 core-libs/java.lang JDK-8331101 Virtual thread test updates Aleksey Shipilev Amazon Alan Bateman Oracle
2024/04/25 08:00 P4 hotspot/runtime JDK-8331099 Move the stub test from initialize_final_stubs() to test/hotspot/gtest Aleksey Shipilev Amazon Hao Sun ARM
2024/04/23 13:29 P4 core-libs/java.nio JDK-8330984 (fc) java/nio/channels/FileChannel/Size.java fails on partition incapable of creating large files Sonia Zaldana Calles Red Hat Brian Burkhalter Oracle
2024/04/23 10:59 P4 hotspot/runtime JDK-8330959 When running ASAN, disable dangerous NMT test Sonia Zaldana Calles Red Hat Thomas Stuefe Red Hat
2024/04/23 10:59 P4 hotspot/runtime JDK-8330958 Multiple ASAN errors reported for metaspace Sonia Zaldana Calles Red Hat Thomas Stuefe Red Hat
2024/04/23 10:54 P4 hotspot/runtime JDK-8330957 need a largest_committed metric for each category of NMT's output ariasdereyna Red Hat Afshin Zafari Oracle
2024/04/23 10:45 P4 client-libs/javax.swing JDK-8330956 Opensource SwingGraphics manual test Sonia Zaldana Calles Red Hat Prasanta Sadhukhan Oracle
2024/04/23 10:45 P4 client-libs/javax.swing JDK-8330955 Opensource JTextArea manual tests Sonia Zaldana Calles Red Hat Prasanta Sadhukhan Oracle
2024/04/23 07:36 P4 security-libs JDK-8330924 Update PKCS11Test.java to not use hardcoded path Goetz Lindenmaier SAP Matthew Donovan Oracle
2024/04/23 07:34 P4 hotspot/gc JDK-8330922 G1: G1UpdateRemSetTrackingBeforeRebuild::distribute_marked_bytes accesses partially unloaded klass Goetz Lindenmaier SAP Thomas Schatzl Oracle
2024/04/23 07:32 P4 hotspot/gc JDK-8330912 G1 Full GC Heap verification relies on metadata not reset before verification Goetz Lindenmaier SAP Thomas Schatzl Oracle
2024/04/23 07:17 P3 client-libs/javax.swing JDK-8330892 Background not refreshed when painting over a transparent JFrame Amos SHI SAP Tejesh R Oracle
2024/04/23 07:16 P2 client-libs/java.awt JDK-8330891 [macos14] Running any AWT app prints Secure coding warning Amos SHI SAP Harshitha Onkar Oracle
2024/04/23 07:15 P4 hotspot/compiler JDK-8330890 javax/management/remote/mandatory/notif/NotifReconnectDeadlockTest.java fails on libgraal Amos SHI SAP Douglas Simon Oracle
2024/04/23 07:14 P4 client-libs/javax.swing JDK-8330881 Open source several Swing Text/HTML related tests Amos SHI SAP Harshitha Onkar Oracle
2024/04/23 07:14 P4 hotspot/test JDK-8330880 Allow TEST_VM_FLAGLESS to set flagless mode Amos SHI SAP Leonid Mesnik Oracle
2024/04/23 07:13 P4 client-libs JDK-8330879 Modify TrayIconScalingTest.java, PrintLatinCJKTest.java to use new PassFailJFrame's builder pattern usage Amos SHI SAP Lawrence Andrews Oracle
2024/04/22 14:01 P4 core-libs JDK-8330832 Review use of java.io.tmpdir in jdk tests Goetz Lindenmaier SAP Bill Huang Oracle
2024/04/22 13:59 P4 client-libs/java.awt JDK-8330831 hidpi problems for test java/awt/Dialog/DialogAnotherThread/JaWSTest.java Goetz Lindenmaier SAP Philip Race Oracle
2024/04/22 13:57 P4 core-libs/java.io:serialization JDK-8330829 Failed: java/io/ObjectStreamClass/ObjectStreamClassCaching.java#G1 Goetz Lindenmaier SAP Roger Riggs Oracle
2024/04/22 13:55 P4 core-libs/java.util:i18n JDK-8330828 java/util/Properties/PropertiesStoreTest.java fails "Text 'xxx' could not be parsed at index 20" after 8174269 Goetz Lindenmaier SAP Sendao Yan Alibaba
2024/04/22 08:53 P4 core-libs/java.nio JDK-8329604 (ch) Pipe channels should lazily set socket to non-blocking mode on first use by virtual thread Vladimir Petko Canonical Alan Bateman Oracle
2024/04/22 07:47 P2 hotspot/gc JDK-8330778 Epsilon: 'EpsilonHeap::allocate_work' misuses the parameter 'size' as size in bytes Aleksey Shipilev Amazon Guoxiong Li Independent
2024/04/19 10:56 P4 hotspot/runtime JDK-8330661 Improve dependencies removal during class unloading Goetz Lindenmaier SAP Thomas Schatzl Oracle
2024/04/19 10:54 P2 hotspot/gc JDK-8330660 Writing JFR records while a CHT has taken its lock asserts in rank checking Goetz Lindenmaier SAP Thomas Schatzl Oracle
2024/04/19 10:53 P4 hotspot/compiler JDK-8330659 VtableStubs::stub_containing() table load not ordered wrt to stores Goetz Lindenmaier SAP Thomas Schatzl Oracle
2024/04/19 10:51 P4 hotspot/compiler JDK-8330658 Improve InlineCacheBuffer pending queue management Goetz Lindenmaier SAP Thomas Schatzl Oracle
2024/04/19 10:47 P4 hotspot/runtime JDK-8330657 PrintSystemDictionaryAtExit has mutex rank assert Goetz Lindenmaier SAP Coleen Phillimore Oracle
2024/04/19 10:14 P3 hotspot/gc JDK-8330654 G1: Memory leak in G1CodeRootSet after JDK-8315503 Goetz Lindenmaier SAP Zhengyu Gu Independent
2024/04/19 10:14 P2 hotspot/gc JDK-8330653 Lock rank checking fails when code root set is modified with the Servicelock held after JDK-8315503 Goetz Lindenmaier SAP Thomas Schatzl Oracle
2024/04/19 10:14 P4 hotspot/gc JDK-8330652 G1: Code root scan causes long GC pauses due to imbalanced iteration Goetz Lindenmaier SAP Thomas Schatzl Oracle
2024/04/19 09:50 P3 core-libs/java.net JDK-8330643 HttpURLConnection cache issues leading to crashes in JGSS w/ native GSS introduced by 8303809 Andrew Lu SAP Michael McMahon Oracle
2024/04/19 09:48 P3 hotspot/runtime JDK-8330642 Improve GenericWaitBarrier performance Aleksey Shipilev Amazon (same) (same)
2024/04/19 09:46 P4 hotspot/runtime JDK-8330641 RISC-V: Simplify and remove CORRECT_COMPILER_ATOMIC_SUPPORT in atomic_linux_riscv.hpp Gui Cao Independent (same) (same)
2024/04/19 09:46 P5 hotspot/runtime JDK-8330640 RISC-V: Remove PlatformCmpxchg<4> Gui Cao Independent Robbin Ehn Rivos
2024/04/19 09:46 P4 hotspot/runtime JDK-8330639 RISC-V: Shenandoah GC crashes due to incorrect atomic memory operations Gui Cao Independent Qizheng Xing Alibaba
2024/04/16 15:10 P4 hotspot/jfr JDK-8330384 jdk/jfr/jcmd/TestJcmdDumpPathToGCRoots.java failed with "Expected chains but found none" Robert Toyonaga Red Hat Erik Gahlin Oracle
2024/04/16 15:09 P4 hotspot/jfr JDK-8330383 JFR: CompilerPhase event test fails on windows 32 bit Robert Toyonaga Red Hat (same) (same)
2024/04/16 08:27 P4 client-libs/java.awt JDK-8330345 [macos14] Problem list LightweightEventTest.java which fails due to macOS bug described in JDK-8322653 Goetz Lindenmaier SAP N/A Unknown
2024/04/16 08:26 P4 core-libs/java.util:i18n JDK-8330344 Update IANA Language Subtag Registry to Version 2024-03-07 Goetz Lindenmaier SAP Justin Lu Oracle
2024/04/16 08:25 P4 core-libs/java.util:i18n JDK-8330342 java/util/Locale/LocaleProvidersRun.java and java/util/ResourceBundle/modules/visibility/VisibilityTest.java timeout after passing Goetz Lindenmaier SAP Justin Lu Oracle
2024/04/16 01:57 P4 client-libs/javax.swing JDK-8329693 test javax/swing/JSplitPane/4885629/bug4885629.java fails on windows hidpi Andrew Lu SAP Philip Race Oracle
2024/04/15 08:24 P4 hotspot/runtime JDK-8330246 Buffer overflow in os::Linux::kernel_version Severin Gehwolf Red Hat Johan Sjölen Oracle
2024/04/15 07:39 P4 hotspot/runtime JDK-8330239 unify os::breakpoint among posix platforms Matthias Baesken SAP (same) (same)
2024/04/12 08:54 P2 hotspot/runtime JDK-8330149 [s390x] Fix garbage value being passed in Argument Register Sidraya Jayagond IBM (same) (same)
2024/04/11 12:41 P4 hotspot/compiler JDK-8330101 RISC-V: Need to sync CPU features with related JVM flags Gui Cao Independent (same) (same)
2024/04/11 09:56 P4 client-libs/javax.swing JDK-8330093 Simplify FileChooserSymLinkTest.java by using single-window testUI Goetz Lindenmaier SAP Alexey Ivanov Oracle
2024/04/11 09:55 P4 core-libs/java.util:i18n JDK-8330092 Update IANA Language Subtag Registry to Version 2023-10-16 Goetz Lindenmaier SAP Justin Lu Oracle
2024/04/11 09:26 P4 tools/jpackage JDK-8330087 tools/jpackage/share/RuntimePackageTest.java fails with java.lang.AssertionError missing files Goetz Lindenmaier SAP Alexey Semenyuk Oracle
2024/04/11 09:25 P3 hotspot/compiler JDK-8330084 JVMCI exception Translation can fail in TranslatedException. Goetz Lindenmaier SAP Douglas Simon Oracle
2024/04/11 09:20 P4 core-libs/java.util:i18n JDK-8330083 Update IANA Language Subtag Registry to Version 2023-08-02 Goetz Lindenmaier SAP Justin Lu Oracle
2024/04/11 08:38 P3 core-libs/javax.naming JDK-8330081 Inconsistent behavior in com.sun.jndi.ldap.Connection::createSocket Christoph Langer SAP (same) (same)
2024/04/11 07:09 P4 hotspot/gc JDK-8330075 Enable parallelism in vmTestbase/gc/vector tests Roy Soumadipta Amazon (same) (same)
2024/04/11 02:01 P3 security-libs/java.security JDK-8330070 Add a security category to the java -XshowSettings option Andrew Lu SAP Sean Coffey Oracle
2024/04/10 18:13 P2 hotspot/compiler JDK-8330055 C2: Crash during parsing because sub type check is not folded Aleksey Shipilev Amazon Christian Hagedorn Oracle
2024/04/10 09:58 P3 core-libs JDK-8330013 Test java/util/Formatter/Padding.java has unnecessary high heap requirement after JDK-8326718 Goetz Lindenmaier SAP Christoph Langer SAP
2024/04/10 09:57 P4 hotspot/gc JDK-8330012 ProcessTools.executeProcess calls waitFor before logging Goetz Lindenmaier SAP Stefan Karlsson Oracle
2024/04/10 09:46 P4 hotspot/gc JDK-8330010 Rename CodeCache::UnloadingScope to UnlinkingScope Goetz Lindenmaier SAP Thomas Schatzl Oracle
2024/04/10 09:45 P4 client-libs JDK-8330009 jdk/javax/swing/ProgressMonitor/ProgressTest.java does not show the ProgressMonitorInputStream all the time Goetz Lindenmaier SAP Prasanta Sadhukhan Oracle
2024/04/10 06:43 P4 hotspot/gc JDK-8329996 G1: Excessive is_obj_dead_cond calls in verification Aleksey Shipilev Amazon Stefan Karlsson Oracle
2024/04/09 18:16 P4 client-libs/java.awt JDK-8329974 System Tray icons get corrupted when Windows primary monitor changes Amos SHI SAP Harshitha Onkar Oracle
2024/04/09 08:53 P4 hotspot/runtime JDK-8329945 remove on_aix() function Matthias Baesken SAP (same) (same)
2024/04/09 08:40 P4 hotspot/runtime JDK-8329943 RISC-V: Features string uses wrong separator for jtreg Gui Cao Independent Robbin Ehn Rivos
2024/04/09 05:58 P4 hotspot/svc JDK-8329900 Improve heap dump performance with class metadata caching Aleksey Shipilev Amazon (same) (same)
2024/04/08 20:55 P3 tools/jpackage JDK-8329880 System.exit(0) kills the launched 3rd party application Goetz Lindenmaier SAP Alexey Semenyuk Oracle
2024/04/08 20:21 P4 core-libs/java.lang JDK-8329879 jspawnhelper without args fails with segfault Elif Aslan Amazon (same) (same)
2024/04/08 12:24 P4 core-libs/java.util JDK-8329857 Test java/util/Formatter/Padding.java should timeout on large inputs before fix in JDK-8299677 Goetz Lindenmaier SAP Chad Rakoczy Amazon
2024/04/08 12:23 P4 core-svc/java.lang.instrument JDK-8329856 6 java/lang/instrument/PremainClass tests ignore VM flags Goetz Lindenmaier SAP Leonid Mesnik Oracle
2024/04/08 12:21 P5 core-svc/java.lang.instrument JDK-8329855 Few java/lang/instrument ignore test.java.opts and accept test.vm.opts only Goetz Lindenmaier SAP Leonid Mesnik Oracle
2024/04/08 12:20 P4 other-libs/other JDK-8329854 [test] OutputAnalyzer.getExitValue() unnecessarily logs even when process has already completed Goetz Lindenmaier SAP Jaikiran Pai Oracle
2024/04/08 12:18 P3 tools/javadoc(tool) JDK-8329853 JavadocTester should set source path if not specified Goetz Lindenmaier SAP Jonathan Gibbons Oracle
2024/04/08 12:13 P4 hotspot/compiler JDK-8329851 Make -XX:+Verbose less verbose Goetz Lindenmaier SAP Eric Nothum Oracle
2024/04/08 08:22 P4 infrastructure/release_eng JDK-8330492 [21u] Remove designator DEFAULT_PROMOTED_VERSION_PRE=ea for release 21.0.3 Christoph Langer SAP (same) (same)
2024/04/08 06:58 P3 tools/jpackage JDK-8329841 Launcher causes lingering busy cursor Dan Lutker Amazon Alexey Semenyuk Oracle
2024/04/05 19:12 P4 core-svc/javax.management JDK-8329803 4 javax/management tests ignore VM flags Goetz Lindenmaier SAP Leonid Mesnik Oracle
2024/04/05 19:11 P4 hotspot/other JDK-8329802 Update ProcessTools javadoc with suggestions in 8315097 Goetz Lindenmaier SAP Leo Korinth Oracle
2024/04/05 19:09 P4 security-libs/java.security JDK-8329801 Convert JKS test keystores in test/jdk/javax/net/ssl/etc to PKCS12 Goetz Lindenmaier SAP Kevin Driver Oracle
2024/04/05 19:08 P4 hotspot/test JDK-8329800 Replace "main.wrapper" with "test.thread.factory" property in test code Goetz Lindenmaier SAP Leonid Mesnik Oracle
2024/04/05 06:50 P4 core-svc/tools JDK-8329740 Do not restart close if errno is EINTR [macOS/linux] Matthias Baesken SAP (same) (same)
2024/04/05 06:47 P4 hotspot/runtime JDK-8329739 AIX os::get_summary_cpu_info support Power 10 Matthias Baesken SAP (same) (same)
2024/04/05 06:44 P4 hotspot/runtime JDK-8329737 [AIX] remove checked_vmgetinfo, use vmgetinfo directly Matthias Baesken SAP (same) (same)
2024/04/04 20:55 P4 hotspot/test JDK-8329712 Fix: Class is a raw type in ProcessTools Goetz Lindenmaier SAP Leo Korinth Oracle
2024/04/04 20:53 P4 core-svc/debugger JDK-8329709 Move TestScaffold.main() to the separate class DebugeeWrapper Goetz Lindenmaier SAP Leonid Mesnik Oracle
2024/04/04 20:49 P3 hotspot/jfr JDK-8329707 Wrong lock ordering writing G1HeapRegionTypeChange JFR event Goetz Lindenmaier SAP Markus Grönlund Oracle
2024/04/04 16:08 P4 security-libs/javax.security JDK-8329686 Better validation for com.sun.security.ocsp.useget option Aleksey Shipilev Amazon (same) (same)
2024/04/04 16:08 P4 security-libs/javax.security JDK-8329685 Fallback option for POST-only OCSP requests Aleksey Shipilev Amazon (same) (same)
2024/04/03 12:08 P3 client-libs/java.awt JDK-8329602 AWT Assertion Failure in ::GetDIBits(hBMDC, hBM, 0, 1, 0, gpBitmapInfo, 0) 'awt_Win32GraphicsDevice.cpp', at line 185 Christoph Langer SAP (same) (same)
2024/04/03 09:48 P2 core-libs/java.lang:class_loading JDK-8329591 TestLoadLibraryDeadlock.java fails on windows-x64 "Unable to load b.jar" Goetz Lindenmaier SAP Mandy Chung Oracle
2024/04/03 09:48 P4 core-libs/java.lang:class_loading JDK-8329590 TestLoadLibraryDeadlock.java fails with "Unable to load native library.: expected true, was false" Goetz Lindenmaier SAP Mandy Chung Oracle
2024/04/03 09:46 P4 hotspot/gc JDK-8329589 Move code cache purging out of CodeCache::UnloadingScope Goetz Lindenmaier SAP Thomas Schatzl Oracle
2024/04/03 09:45 P4 hotspot/compiler JDK-8329588 Specialize Vtablestubs::entry_for() for VtableBlob Goetz Lindenmaier SAP Thomas Schatzl Oracle
2024/04/03 09:40 P4 hotspot/compiler JDK-8329587 Remove Access API use in nmethod class Goetz Lindenmaier SAP Thomas Schatzl Oracle
2024/04/03 09:30 P5 hotspot/compiler JDK-8329586 ImmutableOopMapSet destructor not called Goetz Lindenmaier SAP Thomas Schatzl Oracle
2024/04/03 09:28 P4 hotspot/compiler JDK-8329585 Remove effectively unused nmethodBucket::_count Goetz Lindenmaier SAP Thomas Schatzl Oracle
2024/04/03 09:26 P4 core-libs/java.nio JDK-8329584 (fs) Move java/nio/file/Path/Misc.java tests into java/nio/file/Path/PathOps.java Goetz Lindenmaier SAP Brian Burkhalter Oracle
2024/04/03 09:11 P4 hotspot/runtime JDK-8329582 Remove dead ClassLoaderDataGraphKlassIteratorStatic Goetz Lindenmaier SAP Thomas Schatzl Oracle
2024/04/03 09:08 P4 hotspot/runtime JDK-8329579 Remove unnecessary seen_dead_loader in ClassLoaderDataGraph::do_unloading Goetz Lindenmaier SAP Thomas Schatzl Oracle
2024/04/03 09:00 P4 hotspot/gc JDK-8329574 G1: Add number of nmethods in code roots scanning statistics Goetz Lindenmaier SAP Thomas Schatzl Oracle
2024/04/03 08:58 P4 security-libs/javax.net.ssl JDK-8329573 SSLEngine throws IAE during parsing of X500Principal Goetz Lindenmaier SAP Kevin Driver Oracle
2024/04/03 06:50 P4 hotspot/svc JDK-8329562 hprof tests fail with -XX:-CompactStrings Aleksey Shipilev Amazon (same) (same)
2024/04/03 01:27 P4 core-svc/java.lang.management JDK-8327004 Reduce memory consumption of VM_ThreadDump::doit Long Yang Alibaba Long Yang Alibaba
2024/04/02 09:13 P5 hotspot/jfr JDK-8329505 jcmd: typo in the documentation of JFR.start and JFR.dump 103394724+kurashige23 Independent (same) (same)
2024/04/02 09:11 P4 hotspot/gc JDK-8329503 Enable parallelism in vmTestbase/vm/gc/concurrent tests Elif Aslan Amazon (same) (same)
2024/04/02 09:11 P4 hotspot/jfr JDK-8329502 JFR: Uninitialized EventEmitter::_thread_id field Elif Aslan Amazon (same) (same)
2024/04/02 08:40 P4 hotspot/runtime JDK-8329496 NMT should show library names in call stacks ariasdereyna Red Hat Thomas Stuefe Red Hat
2024/04/01 16:25 P3 security-libs/java.security JDK-8329405 JDK server does not send a dummy change_cipher_spec record after HelloRetryRequest message Goetz Lindenmaier SAP Prasadarao Koppula Oracle
2024/04/01 16:21 P4 core-svc/debugger JDK-8329401 com/sun/jdi/SetLocalWhileThreadInNative.java fails with virtual test thread factory due to OpaqueFrameException Goetz Lindenmaier SAP Chris Plummer Oracle
2024/04/01 01:57 P3 hotspot/runtime JDK-8329371 Update and move siphash license Andrew Lu SAP Jesper Wilhelmsson Oracle
2024/03/28 18:11 P4 core-libs/java.lang JDK-8329291 Enable java/lang/ProcessBuilder/JspawnhelperProtocol.java on Mac Elif Aslan Amazon (same) (same)
2024/03/28 07:59 P4 hotspot/test JDK-8329239 gtest runner repeats test name for every single gtest assertion Andrew Lu SAP Sonia Zaldana Calles Red Hat
2024/03/28 07:59 P3 client-libs/2d JDK-8329237 sun/java2d/cmm/ColorConvertOp/ColConvTest.java assumes profiles were generated by LCMS Andrew Lu SAP Dmitry Markov Oracle
2024/03/27 10:02 P4 hotspot/runtime JDK-8329171 gtest/LargePageGtests.java#use-large-pages failed "os.release_one_mapping_multi_commits_vm" Goetz Lindenmaier SAP Afshin Zafari Oracle
2024/03/26 11:05 P3 security-libs/java.security JDK-8329085 Google CAInterop test failures Aleksey Shipilev Amazon Rajan Halade Oracle
2024/03/26 08:19 P1 infrastructure/build JDK-8329075 GHA: Restoring sysroot from cache skips the build after JDK-8326960 Aleksey Shipilev Amazon (same) (same)
2024/03/25 18:03 P4 core-libs/java.lang JDK-8328979 Parsing test for Double/Float succeeds w/o testing all bad cases Goetz Lindenmaier SAP Naoto Sato Oracle
2024/03/25 18:00 P4 security-libs/java.security JDK-8328978 java/lang/SecurityManager tests ignore vm flags Goetz Lindenmaier SAP Matthew Donovan Oracle
2024/03/25 17:59 P4 client-libs JDK-8328976 Force English locale for timeout formatting Goetz Lindenmaier SAP Alexey Ivanov Oracle
2024/03/25 17:58 P5 hotspot/compiler JDK-8328975 Test: remove redundant test in compiler/vectorapi/reshape/utils/TestCastMethods.java Goetz Lindenmaier SAP Hamlin Li Huawei
2024/03/25 17:56 P4 core-libs/java.net JDK-8328974 Several network tests ignore vm flags when start java process Goetz Lindenmaier SAP Darragh Clarke Oracle
2024/03/25 17:55 P4 hotspot/compiler JDK-8328973 compiler/ciReplay/TestInliningProtectionDomain.java failed with RuntimeException: should only dump inline information for ... expected true, was false Goetz Lindenmaier SAP Christian Hagedorn Oracle
2024/03/25 17:54 P4 core-libs JDK-8328972 Update jni/nullCaller/NullCallerTest.java to accept flags or mark as flagless Goetz Lindenmaier SAP Tim Prinzing Oracle
2024/03/25 17:51 P4 infrastructure/build JDK-8328966 GHA: Cross-compilation jobs do not require build JDK Aleksey Shipilev Amazon (same) (same)
2024/03/25 17:51 P4 hotspot/compiler JDK-8328965 compiler/c2/aarch64/TestFarJump.java fails on AArch64 due to unexpected PrintAssembly output Goetz Lindenmaier SAP Boris Ulasevich BellSoft
2024/03/25 17:49 P4 core-libs/java.util.logging JDK-8328964 Few java/lang/System/LoggerFinder/modules tests ignore vm flags Goetz Lindenmaier SAP Darragh Clarke Oracle
2024/03/25 17:45 P4 core-libs/java.lang JDK-8328963 Test jdk/internal/misc/VM/RuntimeArguments.java should be marked as flagless Goetz Lindenmaier SAP Mandy Chung Oracle
2024/03/25 17:45 P4 core-libs/java.lang.module JDK-8328962 A couple of jdk/modules/incubator/ tests ignore VM flags Goetz Lindenmaier SAP Mandy Chung Oracle
2024/03/25 17:45 P4 core-libs/java.lang:class_loading JDK-8328961 Several classloader tests ignore VM flags Goetz Lindenmaier SAP Mandy Chung Oracle
2024/03/25 17:45 P4 core-libs/java.lang:reflect JDK-8328960 Update java/lang/reflect/exeCallerAccessTest/CallerAccessTest.java to accept vm flags Goetz Lindenmaier SAP Mandy Chung Oracle
2024/03/25 17:45 P4 core-libs/java.lang.invoke JDK-8328959 Update java/lang/invoke tests to support vm flags Goetz Lindenmaier SAP Mandy Chung Oracle
2024/03/25 14:34 P4 core-libs/java.lang JDK-8328943 Exec/process tests should be marked as flagless Goetz Lindenmaier SAP Roger Riggs Oracle
2024/03/25 14:32 P4 client-libs/javax.swing JDK-8328941 Open source few swing JFormattedTextField and JPopupMenu tests Goetz Lindenmaier SAP Abhishek Kumar Oracle
2024/03/25 14:31 P4 client-libs/javax.swing JDK-8328940 Opensource JMenuBar manual test Goetz Lindenmaier SAP Prasanta Sadhukhan Oracle
2024/03/25 13:31 P4 tools/jlink JDK-8328939 New test JmodExcludedFiles.java fails on Windows when --with-external-symbols-in-bundles=public is used Sonia Zaldana Calles Red Hat Christoph Langer SAP
2024/03/25 10:28 P4 tools/jlink JDK-8328918 Add a test to verify JMOD files created in the images do not have debug symbols Sonia Zaldana Calles Red Hat Mandy Chung Oracle
2024/03/25 10:28 P4 core-libs/java.nio JDK-8328917 (zipfs) jdk/jdk/nio/zipfs/TestLocOffsetFromZip64EF.java failing with ZipException:R0 on OL9 Sonia Zaldana Calles Red Hat Eirik Bjørsnøs Independent
2024/03/25 10:28 P4 core-libs/java.nio JDK-8328916 (zipfs) Make test/jdk/jdk/nio/zipfs/TestLocOffsetFromZip64EF.java independent of the zip command line Sonia Zaldana Calles Red Hat Eirik Bjørsnøs Independent
2024/03/25 10:26 P4 core-libs/java.lang JDK-8328915 Add test cases for String.regionMatches comparing Turkic dotted/dotless I with uppercase latin I Sonia Zaldana Calles Red Hat Eirik Bjørsnøs Independent
2024/03/25 08:53 P4 infrastructure/build JDK-8328890 GHA: RISC-V sysroot cannot be debootstrapped due to ongoing Debian t64 transition Aleksey Shipilev Amazon (same) (same)
2024/03/22 08:26 P4 hotspot/compiler JDK-8328778 improve assert(idx < _maxlrg) failed: oob Matthias Baesken SAP (same) (same)
2024/03/22 02:12 P4 client-libs/java.awt JDK-8328763 Open source misc awt tests Andrew Lu SAP Prasanta Sadhukhan Oracle
2024/03/22 02:12 P4 security-libs/javax.net.ssl JDK-8328762 Log X509ExtendedKeyManager implementation class name in TLS/SSL connection Andrew Lu SAP Prajwal Kumaraswamy Oracle
2024/03/21 12:28 P4 core-libs/java.text JDK-8328690 Finish removal of IntlTest and CollatorTest Goetz Lindenmaier SAP Justin Lu Oracle
2024/03/21 12:25 P3 core-libs/java.util.jar JDK-8328687 two java.util tests failed with "IOException: There is not enough space on the disk" Goetz Lindenmaier SAP Eirik Bjørsnøs Independent
2024/03/21 12:25 P4 core-libs/java.util.jar JDK-8328686 Speed up Zip64SizeTest using a small ZIP64 file Goetz Lindenmaier SAP Eirik Bjørsnøs Independent
2024/03/21 09:49 P4 hotspot/runtime JDK-8328677 Monitor deflation unlink phase prolongs time to safepoint Aleksey Shipilev Amazon (same) (same)
2024/03/20 08:59 P4 core-libs/java.lang JDK-8328584 [x86] StringRepeat.java failure on linux-x86: Could not reserve enough space for 2097152KB object heap Goetz Lindenmaier SAP (same) (same)
2024/03/20 08:55 P4 core-libs/java.text JDK-8328581 Refactor ChoiceFormat tests to use JUnit Goetz Lindenmaier SAP Justin Lu Oracle
2024/03/19 17:36 P3 client-libs/2d JDK-8328537 OutOfMemoryError by CustomMediaSizeName implementation Alexandr Scherbatiy BellSoft (same) (same)
2024/03/19 15:17 P4 client-libs JDK-8328526 IPPPrintService.getAttributes() causes blanket re-initialisation Alexandr Scherbatiy BellSoft Philip Race Oracle
2024/03/19 14:14 P4 security-libs/java.security JDK-8328523 Avoid Class.forName in SecureRandom constructor Oli Gillespie Amazon (same) (same)
2024/03/19 14:10 P4 hotspot/jfr JDK-8328521 JFR: Test for CompilerCompile events fails due to time out Robert Toyonaga Red Hat (same) (same)
2024/03/19 14:07 P4 core-libs/java.util:collections JDK-8328520 WhiteBoxResizeTest failure on linux-x86: Could not reserve enough space for 2097152KB object heap Goetz Lindenmaier SAP Jaikiran Pai Oracle
2024/03/19 14:04 P4 core-libs/java.net JDK-8328518 java/net/httpclient/MaxStreams.java failed with didn't finish within the time-out Goetz Lindenmaier SAP Daniel Jelinski Oracle
2024/03/19 14:02 P4 hotspot/test JDK-8328516 Some ProcessTools.execute* functions are declared to throw Throwable Goetz Lindenmaier SAP Stefan Karlsson Oracle
2024/03/19 13:58 P3 tools JDK-8328514 Make tests not depend on the source code Goetz Lindenmaier SAP Adam Sotona Oracle
2024/03/19 13:56 P4 core-libs/java.text JDK-8328513 Remove the testing base classes: IntlTest and CollatorTest Goetz Lindenmaier SAP Justin Lu Oracle
2024/03/19 13:55 P4 core-libs JDK-8328512 Remove javax/rmi/ssl/SSLSocketParametersTest.sh from ProblemList Goetz Lindenmaier SAP Matthew Donovan Oracle
2024/03/19 13:51 P4 core-svc/debugger JDK-8328511 com/sun/jdi/ReferrersTest.java fails with virtual test thread factory Goetz Lindenmaier SAP Chris Plummer Oracle
2024/03/19 11:33 P2 hotspot/runtime JDK-8328503 runtime/cds/appcds/dynamicArchive/DynamicSharedSymbols.java failed with "'17 2: jdk/test/lib/apps ' missing from stdout/stderr" Oli Gillespie Amazon Coleen Phillimore Oracle
2024/03/19 11:33 P3 hotspot/runtime JDK-8328502 Delay TempSymbol cleanup to avoid symbol table churn Oli Gillespie Amazon (same) (same)
2024/03/19 09:20 P4 hotspot/compiler JDK-8328476 CTW: Stale method cleanup requires GC after Sweeper removal Aleksey Shipilev Amazon (same) (same)
2024/03/19 08:35 P4 hotspot/jfr JDK-8328471 JFR view: the "Park Until" field of jdk.ThreadPark is invalid if the parking method is not absolute Long Yang Alibaba (same) (same)
2024/03/18 08:59 P4 hotspot/runtime JDK-8328337 Safepoint polling in monitor deflation can cause massive logs Aleksey Shipilev Amazon Stefan Karlsson Oracle
2024/03/18 08:59 P3 hotspot/runtime JDK-8328336 assert(monitor->object_peek() != nullptr) failed: Owned monitors should not have a dead object Aleksey Shipilev Amazon Stefan Karlsson Oracle
2024/03/18 08:59 P4 hotspot/runtime JDK-8328335 Remove monitor deflation from final audit Aleksey Shipilev Amazon Stefan Karlsson Oracle
2024/03/18 08:59 P2 hotspot/runtime JDK-8328334 VM_ThreadDump asserts in interleaved ObjectMonitor::deflate_monitor calls Aleksey Shipilev Amazon Stefan Karlsson Oracle
2024/03/15 08:50 P3 hotspot/runtime JDK-8328596 Add SipHash attribution file Goetz Lindenmaier SAP Jesper Wilhelmsson Oracle
2024/03/14 22:18 P4 hotspot/compiler JDK-8328226 Shenandoah: SIGSEGV crash in unnecessary_acquire due to LoadStore split through phi Dan Lutker Amazon Roland Westrelin Red Hat
2024/03/14 20:22 P4 core-libs JDK-8328212 Update the Zlib version in open/src/java.base/share/legal/zlib.md to 1.3.1 Goetz Lindenmaier SAP Lance Andersen Oracle
2024/03/14 20:22 P4 core-libs/java.util.jar JDK-8328211 Update Zlib Data Compression Library to Version 1.3 Goetz Lindenmaier SAP Lance Andersen Oracle
2024/03/14 20:22 P4 core-libs/java.util.jar JDK-8328210 Update Zlib Data Compression Library to Version 1.3.1 Goetz Lindenmaier SAP Lance Andersen Oracle
2024/03/14 20:18 P3 client-libs/javax.swing JDK-8328207 [macos] a11y : java.lang.NullPointerException is thrown when focus is moved on the JTabbedPane Goetz Lindenmaier SAP Alexander Zuev Oracle
2024/03/14 20:16 P3 client-libs/2d JDK-8328204 Update LCMS to 2.16 Goetz Lindenmaier SAP Alisen Chung Oracle
2024/03/14 20:14 P4 core-libs/java.util:i18n JDK-8328200 Refactor some util/Calendar tests to JUnit Goetz Lindenmaier SAP Justin Lu Oracle
2024/03/14 20:13 P4 tools JDK-8328199 Use JUnit in lib-test/jdk tests Goetz Lindenmaier SAP Qing Xiao Independent
2024/03/14 20:12 P4 hotspot/runtime JDK-8328198 Few runtime/os tests ignore vm flags Goetz Lindenmaier SAP Mikhailo Seledtsov Oracle
2024/03/14 20:10 P4 core-libs/java.util:i18n JDK-8328197 Refactor more Locale tests to use JUnit Goetz Lindenmaier SAP Justin Lu Oracle
2024/03/14 20:09 P4 core-libs/java.net JDK-8328196 Configure a javax.net.ssl.SNIMatcher for the HTTP/1.1 test servers in java/net/httpclient tests Goetz Lindenmaier SAP Jaikiran Pai Oracle
2024/03/14 20:08 P4 core-libs/java.util:i18n JDK-8328195 Refactor Locale tests to use JUnit Goetz Lindenmaier SAP Justin Lu Oracle
2024/03/14 17:09 P4 hotspot/gc JDK-8328187 Shenandoah: Clarify gc state usage William Kemper Amazon (same) (same)
2024/03/14 09:04 P4 client-libs/java.awt JDK-8328153 [macOS] java/awt/Frame/ShapeNotSetSometimes/ShapeNotSetSometimes.java fails with the shape has not been applied msg Andrew Lu SAP Harshitha Onkar Oracle
2024/03/13 16:08 P4 hotspot/gc JDK-8328108 Shenandoah: gc state should be synchronized to java threads only once per safepoint William Kemper Amazon (same) (same)
2024/03/13 10:31 P4 hotspot/runtime JDK-8328071 [test] checkHsErrFileContent support printing hserr in error case Matthias Baesken SAP (same) (same)
2024/03/13 08:53 P4 core-libs/java.nio JDK-8328062 test/jdk/java/nio/channels/unixdomain/SocketOptions.java enhance user name output in error case Matthias Baesken SAP (same) (same)
2024/03/13 08:22 P5 hotspot/test JDK-8328054 "top" command during jtreg failure handler does not display CPU usage on OSX Andrew Lu SAP Leonid Mesnik Oracle
2024/03/13 08:20 P4 hotspot/compiler JDK-8328048 enhance assert message "relocation addr must be in this section" Matthias Baesken SAP (same) (same)
2024/03/12 12:23 P4 hotspot/runtime JDK-8327976 Allow loading of shared objects with .a extension on AIX Suchismith Roy IBM (same) (same)
2024/03/12 12:15 P3 hotspot/compiler JDK-8327975 [PPC64] Need to bailout cleanly if creation of stubs fails when code cache is out of space Martin Doerr SAP (same) (same)
2024/03/12 09:23 P4 client-libs/java.awt JDK-8327959 [macos14] : ShapeNotSetSometimes.java fails intermittently on macOS 14 Andrew Lu SAP Harshitha Onkar Oracle
2024/03/12 09:23 P4 infrastructure/build JDK-8327956 Prefer RPATH over RUNPATH for $ORIGIN rpaths in internal JDK binaries Andrew Lu SAP Erik Joelsson Oracle
2024/03/12 02:17 P4 client-libs/java.awt JDK-8327861 Use PassFailJFrame for TruncatedPopupMenuTest.java Andrew Lu SAP Rajat Mahajan Oracle
2024/03/11 22:22 P3 core-libs/java.lang JDK-8327855 NegativeArraySizeException decoding >1G UTF8 bytes with non-ascii characters Sonia Zaldana Calles Red Hat Jim Laskey Oracle
2024/03/11 13:14 P4 hotspot/runtime JDK-8327820 RISC-V: UseSystemMemoryBarrier lacking proper OS support Ludovic Henry Rivos Robbin Ehn Rivos
2024/03/11 11:01 P4 infrastructure/build JDK-8327789 Linux builds not reproducible if two builds configured in different build folders Andrew Leonard Red Hat (same) (same)
2024/03/11 09:21 P4 client-libs/java.awt JDK-8327772 java/awt/GraphicsDevice/CheckDisplayModes.java failing on macOS 11 ARM Amos SHI SAP Alexander Zuev Oracle
2024/03/11 09:18 P4 hotspot/compiler JDK-8327771 Fix the compiler/sharedstubs/SharedTrampolineTest.java and SharedStubToInterpTest.java Aleksey Shipilev Amazon Evgeny Nikitin Oracle
2024/03/11 08:24 P4 client-libs/javax.accessibility JDK-8327767 src/jdk.accessibility/windows/native/libjavaaccessbridge/AccessBridgeJavaEntryPoints.cpp ReleaseStringChars might be missing in early returns Matthias Baesken SAP (same) (same)
2024/03/11 08:16 P3 hotspot/jfr JDK-8327766 The User and System of jdk.CPULoad on Apple M1 are inaccurate Long Yang Alibaba Long Yang Alibaba
2024/03/11 08:15 P4 infrastructure/build JDK-8327764 Use _LARGE_FILES on AIX Matthias Baesken SAP Magnus Ihse Bursie Oracle
2024/03/11 08:08 P4 hotspot/runtime JDK-8327763 os::Linux::print_proc_sys_info add swappiness information Matthias Baesken SAP (same) (same)
2024/03/08 05:42 P4 client-libs/javax.swing JDK-8327657 Open source several Swing JSpinner related tests Amos SHI SAP Tejesh R Oracle
2024/03/08 05:39 P4 hotspot/compiler JDK-8327656 com/sun/management/ThreadMXBean/ThreadCpuTimeArray.java can fail in Xcomp with out of expected range Amos SHI SAP Douglas Simon Oracle
2024/03/08 05:39 P3 client-libs/java.awt JDK-8327655 [macos14] InterJVMGetDropSuccessTest.java: Child VM: abnormal termination Amos SHI SAP songpv @imt-soft.com
2024/03/08 05:38 P4 client-libs/javax.swing JDK-8327654 Open source few swing JFileChooser and other tests Amos SHI SAP Abhishek Kumar Oracle
2024/03/08 05:37 P3 hotspot/compiler JDK-8327653 [PPC64] Don't relocate in case of allocation failure Martin Doerr SAP (same) (same)
2024/03/07 15:10 P3 core-libs/java.util.concurrent JDK-8327579 java/util/concurrent/tck/JSR166TestCase.java fails nanoTime test Sonia Zaldana Calles Red Hat Jaikiran Pai Oracle
2024/03/07 11:42 P1 hotspot/svc JDK-8327567 jcmd tests are broken by 8314828 Goetz Lindenmaier SAP Leonid Mesnik Oracle
2024/03/07 11:42 P4 hotspot/svc JDK-8327566 Mark 3 jcmd command-line options test as vm.flagless Goetz Lindenmaier SAP Leonid Mesnik Oracle
2024/03/07 10:44 P4 core-libs/javax.script JDK-8327561 Rewrite BadFactoryTest in pure Java Goetz Lindenmaier SAP Eirik Bjørsnøs Independent
2024/03/07 10:40 P4 core-libs/java.net JDK-8327560 StressDirListings.java fails on AIX Goetz Lindenmaier SAP Varada M IBM
2024/03/07 10:35 P4 tools/javac JDK-8327558 order of subclasses in the permits clause can differ between compilations Goetz Lindenmaier SAP Vicente Arturo Romero Zaldivar Oracle
2024/03/07 10:33 P4 core-libs/java.nio JDK-8327557 java/nio/channels/DatagramChannel/InterruptibleOrNot.java failed: wrong exception thrown Goetz Lindenmaier SAP Alan Bateman Oracle
2024/03/07 10:30 P4 core-libs/java.rmi JDK-8327556 Refactor/cleanup open/test/jdk/javax/rmi/ssl/SSLSocketParametersTest.java Goetz Lindenmaier SAP Matthew Donovan Oracle
2024/03/07 10:29 P4 hotspot/jvmti JDK-8327555 Fix serviceability/jvmti/8036666/GetObjectLockCount.java to use vm flags Goetz Lindenmaier SAP Leonid Mesnik Oracle
2024/03/07 10:28 P4 core-libs/java.net JDK-8327554 java/net/httpclient/ResponsePublisher.java fails intermittently with AssertionError: Found some outstanding operations Goetz Lindenmaier SAP Darragh Clarke Oracle
2024/03/07 10:27 P4 security-libs/javax.net.ssl JDK-8327553 Test: javax/net/ssl/DTLS/DTLSWontNegotiateV10.java timed out Goetz Lindenmaier SAP Matthew Donovan Oracle
2024/03/07 10:23 P4 core-libs/java.lang:class_loading JDK-8327552 Move tests in test/jdk/sun/misc/URLClassPath directory to test/jdk/jdk/internal/loader Goetz Lindenmaier SAP Jaikiran Pai Oracle
2024/03/07 10:14 P5 security-libs/java.security JDK-8326113 java/security/cert/CertPathValidator/OCSP/OCSPTimeout.java incorrect comment information Sendao Yan Alibaba (same) (same)
2024/03/07 10:13 P4 tools/jpackage JDK-8327551 test tools/jpackage/linux/LinuxResourceTest.java fails on CentOS Linux release 8.5.2111 and Fedora 27 Sendao Yan Alibaba Sun Yaqi Loongson
2024/03/07 10:12 P4 client-libs/javax.swing JDK-8327550 Open source few more swing text/html tests Sonia Zaldana Calles Red Hat Prasanta Sadhukhan Oracle
2024/03/07 10:11 P4 client-libs/javax.swing JDK-8327549 Open source swing JMenu tests Sonia Zaldana Calles Red Hat Abhishek Kumar Oracle
2024/03/07 08:07 P3 infrastructure/build JDK-8327531 Add -x to bash for building with LOG=debug Andrew Lu SAP Magnus Ihse Bursie Oracle
2024/03/07 08:07 P3 hotspot/compiler JDK-8327529 Crash in PhaseIdealLoop::remix_address_expressions due to unexpected Region instead of Loop Andrew Lu SAP Tobias Hartmann Oracle
2024/03/06 09:05 P3 hotspot/runtime JDK-8327036 [macosx-aarch64] SIGBUS in MarkActivationClosure::do_code_blob reached from Unsafe_CopySwapMemory0 Richard Reingruber SAP (same) (same)
2024/03/05 11:57 P3 core-libs/java.net JDK-8327367 HttpResponseInputStream.available() returns 1 on empty stream Goetz Lindenmaier SAP Vyom Tewari VMWare
2024/03/05 10:55 P4 security-libs/java.security JDK-8327362 Avoid NoSuchMethodError when instantiating NativePRNG Oli Gillespie Amazon (same) (same)
2024/03/05 03:24 P1 client-libs/java.awt JDK-8327438 Test "api/java_awt/interactive/SystemTrayTests.html" failed because A blue ball icon is added outside of the system tray Sergey Bylokhov Amazon Alexander Zvegintsev Oracle
2024/03/04 17:50 P4 client-libs/javax.swing JDK-8327244 Generate GIF images for AbstractButton/5049549/bug5049549.java Sonia Zaldana Calles Red Hat Renjith Kannath Pariyangad Oracle
2024/03/04 11:46 P4 hotspot/runtime JDK-8327220 set -XX:+ErrorFileToStderr when executing java in containers for some container related jtreg tests Matthias Baesken SAP (same) (same)
2024/03/04 11:19 P4 hotspot/compiler JDK-8327216 Add applications/ctw/modules to Hotspot tiered testing Aleksey Shipilev Amazon (same) (same)
2024/03/04 03:09 P4 client-libs/javax.swing JDK-8327183 "javax/swing/MultiMonitor/MultimonVImage.java failing with Error. Can't find library: /open/test/jdk/java/awt/regtesthelpers" after JDK-8316053 Andrew Lu SAP Lawrence Andrews Oracle
2024/03/02 02:44 P4 client-libs/2d JDK-8327159 Update the usage of cmsFLAGS_COPY_ALPHA Sergey Bylokhov Amazon (same) (same)
2024/03/01 15:15 P4 hotspot/jfr JDK-8327131 Array Elements in OldObjectSample event has the incorrect description Takuya Kiriyama Fujitsu (same) (same)
2024/03/01 09:39 P4 hotspot/runtime JDK-8327115 AArch64: Detect Ampere-1B core and update default options for Ampere CPUs Patrick Zhang Ampere (same) (same)
2024/02/29 16:27 P4 hotspot/compiler JDK-8327065 aarch64: fix prfm literal encoding in assembler Liang Mao Alibaba Wang Zhuo Alibaba
2024/02/29 09:24 P3 core-libs/java.lang JDK-8327024 Running with -Djdk.tracePinnedThreads set can hang Aleksey Shipilev Amazon Alan Bateman Oracle
2024/02/28 17:50 P4 client-libs/2d JDK-8326982 j2dbench is using outdated javac source/target to be able to build by itself Jiří Vaněk Red Hat (same) (same)
2024/02/28 15:36 P4 core-libs/java.lang JDK-8326972 java/lang/Thread/virtual/stress/ParkALot.java times out Aleksey Shipilev Amazon Alan Bateman Oracle
2024/02/28 15:36 P4 core-libs/java.lang JDK-8326971 java/lang/Thread/virtual/stress/GetStackTraceALotWhenPinned.java#id1 timed out Aleksey Shipilev Amazon Alan Bateman Oracle
2024/02/28 15:36 P4 core-libs/java.lang JDK-8326970 test/jdk/java/lang/Thread/virtual/stress/GetStackTraceALotWhenPinned.java times out on macosx-x64 Aleksey Shipilev Amazon Alan Bateman Oracle
2024/02/28 15:36 P3 core-libs/java.lang JDK-8326969 Thread::getStackTrace can fail with InternalError if virtual thread is timed-parked when pinned Aleksey Shipilev Amazon Alan Bateman Oracle
2024/02/28 15:36 P3 core-libs/java.lang JDK-8326968 Virtual Thread.yield consumes parking permit Aleksey Shipilev Amazon Alan Bateman Oracle
2024/02/28 15:36 P3 hotspot/jvmti JDK-8326967 notifyJvmtiMount before notifyJvmtiUnmount Aleksey Shipilev Amazon Alan Bateman Oracle
2024/02/28 15:36 P3 core-libs/java.lang JDK-8326966 Thread::getState and JVM TI GetThreadState should return TIMED_WAITING virtual thread is timed parked Aleksey Shipilev Amazon Alan Bateman Oracle
2024/02/28 15:36 P4 core-libs/java.lang JDK-8326965 Change VirtualThread to unmount after freezing, re-mount before thawing Aleksey Shipilev Amazon Alan Bateman Oracle
2024/02/28 08:26 P4 infrastructure/build JDK-8326932 Flags introduced by configure script are not passed to ADLC build Martin Doerr SAP (same) (same)
2024/02/28 08:04 P3 hotspot/runtime JDK-8326929 is_aligned(p, alignof(OopT))) assertion fails in Jetty without compressed OOPs Aleksey Shipilev Amazon Patricio Chilano Mateo Oracle
2024/02/28 08:04 P3 hotspot/runtime JDK-8326928 assert(_chunk->bitmap().at(index)) failed: Bit not set at index Aleksey Shipilev Amazon Patricio Chilano Mateo Oracle
2024/02/28 07:39 P4 infrastructure/build JDK-8326924 GHA: Upgrade some actions to avoid deprecated Node 16 Aleksey Shipilev Amazon (same) (same)
2024/02/28 07:05 P4 client-libs/javax.swing JDK-8326911 Open some swing tests 3 Andrew Lu SAP Alisen Chung Oracle
2024/02/28 02:50 P3 hotspot/gc JDK-8326896 Parallel GC does not pre-touch all heap pages when AlwaysPreTouch enabled and large page disabled Liang Mao Alibaba Wang Zhuo Alibaba
2024/02/27 18:54 P4 infrastructure/release_eng JDK-8326773 Bump update version for OpenJDK: jdk-21.0.4 Goetz Lindenmaier SAP (same) (same)

No changesets log

Committer push log

103394724+kurashige23, Independent

Bug Summary
JDK-8329505 jcmd: typo in the documentation of JFR.start and JFR.dump

acmoraru, Amazon

Bug Summary
JDK-8331722 TestStringDeduplicationInterned.java waits for the wrong condition

Andrew Leonard, Red Hat

Bug Summary
JDK-8327789 Linux builds not reproducible if two builds configured in different build folders

Alexandr Scherbatiy, BellSoft

Bug Summary
JDK-8328526 IPPPrintService.getAttributes() causes blanket re-initialisation
JDK-8328537 OutOfMemoryError by CustomMediaSizeName implementation

Amit Kumar, IBM

Bug Summary
JDK-8331707 [S390] Need to bailout cleanly if creation of stubs fails when code cache is out of space
JDK-8331710 [s390x] Intrinsify recursive ObjectMonitor locking
JDK-8331397 [s390x] TestSigInfoInHsErrFile.java Failure
JDK-8331709 [s390x] update block-comments to make code consistent

Andrew Lu, SAP

Bug Summary
JDK-8327183 "javax/swing/MultiMonitor/MultimonVImage.java failing with Error. Can't find library: /open/test/jdk/java/awt/regtesthelpers" after JDK-8316053
JDK-8328054 "top" command during jtreg failure handler does not display CPU usage on OSX
JDK-8327959 [macos14] : ShapeNotSetSometimes.java fails intermittently on macOS 14
JDK-8328153 [macOS] java/awt/Frame/ShapeNotSetSometimes/ShapeNotSetSometimes.java fails with the shape has not been applied msg
JDK-8332800 [macos] Test tools/jpackage/macosx/MacAppStoreJlinkOptionsTest.java timed out on macOS
JDK-8327531 Add -x to bash for building with LOG=debug
JDK-8330070 Add a security category to the java -XshowSettings option
JDK-8332601 Add more test cases for JDK-8319372
JDK-8327529 Crash in PhaseIdealLoop::remix_address_expressions due to unexpected Region instead of Loop
JDK-8329239 gtest runner repeats test name for every single gtest assertion
JDK-8330643 HttpURLConnection cache issues leading to crashes in JGSS w/ native GSS introduced by 8303809
JDK-8332444 Improve the tests of test/hotspot/jtreg/compiler/intrinsics/float16
JDK-8332276 jdk/jfr/api/consumer/recordingstream/TestSetEndTime.java timed out
JDK-8328762 Log X509ExtendedKeyManager implementation class name in TLS/SSL connection
JDK-8326911 Open some swing tests 3
JDK-8328763 Open source misc awt tests
JDK-8327956 Prefer RPATH over RUNPATH for $ORIGIN rpaths in internal JDK binaries
JDK-8329237 sun/java2d/cmm/ColorConvertOp/ColConvTest.java assumes profiles were generated by LCMS
JDK-8333012 Test gc/g1/TestHumongousAllocConcurrentStart.java fails with -XX:TieredStopAtLevel=3
JDK-8329693 test javax/swing/JSplitPane/4885629/bug4885629.java fails on windows hidpi
JDK-8332802 test/hotspot/jtreg/applications/ctw/modules/jdk_crypto_ec.java cannot handle empty modules
JDK-8332338 TestPLABResize.java and TestPLABPromotion.java are failing intermittently
JDK-8332767 tools/jpackage/share/RuntimeImageTest.java fails with -XX:+UseZGC
JDK-8329371 Update and move siphash license
JDK-8327861 Use PassFailJFrame for TruncatedPopupMenuTest.java

ariasdereyna, Red Hat

Bug Summary
JDK-8331192 [nmt] Multiple issues with peak accounting
JDK-8332480 Add GlobalSign 2 TLS root certificates
JDK-8330957 need a largest_committed metric for each category of NMT's output
JDK-8329496 NMT should show library names in call stacks

Amos SHI, SAP

Bug Summary
JDK-8327655 [macos14] InterJVMGetDropSuccessTest.java: Child VM: abnormal termination
JDK-8331236 [macos14] Problem list tests which fail due to macOS bug described in JDK-8322653
JDK-8330891 [macos14] Running any AWT app prints Secure coding warning
JDK-8330880 Allow TEST_VM_FLAGLESS to set flagless mode
JDK-8330892 Background not refreshed when painting over a transparent JFrame
JDK-8327656 com/sun/management/ThreadMXBean/ThreadCpuTimeArray.java can fail in Xcomp with out of expected range
JDK-8327772 java/awt/GraphicsDevice/CheckDisplayModes.java failing on macOS 11 ARM
JDK-8330890 javax/management/remote/mandatory/notif/NotifReconnectDeadlockTest.java fails on libgraal
JDK-8330879 Modify TrayIconScalingTest.java, PrintLatinCJKTest.java to use new PassFailJFrame's builder pattern usage
JDK-8327654 Open source few swing JFileChooser and other tests
JDK-8327657 Open source several Swing JSpinner related tests
JDK-8330881 Open source several Swing Text/HTML related tests
JDK-8329974 System Tray icons get corrupted when Windows primary monitor changes

Ashutosh Mehra, Red Hat

Bug Summary
JDK-8333111 Crash in XMark::follow_array

Ben Taylor, Amazon

Bug Summary
JDK-8332845 Parallel: Parallel GC resizes heap even if -Xms = -Xmx

Bernhard Urban-Forster, Oracle

Bug Summary
JDK-8331455 ODR violation in macroAssembler_aarch64.cpp

Chad Rakoczy, Amazon

Bug Summary
JDK-8332133 Improve jspawnhelper version checks

Christoph Langer, SAP

Bug Summary
JDK-8330492 [21u] Remove designator DEFAULT_PROMOTED_VERSION_PRE=ea for release 21.0.3
JDK-8331639 [21u]: Bump GHA bootstrap JDK to 21.0.3
JDK-8329602 AWT Assertion Failure in ::GetDIBits(hBMDC, hBM, 0, 1, 0, gpBitmapInfo, 0) 'awt_Win32GraphicsDevice.cpp', at line 185
JDK-8330081 Inconsistent behavior in com.sun.jndi.ldap.Connection::createSocket
JDK-8331991 Reduce runtime and improve efficiency of KeepAliveTest
JDK-8331989 Use pattern matching for instanceof in KeepAliveCache

Dan Lutker, Amazon

Bug Summary
JDK-8329841 Launcher causes lingering busy cursor
JDK-8328226 Shenandoah: SIGSEGV crash in unnecessary_acquire due to LoadStore split through phi

Elif Aslan, Amazon

Bug Summary
JDK-8329291 Enable java/lang/ProcessBuilder/JspawnhelperProtocol.java on Mac
JDK-8329503 Enable parallelism in vmTestbase/vm/gc/concurrent tests
JDK-8329502 JFR: Uninitialized EventEmitter::_thread_id field
JDK-8329879 jspawnhelper without args fails with segfault

Gui Cao, Independent

Bug Summary
JDK-8329943 RISC-V: Features string uses wrong separator for jtreg
JDK-8330101 RISC-V: Need to sync CPU features with related JVM flags
JDK-8330640 RISC-V: Remove PlatformCmpxchg<4>
JDK-8331689 RISC-V: Save and restore FRM in the call stub
JDK-8330639 RISC-V: Shenandoah GC crashes due to incorrect atomic memory operations
JDK-8330641 RISC-V: Simplify and remove CORRECT_COMPILER_ATOMIC_SUPPORT in atomic_linux_riscv.hpp

Goetz Lindenmaier, SAP

Bug Summary
JDK-8329584 (fs) Move java/nio/file/Path/Misc.java tests into java/nio/file/Path/PathOps.java
JDK-8329803 4 javax/management tests ignore VM flags
JDK-8329856 6 java/lang/instrument/PremainClass tests ignore VM flags
JDK-8330345 [macos14] Problem list LightweightEventTest.java which fails due to macOS bug described in JDK-8322653
JDK-8328207 [macos] a11y : java.lang.NullPointerException is thrown when focus is moved on the JTabbedPane
JDK-8329854 [test] OutputAnalyzer.getExitValue() unnecessarily logs even when process has already completed
JDK-8328584 [x86] StringRepeat.java failure on linux-x86: Could not reserve enough space for 2097152KB object heap
JDK-8328962 A couple of jdk/modules/incubator/ tests ignore VM flags
JDK-8331768 Add bulk removal of dead nmethods during class unloading
JDK-8328596 Add SipHash attribution file
JDK-8326773 Bump update version for OpenJDK: jdk-21.0.4
JDK-8328511 com/sun/jdi/ReferrersTest.java fails with virtual test thread factory
JDK-8329401 com/sun/jdi/SetLocalWhileThreadInNative.java fails with virtual test thread factory due to OpaqueFrameException
JDK-8328965 compiler/c2/aarch64/TestFarJump.java fails on AArch64 due to unexpected PrintAssembly output
JDK-8328973 compiler/ciReplay/TestInliningProtectionDomain.java failed with RuntimeException: should only dump inline information for ... expected true, was false
JDK-8328196 Configure a javax.net.ssl.SNIMatcher for the HTTP/1.1 test servers in java/net/httpclient tests
JDK-8329801 Convert JKS test keystores in test/jdk/javax/net/ssl/etc to PKCS12
JDK-8328943 Exec/process tests should be marked as flagless
JDK-8330829 Failed: java/io/ObjectStreamClass/ObjectStreamClassCaching.java#G1
JDK-8329855 Few java/lang/instrument ignore test.java.opts and accept test.vm.opts only
JDK-8328964 Few java/lang/System/LoggerFinder/modules tests ignore vm flags
JDK-8328198 Few runtime/os tests ignore vm flags
JDK-8328690 Finish removal of IntlTest and CollatorTest
JDK-8327555 Fix serviceability/jvmti/8036666/GetObjectLockCount.java to use vm flags
JDK-8329712 Fix: Class is a raw type in ProcessTools
JDK-8328976 Force English locale for timeout formatting
JDK-8330912 G1 Full GC Heap verification relies on metadata not reset before verification
JDK-8329574 G1: Add number of nmethods in code roots scanning statistics
JDK-8330652 G1: Code root scan causes long GC pauses due to imbalanced iteration
JDK-8330922 G1: G1UpdateRemSetTrackingBeforeRebuild::distribute_marked_bytes accesses partially unloaded klass
JDK-8330654 G1: Memory leak in G1CodeRootSet after JDK-8315503
JDK-8329171 gtest/LargePageGtests.java#use-large-pages failed "os.release_one_mapping_multi_commits_vm"
JDK-8331282 Harmonize executeTestJvm with create[Limited]TestJavaProcessBuilder
JDK-8330831 hidpi problems for test java/awt/Dialog/DialogAnotherThread/JaWSTest.java
JDK-8327367 HttpResponseInputStream.available() returns 1 on empty stream
JDK-8329586 ImmutableOopMapSet destructor not called
JDK-8330661 Improve dependencies removal during class unloading
JDK-8331767 Improve error reporting for uncaught native exceptions on Windows
JDK-8330658 Improve InlineCacheBuffer pending queue management
JDK-8331621 Insertion of free code blobs into code cache can be very slow during class unloading
JDK-8328978 java/lang/SecurityManager tests ignore vm flags
JDK-8328518 java/net/httpclient/MaxStreams.java failed with didn't finish within the time-out
JDK-8327554 java/net/httpclient/ResponsePublisher.java fails intermittently with AssertionError: Found some outstanding operations
JDK-8327557 java/nio/channels/DatagramChannel/InterruptibleOrNot.java failed: wrong exception thrown
JDK-8330342 java/util/Locale/LocaleProvidersRun.java and java/util/ResourceBundle/modules/visibility/VisibilityTest.java timeout after passing
JDK-8330828 java/util/Properties/PropertiesStoreTest.java fails "Text 'xxx' could not be parsed at index 20" after 8174269
JDK-8329853 JavadocTester should set source path if not specified
JDK-8327567 jcmd tests are broken by 8314828
JDK-8329405 JDK server does not send a dummy change_cipher_spec record after HelloRetryRequest message
JDK-8330009 jdk/javax/swing/ProgressMonitor/ProgressTest.java does not show the ProgressMonitorInputStream all the time
JDK-8330084 JVMCI exception Translation can fail in TranslatedException.
JDK-8330653 Lock rank checking fails when code root set is modified with the Servicelock held after JDK-8315503
JDK-8329851 Make -XX:+Verbose less verbose
JDK-8328514 Make tests not depend on the source code
JDK-8327566 Mark 3 jcmd command-line options test as vm.flagless
JDK-8329589 Move code cache purging out of CodeCache::UnloadingScope
JDK-8327552 Move tests in test/jdk/sun/misc/URLClassPath directory to test/jdk/jdk/internal/loader
JDK-8329709 Move TestScaffold.main() to the separate class DebugeeWrapper
JDK-8328941 Open source few swing JFormattedTextField and JPopupMenu tests
JDK-8328940 Opensource JMenuBar manual test
JDK-8327558 order of subclasses in the permits clause can differ between compilations
JDK-8328979 Parsing test for Double/Float succeeds w/o testing all bad cases
JDK-8330657 PrintSystemDictionaryAtExit has mutex rank assert
JDK-8330012 ProcessTools.executeProcess calls waitFor before logging
JDK-8328581 Refactor ChoiceFormat tests to use JUnit
JDK-8328195 Refactor Locale tests to use JUnit
JDK-8328197 Refactor more Locale tests to use JUnit
JDK-8328200 Refactor some util/Calendar tests to JUnit
JDK-8327556 Refactor/cleanup open/test/jdk/javax/rmi/ssl/SSLSocketParametersTest.java
JDK-8329587 Remove Access API use in nmethod class
JDK-8329582 Remove dead ClassLoaderDataGraphKlassIteratorStatic
JDK-8329585 Remove effectively unused nmethodBucket::_count
JDK-8328512 Remove javax/rmi/ssl/SSLSocketParametersTest.sh from ProblemList
JDK-8328513 Remove the testing base classes: IntlTest and CollatorTest
JDK-8329579 Remove unnecessary seen_dead_loader in ClassLoaderDataGraph::do_unloading
JDK-8330010 Rename CodeCache::UnloadingScope to UnlinkingScope
JDK-8329800 Replace "main.wrapper" with "test.thread.factory" property in test code
JDK-8330832 Review use of java.io.tmpdir in jdk tests
JDK-8327561 Rewrite BadFactoryTest in pure Java
JDK-8328961 Several classloader tests ignore VM flags
JDK-8328974 Several network tests ignore vm flags when start java process
JDK-8330093 Simplify FileChooserSymLinkTest.java by using single-window testUI
JDK-8328516 Some ProcessTools.execute* functions are declared to throw Throwable
JDK-8329588 Specialize Vtablestubs::entry_for() for VtableBlob
JDK-8328686 Speed up Zip64SizeTest using a small ZIP64 file
JDK-8329573 SSLEngine throws IAE during parsing of X500Principal
JDK-8327560 StressDirListings.java fails on AIX
JDK-8329880 System.exit(0) kills the launched 3rd party application
JDK-8330013 Test java/util/Formatter/Padding.java has unnecessary high heap requirement after JDK-8326718
JDK-8329857 Test java/util/Formatter/Padding.java should timeout on large inputs before fix in JDK-8299677
JDK-8328963 Test jdk/internal/misc/VM/RuntimeArguments.java should be marked as flagless
JDK-8327553 Test: javax/net/ssl/DTLS/DTLSWontNegotiateV10.java timed out
JDK-8328975 Test: remove redundant test in compiler/vectorapi/reshape/utils/TestCastMethods.java
JDK-8329591 TestLoadLibraryDeadlock.java fails on windows-x64 "Unable to load b.jar"
JDK-8329590 TestLoadLibraryDeadlock.java fails with "Unable to load native library.: expected true, was false"
JDK-8330087 tools/jpackage/share/RuntimePackageTest.java fails with java.lang.AssertionError missing files
JDK-8328687 two java.util tests failed with "IOException: There is not enough space on the disk"
JDK-8330083 Update IANA Language Subtag Registry to Version 2023-08-02
JDK-8330092 Update IANA Language Subtag Registry to Version 2023-10-16
JDK-8330344 Update IANA Language Subtag Registry to Version 2024-03-07
JDK-8328959 Update java/lang/invoke tests to support vm flags
JDK-8328960 Update java/lang/reflect/exeCallerAccessTest/CallerAccessTest.java to accept vm flags
JDK-8328972 Update jni/nullCaller/NullCallerTest.java to accept flags or mark as flagless
JDK-8328204 Update LCMS to 2.16
JDK-8330924 Update PKCS11Test.java to not use hardcoded path
JDK-8329802 Update ProcessTools javadoc with suggestions in 8315097
JDK-8328212 Update the Zlib version in open/src/java.base/share/legal/zlib.md to 1.3.1
JDK-8328211 Update Zlib Data Compression Library to Version 1.3
JDK-8328210 Update Zlib Data Compression Library to Version 1.3.1
JDK-8328199 Use JUnit in lib-test/jdk tests
JDK-8330659 VtableStubs::stub_containing() table load not ordered wrt to stores
JDK-8328520 WhiteBoxResizeTest failure on linux-x86: Could not reserve enough space for 2097152KB object heap
JDK-8330660 Writing JFR records while a CHT has taken its lock asserts in rank checking
JDK-8329707 Wrong lock ordering writing G1HeapRegionTypeChange JFR event

Jonathan Dowland, Red Hat

Bug Summary
JDK-8331174 Open source several Swing HTMLDocument related tests

Joachim Kern, SAP

Bug Summary
JDK-8331696 [AIX] Allow loading of different members of same shared library archive

Jan Kratochvil, Azul

Bug Summary
JDK-8332192 Compilation failures in java.desktop module with gcc 14
JDK-8332290 error: template-id not allowed for constructor/destructor in C++20
JDK-8332291 Remove unnecessary template parameter lists in GrowableArray

Jiří Vaněk, Red Hat

Bug Summary
JDK-8326982 j2dbench is using outdated javac source/target to be able to build by itself

Takuya Kiriyama, Fujitsu

Bug Summary
JDK-8327131 Array Elements in OldObjectSample event has the incorrect description

Liang Mao, Alibaba

Bug Summary
JDK-8327065 aarch64: fix prfm literal encoding in assembler
JDK-8332792 Fix ZPhysicalMemorySegment::_end type
JDK-8331845 G1: Heap resizing at Remark does not take existing eden regions into account
JDK-8326896 Parallel GC does not pre-touch all heap pages when AlwaysPreTouch enabled and large page disabled
JDK-8331844 ParallelGC: Forwarded objects found during heap inspection
JDK-8332793 Threads::print_on() tries to print CPU time for terminated GC threads

Ludovic Henry, Rivos

Bug Summary
JDK-8327820 RISC-V: UseSystemMemoryBarrier lacking proper OS support

Long Yang, Alibaba

Bug Summary
JDK-8328471 JFR view: the "Park Until" field of jdk.ThreadPark is invalid if the parking method is not absolute
JDK-8327004 Reduce memory consumption of VM_ThreadDump::doit
JDK-8327766 The User and System of jdk.CPULoad on Apple M1 are inaccurate

Matthias Baesken, SAP

Bug Summary
JDK-8329737 [AIX] remove checked_vmgetinfo, use vmgetinfo directly
JDK-8328071 [test] checkHsErrFileContent support printing hserr in error case
JDK-8329739 AIX os::get_summary_cpu_info support Power 10
JDK-8332440 avoid alignment checks in UBSAN enabled build
JDK-8332295 avoid signed integer overflows in zip_util.c readCen / hashN
JDK-8329740 Do not restart close if errno is EINTR [macOS/linux]
JDK-8328048 enhance assert message "relocation addr must be in this section"
JDK-8332821 hs errfile generic events - move memory protections and nmethod flushes to separate sections
JDK-8332296 hs_err file event log entry for thread adding/removing should print current thread
JDK-8332822 hserr generic events - add entry for the before_exit calls
JDK-8328778 improve assert(idx < _maxlrg) failed: oob
JDK-8333027 libjli GetApplicationHome cleanups and enhance jli tracing
JDK-8332024 Linux ppc64le compile warning with clang in os_linux_ppc.cpp
JDK-8327763 os::Linux::print_proc_sys_info add swappiness information
JDK-8332436 Print additional debug information when hitting assert(in_hash)
JDK-8329945 remove on_aix() function
JDK-8327220 set -XX:+ErrorFileToStderr when executing java in containers for some container related jtreg tests
JDK-8327767 src/jdk.accessibility/windows/native/libjavaaccessbridge/AccessBridgeJavaEntryPoints.cpp ReleaseStringChars might be missing in early returns
JDK-8328062 test/jdk/java/nio/channels/unixdomain/SocketOptions.java enhance user name output in error case
JDK-8332294 UBSan enabled build fails in adlc on macOS
JDK-8330239 unify os::breakpoint among posix platforms
JDK-8332972 unify os::dont_yield and os::naked_yield across Posix platforms
JDK-8327764 Use _LARGE_FILES on AIX

Martin Doerr, SAP

Bug Summary
JDK-8327653 [PPC64] Don't relocate in case of allocation failure
JDK-8327975 [PPC64] Need to bailout cleanly if creation of stubs fails when code cache is out of space
JDK-8326932 Flags introduced by configure script are not passed to ADLC build
JDK-8333142 Null icon returned for .exe without custom icon
JDK-8332422 Uncontrolled memory consumption in SSLFlowDelegate.Reader
JDK-8332804 Update GC tests to use execute[Limited]TestJava

Oli Gillespie, Amazon

Bug Summary
JDK-8328523 Avoid Class.forName in SecureRandom constructor
JDK-8327362 Avoid NoSuchMethodError when instantiating NativePRNG
JDK-8328502 Delay TempSymbol cleanup to avoid symbol table churn
JDK-8328503 runtime/cds/appcds/dynamicArchive/DynamicSharedSymbols.java failed with "'17 2: jdk/test/lib/apps ' missing from stdout/stderr"

Patrick Zhang, Ampere

Bug Summary
JDK-8327115 AArch64: Detect Ampere-1B core and update default options for Ampere CPUs

Robbin Ehn, Rivos

Bug Summary
JDK-8331288 RISC-V: Range check auipc + signed 12 imm instruction

Roy Soumadipta, Amazon

Bug Summary
JDK-8330075 Enable parallelism in vmTestbase/gc/vector tests

Richard Reingruber, SAP

Bug Summary
JDK-8327036 [macosx-aarch64] SIGBUS in MarkActivationClosure::do_code_blob reached from Unsafe_CopySwapMemory0

Robert Toyonaga, Red Hat

Bug Summary
JDK-8330384 jdk/jfr/jcmd/TestJcmdDumpPathToGCRoots.java failed with "Expected chains but found none"
JDK-8330383 JFR: CompilerPhase event test fails on windows 32 bit
JDK-8328521 JFR: Test for CompilerCompile events fails due to time out

Sergey Bylokhov, Amazon

Bug Summary
JDK-8331254 Add a test to check default rendering engine
JDK-8332636 Linux arm32 build fails after 8292591
JDK-8327438 Test "api/java_awt/interactive/SystemTrayTests.html" failed because A blue ball icon is added outside of the system tray
JDK-8327159 Update the usage of cmsFLAGS_COPY_ALPHA

Severin Gehwolf, Red Hat

Bug Summary
JDK-8330246 Buffer overflow in os::Linux::kernel_version

Aleksey Shipilev, Amazon

Bug Summary
JDK-8327216 Add applications/ctw/modules to Hotspot tiered testing
JDK-8326928 assert(_chunk->bitmap().at(index)) failed: Bit not set at index
JDK-8328336 assert(monitor->object_peek() != nullptr) failed: Owned monitors should not have a dead object
JDK-8329686 Better validation for com.sun.security.ocsp.useget option
JDK-8331712 C2 SuperWord: disable vectorization for large stride and scale
JDK-8331561 C2: "negative trip count?" assert failure in profile predicate code
JDK-8331328 C2: bailout message broken: ResourceArea allocated string used after free
JDK-8330055 C2: Crash during parsing because sub type check is not folded
JDK-8331545 C2: possible overflow in PhaseIdealLoop::extract_long_range_checks()
JDK-8326965 Change VirtualThread to unmount after freezing, re-mount before thawing
JDK-8331107 ConcurrentHashTable::statistics_calculate synchronization is expensive
JDK-8328476 CTW: Stale method cleanup requires GC after Sweeper removal
JDK-8330778 Epsilon: 'EpsilonHeap::allocate_work' misuses the parameter 'size' as size in bytes
JDK-8331309 Epsilon: Premature OOM when allocating object larger than uncommitted heap size
JDK-8329685 Fallback option for POST-only OCSP requests
JDK-8327771 Fix the compiler/sharedstubs/SharedTrampolineTest.java and SharedStubToInterpTest.java
JDK-8329996 G1: Excessive is_obj_dead_cond calls in verification
JDK-8328966 GHA: Cross-compilation jobs do not require build JDK
JDK-8329075 GHA: Restoring sysroot from cache skips the build after JDK-8326960
JDK-8328890 GHA: RISC-V sysroot cannot be debootstrapped due to ongoing Debian t64 transition
JDK-8326924 GHA: Upgrade some actions to avoid deprecated Node 16
JDK-8329085 Google CAInterop test failures
JDK-8329562 hprof tests fail with -XX:-CompactStrings
JDK-8331705 Illegal accesses in Java_jdk_internal_org_jline_terminal_impl_jna_linux_CLibraryImpl_ioctl0
JDK-8330642 Improve GenericWaitBarrier performance
JDK-8331102 Improve heap dump performance by optimizing archived object checks
JDK-8329900 Improve heap dump performance with class metadata caching
JDK-8326929 is_aligned(p, alignof(OopT))) assertion fails in Jetty without compressed OOPs
JDK-8326971 java/lang/Thread/virtual/stress/GetStackTraceALotWhenPinned.java#id1 timed out
JDK-8326972 java/lang/Thread/virtual/stress/ParkALot.java times out
JDK-8331103 java/net/httpclient/ManyRequest.java should not use "localhost" in URIs
JDK-8332279 jdk.internal.util.ReferencedKeySet::add using wrong test
JDK-8328677 Monitor deflation unlink phase prolongs time to safepoint
JDK-8331783 Move ReferencedKeyMap to jdk.internal so it may be shared
JDK-8331099 Move the stub test from initialize_final_stubs() to test/hotspot/gtest
JDK-8332134 NMT: Change MallocMemorySnapshot to simplify code.
JDK-8326967 notifyJvmtiMount before notifyJvmtiUnmount
JDK-8331267 Refactor test/langtools/tools/javac/versions/Versions.java
JDK-8328335 Remove monitor deflation from final audit
JDK-8327024 Running with -Djdk.tracePinnedThreads set can hang
JDK-8328337 Safepoint polling in monitor deflation can cause massive logs
JDK-8331544 SIGFPE in PhaseIdealLoop::extract_long_range_checks
JDK-8331268 SourceExample.SOURCE_14 comment should refer to 'switch expressions' instead of 'text blocks'
JDK-8331116 StackOverflowError when starting Apache Tomcat with signed jar
JDK-8326970 test/jdk/java/lang/Thread/virtual/stress/GetStackTraceALotWhenPinned.java times out on macosx-x64
JDK-8326969 Thread::getStackTrace can fail with InternalError if virtual thread is timed-parked when pinned
JDK-8326966 Thread::getState and JVM TI GetThreadState should return TIMED_WAITING virtual thread is timed parked
JDK-8331335 Upcall stub might go undetected when freezing frames
JDK-8331101 Virtual thread test updates
JDK-8326968 Virtual Thread.yield consumes parking permit
JDK-8328334 VM_ThreadDump asserts in interleaved ObjectMonitor::deflate_monitor calls

Sidraya Jayagond, IBM

Bug Summary
JDK-8330149 [s390x] Fix garbage value being passed in Argument Register

Suchismith Roy, IBM

Bug Summary
JDK-8327976 Allow loading of shared objects with .a extension on AIX

Thomas Stuefe, Red Hat

Bug Summary
JDK-8332285 On Linux aarch64, CDS archives should be using 64K alignment by default

Sendao Yan, Alibaba

Bug Summary
JDK-8331706 :tier1 target explanation in doc/testing.md is incorrect
JDK-8331269 createJMHBundle.sh support configurable maven repo mirror
JDK-8326113 java/security/cert/CertPathValidator/OCSP/OCSPTimeout.java incorrect comment information
JDK-8334914 Mark tests in jdk_security_infra group as manual
JDK-8332634 Problemlist serviceability/dcmd/gc/RunFinalizationTest.java on generic-all
JDK-8332168 Some jtreg tests failing on x86 with error 'unrecognized VM options' (C2 flags)
JDK-8332167 sun/security/mscapi/KeytoolChangeAlias.java fails with "Alias <246810> does not exist"
JDK-8327551 test tools/jpackage/linux/LinuxResourceTest.java fails on CentOS Linux release 8.5.2111 and Fedora 27

Sonia Zaldana Calles, Red Hat

Bug Summary
JDK-8330984 (fc) java/nio/channels/FileChannel/Size.java fails on partition incapable of creating large files
JDK-8328917 (zipfs) jdk/jdk/nio/zipfs/TestLocOffsetFromZip64EF.java failing with ZipException:R0 on OL9
JDK-8328916 (zipfs) Make test/jdk/jdk/nio/zipfs/TestLocOffsetFromZip64EF.java independent of the zip command line
JDK-8328918 Add a test to verify JMOD files created in the images do not have debug symbols
JDK-8328915 Add test cases for String.regionMatches comparing Turkic dotted/dotless I with uppercase latin I
JDK-8327244 Generate GIF images for AbstractButton/5049549/bug5049549.java
JDK-8327579 java/util/concurrent/tck/JSR166TestCase.java fails nanoTime test
JDK-8330958 Multiple ASAN errors reported for metaspace
JDK-8327855 NegativeArraySizeException decoding >1G UTF8 bytes with non-ascii characters
JDK-8328939 New test JmodExcludedFiles.java fails on Windows when --with-external-symbols-in-bundles=public is used
JDK-8327550 Open source few more swing text/html tests
JDK-8327549 Open source swing JMenu tests
JDK-8330955 Opensource JTextArea manual tests
JDK-8330956 Opensource SwingGraphics manual test
JDK-8330959 When running ASAN, disable dangerous NMT test

Vladimir Petko, Canonical

Bug Summary
JDK-8329604 (ch) Pipe channels should lazily set socket to non-blocking mode on first use by virtual thread
JDK-8333011 dpkg appears to have problems resolving symbolically linked native libraries

William Kemper, Amazon

Bug Summary
JDK-8328187 Shenandoah: Clarify gc state usage
JDK-8328108 Shenandoah: gc state should be synchronized to java threads only once per safepoint

Zhengyu Gu, Independent

Bug Summary
JDK-8331574 Parallel: Parallel GC throws OOM before heap is fully expanded
JDK-8331423 Parallel: Remove PSAdaptiveSizePolicy::should_full_GC