PUSHES REPORT: 21.0.5

This report shows who pushed the backports to the given release. This usually shows who did the backporting, testing, and review work.

Report generated: Sat Jun 15 21:18:50 CEST 2024

Distribution by priority

Count Priority
6 P2
39 P3
67 P4
4 P5

Distribution by components

Count Component
116 100% Total
65 56.0% hotspot
28 24.1% hotspot/compiler
16 13.8% hotspot/runtime
12 10.3% hotspot/gc
4 3.4% hotspot/jfr
4 3.4% hotspot/test
1 0.9% hotspot/svc
27 23.3% client-libs
16 13.8% client-libs/javax.swing
8 6.9% client-libs/java.awt
2 1.7% client-libs/2d
1 0.9% client-libs
10 8.6% core-libs
2 1.7% core-libs
2 1.7% core-libs/java.lang
1 0.9% core-libs/java.net
1 0.9% core-libs/java.util.concurrent
1 0.9% core-libs/java.lang.foreign
1 0.9% core-libs/java.io
1 0.9% core-libs/java.util.jar
1 0.9% core-libs/java.nio
4 3.4% infrastructure
2 1.7% infrastructure/build
1 0.9% infrastructure/release_eng
1 0.9% infrastructure
4 3.4% security-libs
2 1.7% security-libs/javax.crypto:pkcs11
2 1.7% security-libs/java.security
4 3.4% tools
1 0.9% tools/javac
1 0.9% tools/launcher
1 0.9% tools/jlink
1 0.9% tools
1 0.9% core-svc
1 0.9% core-svc/debugger
1 0.9% xml
1 0.9% xml/javax.xml.validation

Distribution by affiliation

This Release Pushes

Original Pushes

Count Committer
116 100% Total
76 65.5% SAP
46 39.7% Martin Doerr
17 14.7% Andrew Lu
9 7.8% Matthias Baesken
2 1.7% Christoph Langer
2 1.7% Richard Reingruber
26 22.4% Amazon
10 8.6% Sergey Bylokhov
7 6.0% Aleksey Shipilev
4 3.4% xlpeng
4 3.4% neethp
1 0.9% Roy Soumadipta
5 4.3% Unknown
5 4.3% syan
3 2.6% Alibaba
3 2.6% Liang Mao
2 1.7% BellSoft
2 1.7% Dmitry Chuyko
2 1.7% Red Hat
1 0.9% Martin Balao
1 0.9% Ashutosh Mehra
1 0.9% Independent
1 0.9% xlpeng2018
1 0.9% Oracle
1 0.9% Per-Ake Minborg
Count Committer
116 100% Total
72 62.1% Oracle
8 6.9% Alexey Ivanov
3 2.6% Emanuel Peter
3 2.6% Tejesh R
3 2.6% Prasanta Sadhukhan
3 2.6% Alisen Chung
2 1.7% Patricio Chilano Mateo
2 1.7% Brian Burkhalter
2 1.7% Ludvig Janiuk
2 1.7% David Holmes
2 1.7% Axel Boldt-Christmas
2 1.7% Vladimir Kozlov
2 1.7% Jaikiran Pai
2 1.7% Alexander Zvegintsev
2 1.7% Philip Race
2 1.7% Vladimir Ivanov
1 0.9% Harshitha Onkar
1 0.9% Markus Grönlund
1 0.9% Yudi Zheng
1 0.9% Tom Rodriguez
1 0.9% Alan Bateman
1 0.9% Calvin Cheung
1 0.9% Prajwal Kumaraswamy
1 0.9% Albert Yang
1 0.9% Damon Fenacci
1 0.9% Erik Gahlin
1 0.9% Jan Lahoda
1 0.9% Daniel Jelinski
1 0.9% Leonid Mesnik
1 0.9% Roberto Castaneda Lozano
1 0.9% Mikhailo Seledtsov
1 0.9% Joe Wang
1 0.9% Gerard Ziemski
1 0.9% Sean Coffey
1 0.9% Leo Korinth
1 0.9% Damon Nguyen
1 0.9% Weibing Xiao
1 0.9% Valerie Peng
1 0.9% Tobias Holenstein
1 0.9% Stefan Karlsson
1 0.9% Per-Ake Minborg
1 0.9% Kevin Walls
1 0.9% Tobias Hartmann
1 0.9% Adam Sotona
1 0.9% Abhishek Kumar
1 0.9% Christian Hagedorn
1 0.9% Thomas Schatzl
1 0.9% Viktor Klang
14 12.1% SAP
8 6.9% Matthias Baesken
2 1.7% Christoph Langer
2 1.7% Martin Doerr
2 1.7% Richard Reingruber
10 8.6% Amazon
4 3.4% Aleksey Shipilev
2 1.7% Sergey Bylokhov
1 0.9% Roy Soumadipta
1 0.9% neethp
1 0.9% Roman Kennke
1 0.9% Volker Simonis
6 5.2% Red Hat
4 3.4% Roland Westrelin
1 0.9% Martin Balao
1 0.9% Ashutosh Mehra
5 4.3% Unknown
3 2.6% syan
2 1.7% dlunden
2 1.7% ARM
1 0.9% Hao Sun
1 0.9% Fei Gao
1 0.9% @norlinder.nu
1 0.9% jonas
1 0.9% @users.sourceforge.net
1 0.9% rjolly
1 0.9% Alibaba
1 0.9% Yude Lin
1 0.9% BellSoft
1 0.9% Boris Ulasevich
1 0.9% DataDog
1 0.9% Jaroslav Bachorík
1 0.9% Google
1 0.9% Liam Miller-Cushon
1 0.9% Independent
1 0.9% Zhengyu Gu

Chronological push log:

UTC Time This Release Push By Original Push By Bug Summary
Name Affiliation Name Affiliation
2024/06/15 00:46 Sergey Bylokhov Amazon Tejesh R Oracle JDK-8334327 Convert javax/swing/border/Test4129681.java applet test to main
2024/06/14 16:23 Martin Doerr SAP Roland Westrelin Red Hat JDK-8334310 C2: crash when ConvL2I is split thru phi at LongCountedLoop
2024/06/14 16:22 Martin Doerr SAP dlunden Unknown JDK-8334309 BoxLockNode creation fails with assert(reg < CHUNK_SIZE) failed: sanity
2024/06/14 16:22 Martin Doerr SAP Damon Fenacci Oracle JDK-8334308 safepoint scalarization doesn't keep track of the depth of the JVM state
2024/06/14 16:21 Martin Doerr SAP Roland Westrelin Red Hat JDK-8334307 C2 compilation fails with assert(!x->as_Loop()->is_loop_nest_inner_loop()) failed: loop was transformed
2024/06/14 16:21 Martin Doerr SAP Roland Westrelin Red Hat JDK-8334306 C2: Partial peeling fails with assert "last_peel <- first_not_peeled"
2024/06/14 15:13 Martin Doerr SAP Roland Westrelin Red Hat JDK-8334302 C2 compilation fails with "Bad graph detected in build_loop_late" after JDK-8279888
2024/06/14 09:44 Liang Mao Alibaba David Holmes Oracle JDK-8334292 Crash: assert(*lastPtr != 0) failed: Mismatched JNINativeInterface tables, check for new entries
2024/06/13 13:17 Matthias Baesken SAP (same) (same) JDK-8334236 Problem list security/infra/java/security/cert/CertPathValidator/certification/CAInterop.java#teliasonerarootcav1
2024/06/13 12:02 Christoph Langer SAP (same) (same) JDK-8334224 Cleanups for KeepAliveCache tests
2024/06/13 10:53 Dmitry Chuyko BellSoft Yude Lin Alibaba JDK-8334219 AArch64: Increase itable stub size estimate
2024/06/13 09:49 Martin Doerr SAP Tobias Holenstein Oracle JDK-8334213 C2 EA fails with "missing memory path" when encountering unsafe_arraycopy stub call
2024/06/13 09:49 Martin Doerr SAP Vladimir Kozlov Oracle JDK-8334212 assert(m->is_entered(current)) failed: invariant
2024/06/13 09:49 Martin Doerr SAP Emanuel Peter Oracle JDK-8334211 C2 SuperWord: bad AD file, with RotateRightV and first operand not a pack
2024/06/13 09:48 Martin Doerr SAP Emanuel Peter Oracle JDK-8334210 C2 remove_main_post_loops: check if main-loop belongs to pre-loop, not just assert
2024/06/13 09:48 Martin Doerr SAP Vladimir Kozlov Oracle JDK-8334209 C2: prevent elimination of unbalanced coarsened locking regions
2024/06/13 09:48 Martin Doerr SAP Christian Hagedorn Oracle JDK-8334208 C2: CmpU3Nodes are not pushed back to worklist in PhaseCCP leading to non-fixpoint assertion failure
2024/06/13 09:48 Martin Doerr SAP Roberto Castaneda Lozano Oracle JDK-8334207 C2: ZGC fails with 'Incorrect load shift' when invoking Object.clone() reflectively on an array
2024/06/13 09:47 Martin Doerr SAP dlunden Unknown JDK-8334206 C2: guard check is not generated in Arrays.copyOfRange intrinsic when allocation is eliminated by EA
2024/06/13 09:47 Martin Doerr SAP Axel Boldt-Christmas Oracle JDK-8334205 DUIterator_Fast used before it is constructed
2024/06/12 19:43 Martin Doerr SAP Tobias Hartmann Oracle JDK-8334159 TailCall should not use frame pointer register for jump target
2024/06/12 19:41 Martin Doerr SAP Tom Rodriguez Oracle JDK-8334158 Race in CompileBroker::possibly_add_compiler_threads
2024/06/12 19:38 Martin Doerr SAP (same) (same) JDK-8334157 ubsan: vmreg.cpp checking error member call on misaligned address
2024/06/12 19:02 Martin Balao Red Hat (same) (same) JDK-8334148 AES-CTR vector intrinsic may read out of bounds (x86_64, AVX-512)
2024/06/12 16:34 xlpeng2018 Independent Fei Gao ARM JDK-8334141 C2: Sort spilling/unspilling sequence for better ld/st merging into ldp/stp on AArch64
2024/06/12 13:43 neethp Amazon (same) (same) JDK-8334133 Shenandoah: Check for disarmed method before taking the nmethod lock
2024/06/12 08:06 Dmitry Chuyko BellSoft Boris Ulasevich BellSoft JDK-8334103 AARCH64: Improve itable_stub
2024/06/12 08:05 Aleksey Shipilev Amazon Patricio Chilano Mateo Oracle JDK-8334101 Freeze/Thaw code can crash in the presence of OSR frames
2024/06/12 07:22 Andrew Lu SAP Alisen Chung Oracle JDK-8334092 java/awt/Focus/NonFocusableWindowTest/NonfocusableOwnerTest.java failed with "RuntimeException: Test failed."
2024/06/12 07:22 Andrew Lu SAP Alexander Zvegintsev Oracle JDK-8334090 Open source several add/remove MenuBar manual tests
2024/06/12 00:54 Sergey Bylokhov Amazon Alexey Ivanov Oracle JDK-8334054 Update ProblemList for JFileChooser/8194044/FileSystemRootTest.java
2024/06/11 23:08 Sergey Bylokhov Amazon Prasanta Sadhukhan Oracle JDK-8334049 Several Swing jtreg tests use class.forName on L&F classes
2024/06/11 09:50 Martin Doerr SAP (same) (same) JDK-8334004 unsafe.cpp:162:38: runtime error in index_oop_from_field_offset_long - applying non-zero offset 4563897424 to null pointer
2024/06/11 09:46 Roy Soumadipta Amazon (same) (same) JDK-8334003 Enable parallelism in vmTestbase/gc/gctests/LargeObjects tests
2024/06/11 08:25 Aleksey Shipilev Amazon Viktor Klang Oracle JDK-8333966 Memory leak in SynchronousQueue
2024/06/11 08:23 Matthias Baesken SAP (same) (same) JDK-8333965 ubsan ppc64le: c1_LIRGenerator_ppc.cpp:581:21: runtime error: signed integer overflow: 9223372036854775807 + 1 cannot be represented in type 'long int'
2024/06/11 08:20 Matthias Baesken SAP (same) (same) JDK-8333963 ubsan: vmError.cpp:2090:26: runtime error: division by zero
2024/06/10 16:13 syan Unknown (same) (same) JDK-8333918 Delete extra empty spaces in Makefiles
2024/06/10 11:04 Matthias Baesken SAP (same) (same) JDK-8333883 ubsan: growableArray.hpp:290:10: runtime error: null pointer passed as argument 1, which is declared to never be null
2024/06/10 11:04 Matthias Baesken SAP (same) (same) JDK-8333882 test/hotspot/jtreg/gc/testlibrary/Helpers.java compileClass javadoc does not match after 8321812
2024/06/10 11:03 Matthias Baesken SAP (same) (same) JDK-8333881 ubsan: instanceKlass.cpp:3550:76: runtime error: member call on null pointer of type 'struct Array'
2024/06/10 09:53 Matthias Baesken SAP (same) (same) JDK-8333878 ubsan: unix/native/libjava/ProcessImpl_md.c:562:5: runtime error: null pointer passed as argument 2, which is declared to never be null
2024/06/10 07:34 Aleksey Shipilev Amazon Hao Sun ARM JDK-8333869 AArch64: fix virtual threads with -XX:UseBranchProtection=pac-ret
2024/06/10 07:20 Richard Reingruber SAP (same) (same) JDK-8333866 [macosx-aarch64] Various tests fail with -XX:+AssertWXAtThreadSync
2024/06/07 08:50 Richard Reingruber SAP (same) (same) JDK-8333777 Race: Thread::interrupt vs. AbstractInterruptibleChannel.begin
2024/06/07 07:57 Sergey Bylokhov Amazon Adam Sotona Oracle JDK-8333773 jmod create --target-platform should replace existing ModuleTarget attribute
2024/06/06 19:21 xlpeng Amazon Erik Gahlin Oracle JDK-8333752 JFR: Avoid loading regex classes during startup
2024/06/06 11:22 Aleksey Shipilev Amazon Patricio Chilano Mateo Oracle JDK-8333715 fatal error: memory leak: allocating without ResourceMark
2024/06/06 08:23 Martin Doerr SAP Vladimir Ivanov Oracle JDK-8333695 C2: meet between unloaded and speculative types is not symmetric
2024/06/06 08:23 Martin Doerr SAP Alexey Ivanov Oracle JDK-8333694 HTMLReader uses ConvertAction instead of specified CharacterAction for , ,
2024/06/06 08:23 Martin Doerr SAP Alexey Ivanov Oracle JDK-8333693 text-decoration applied to lost when mixed with or
2024/06/06 08:13 syan Unknown (same) (same) JDK-8333691 Gtest codestrings.validate_vm fail on linux x64 when hsdis is present
2024/06/06 07:39 Matthias Baesken SAP (same) (same) JDK-8333686 ubsan: deoptimization.cpp:403:29: runtime error: load of value 208, which is not a valid value for type 'bool'
2024/06/05 08:34 Martin Doerr SAP Ludvig Janiuk Oracle JDK-8333626 Clarify failure_handler self-tests
2024/06/05 07:32 Andrew Lu SAP Alexey Ivanov Oracle JDK-8333613 Support JSplitPane for instructions and test UI
2024/06/05 07:30 Andrew Lu SAP Tejesh R Oracle JDK-8333612 Open source several Swing SplitPane and RadioButton related tests
2024/06/04 16:48 neethp Amazon Stefan Karlsson Oracle JDK-8333555 JFR ZGC Allocation Stall events should record stack traces
2024/06/04 16:41 neethp Amazon Joe Wang Oracle JDK-8333551 Lock contention in SchemaDVFactory.getInstance()
2024/06/04 16:38 neethp Amazon Jaroslav Bachorík DataDog JDK-8333550 Restricted access to `/proc` can cause JFR initialization to crash
2024/06/04 16:27 Martin Doerr SAP Vladimir Ivanov Oracle JDK-8333549 C2: Unloaded signature class kills argument value
2024/06/04 16:26 Martin Doerr SAP Ludvig Janiuk Oracle JDK-8333548 failure_handler: log directory of commands
2024/06/04 16:23 Martin Doerr SAP Alexey Ivanov Oracle JDK-8333547 tag doesn't strikethrough the text
2024/06/04 07:54 Andrew Lu SAP Leonid Mesnik Oracle JDK-8333483 Remove unused nativeUtils files
2024/06/04 07:54 Andrew Lu SAP Philip Race Oracle JDK-8333482 Delete test java/awt/Window/FindOwner/FindOwner.html
2024/06/04 07:54 Andrew Lu SAP Philip Race Oracle JDK-8333481 test java/awt/Robot/ManualInstructions/ManualInstructions.java isn't used
2024/06/04 07:35 Aleksey Shipilev Amazon Zhengyu Gu Independent JDK-8333476 Promptly free OopMapEntry after fail to insert the entry to OopMapCache
2024/06/04 07:24 Matthias Baesken SAP Prasanta Sadhukhan Oracle JDK-8333475 NullPointerException in JTable of SwingSet2
2024/06/04 06:45 Andrew Lu SAP Alan Bateman Oracle JDK-8333474 Test java/lang/Thread/virtual/Reflection.java timed out
2024/06/04 06:44 Andrew Lu SAP Damon Nguyen Oracle JDK-8333473 Open source several Swing JTabbedPane JTextArea JTextField tests
2024/06/04 06:43 Andrew Lu SAP Mikhailo Seledtsov Oracle JDK-8333472 problemlist tests failing on latest Windows 11 update
2024/06/04 02:10 Andrew Lu SAP Calvin Cheung Oracle JDK-8333465 Exclude some CDS tests from running with -Xshare:off
2024/06/04 02:10 Andrew Lu SAP Sean Coffey Oracle JDK-8333464 Reduce verbose locale output in -XshowSettings launcher option
2024/06/04 02:08 Andrew Lu SAP Emanuel Peter Oracle JDK-8333463 C2 SuperWord: remove AlignVector restrictions on IR tests added in JDK-8305055
2024/06/04 00:17 Sergey Bylokhov Amazon Thomas Schatzl Oracle JDK-8333461 JavadocHelperTest.java OOMEs with Parallel GC and ZGC
2024/06/03 10:39 Liang Mao Alibaba Albert Yang Oracle JDK-8333429 YoungPLABSize and OldPLABSize not aligned by ObjectAlignmentInBytes
2024/06/03 09:35 Martin Doerr SAP Valerie Peng Oracle JDK-8333426 IOException: Symbol not found: C_GetInterface for PKCS11 interface prior to V3.0
2024/06/03 09:15 Martin Doerr SAP Prajwal Kumaraswamy Oracle JDK-8333425 Better pkcs11 performance for libpkcs11:C_EncryptInit/libpkcs11:C_DecryptInit
2024/06/03 09:13 Martin Doerr SAP Kevin Walls Oracle JDK-8333424 SIGSEGV in JavaThread::is_lock_owned
2024/06/03 09:09 Martin Doerr SAP Weibing Xiao Oracle JDK-8333423 nroff man page update for jar tool
2024/06/03 09:09 Martin Doerr SAP Brian Burkhalter Oracle JDK-8333422 ByteArrayOutputStream.writeTo(OutputStream) pins carrier
2024/06/03 09:09 Martin Doerr SAP Alisen Chung Oracle JDK-8333421 Update GIFlib to 5.2.2
2024/06/03 09:06 Martin Doerr SAP Gerard Ziemski Oracle JDK-8333420 [REDO] - [IMPROVE] OPEN_MAX is no longer the max limit on macOS >= 10.6 for RLIMIT_NOFILE
2024/06/03 09:06 Martin Doerr SAP Alexey Ivanov Oracle JDK-8333419 Win32ShellFolder2.compareTo is inconsistent
2024/06/03 09:05 Martin Doerr SAP Harshitha Onkar Oracle JDK-8333418 Update Libpng to 1.6.43
2024/06/03 09:05 Martin Doerr SAP rjolly @users.sourceforge.net JDK-8333417 JEditorPane.read throws ChangedCharSetException
2024/06/03 09:02 Martin Doerr SAP Alexey Ivanov Oracle JDK-8333416 BasicDirectoryModel getDirectories and DoChangeContents.run can deadlock
2024/06/03 09:02 Martin Doerr SAP Alexey Ivanov Oracle JDK-8333415 Race in BasicDirectoryModel.validateFileCache
2024/06/03 09:02 Martin Doerr SAP Brian Burkhalter Oracle JDK-8333414 (fc) FileChannel.transferTo throws IOException when position equals size
2024/06/03 09:02 Martin Doerr SAP Volker Simonis Amazon JDK-8333413 No native wrappers generated anymore with -XX:-TieredCompilation after JDK-8251462
2024/06/03 08:16 xlpeng Amazon Aleksey Shipilev Amazon JDK-8333409 Reconsider TLAB zapping
2024/06/03 08:16 xlpeng Amazon Aleksey Shipilev Amazon JDK-8333408 ZGC: Remove OopMapCacheAlloc_lock ordering workaround
2024/06/03 05:23 Andrew Lu SAP Prasanta Sadhukhan Oracle JDK-8333402 Problemlist ActionListenerCalledTwiceTest.java test failing in macos14
2024/06/02 01:45 Sergey Bylokhov Amazon Leo Korinth Oracle JDK-8333385 Revert properties: vm.opt.x.*
2024/06/01 08:49 Martin Doerr SAP Alexander Zvegintsev Oracle JDK-8333381 getBounds API returns wrong value resulting in multiple Regression Test Failures on Ubuntu 23.04
2024/06/01 02:51 Sergey Bylokhov Amazon Abhishek Kumar Oracle JDK-8333380 JComboBox/DisabledComboBoxFontTestAuto: Enabled and disabled ComboBox does not match in these LAFs: GTK+
2024/05/31 17:02 Per-Ake Minborg Oracle (same) (same) JDK-8333367 AbstractMemorySegmentImpl#mismatch returns -1 when comparing distinct areas of the same instance of MemorySegment
2024/05/31 09:03 Martin Doerr SAP Jaikiran Pai Oracle JDK-8333339 JDWP process management needs more efficient file descriptor handling
2024/05/31 09:03 Martin Doerr SAP Tejesh R Oracle JDK-8333338 A few client tests intermittently throw ConcurrentModificationException
2024/05/31 09:02 Martin Doerr SAP Axel Boldt-Christmas Oracle JDK-8333337 Avoid inflating monitors when installing hash codes for LM_LIGHTWEIGHT
2024/05/31 09:02 Martin Doerr SAP Markus Grönlund Oracle JDK-8333336 Write and clear stack trace table outside of safepoint
2024/05/31 09:02 Martin Doerr SAP Jan Lahoda Oracle JDK-8333335 Crash involving yield, switch and anonymous classes
2024/05/31 08:18 Aleksey Shipilev Amazon (same) (same) JDK-8333330 Rename CollectedHeap::is_gc_active to be explicitly about STW GCs
2024/05/31 08:16 syan Unknown (same) (same) JDK-8333329 createJMHBundle.sh download jars fail when url needed to be redirected
2024/05/30 19:26 xlpeng Amazon Roman Kennke Amazon JDK-8333305 Shenandoah: Avoid forwarding when objects don't move in full-GC
2024/05/30 02:00 Andrew Lu SAP David Holmes Oracle JDK-8333240 vmTestbase/gc/gctests/LargeObjects/large003/TestDescription.java timed out
2024/05/30 01:59 Andrew Lu SAP Alisen Chung Oracle JDK-8333239 [macos] java/awt/Window/Grab/GrabTest.java: Press on the outside area didn't cause ungrab
2024/05/30 01:59 Andrew Lu SAP Yudi Zheng Oracle JDK-8333238 Skip ReplaceCriticalClassesForSubgraphs when EnableJVMCI is specified
2024/05/30 01:44 Sergey Bylokhov Amazon Liam Miller-Cushon Google JDK-8333237 Disabled tests in test/jdk/sun/java2d/marlin
2024/05/29 22:51 Sergey Bylokhov Amazon (same) (same) JDK-8333232 Test jdk/jfr/event/oldobject/TestSanityDefault.java times out for some heap sizes
2024/05/29 20:54 Sergey Bylokhov Amazon (same) (same) JDK-8333231 Create a test to verify that the cmm id is not ignored
2024/05/29 13:59 Ashutosh Mehra Red Hat (same) (same) JDK-8333186 Incorrect comment in zAddress_aarch64.cpp
2024/05/29 11:44 Aleksey Shipilev Amazon (same) (same) JDK-8333175 Make OopMapCache installation lock-free
2024/05/29 10:29 Liang Mao Alibaba jonas @norlinder.nu JDK-8333167 ZYoungCompactionLimit should have range check
2024/05/29 10:29 syan Unknown Daniel Jelinski Oracle JDK-8333165 [jmh] the test security.CacheBench failed for multiple threads run
2024/05/29 10:28 syan Unknown Jaikiran Pai Oracle JDK-8333164 JMH org.openjdk.bench.java.util.zip.InflaterInputStreams.inflaterInputStreamRead OOM
2024/05/29 08:10 Christoph Langer SAP (same) (same) JDK-8331266 Bump update version for OpenJDK: jdk-21.0.5

No changesets log

Committer push log

Andrew Lu, SAP

Bug Summary
JDK-8333239 [macos] java/awt/Window/Grab/GrabTest.java: Press on the outside area didn't cause ungrab
JDK-8333463 C2 SuperWord: remove AlignVector restrictions on IR tests added in JDK-8305055
JDK-8333482 Delete test java/awt/Window/FindOwner/FindOwner.html
JDK-8333465 Exclude some CDS tests from running with -Xshare:off
JDK-8334092 java/awt/Focus/NonFocusableWindowTest/NonfocusableOwnerTest.java failed with "RuntimeException: Test failed."
JDK-8334090 Open source several add/remove MenuBar manual tests
JDK-8333473 Open source several Swing JTabbedPane JTextArea JTextField tests
JDK-8333612 Open source several Swing SplitPane and RadioButton related tests
JDK-8333402 Problemlist ActionListenerCalledTwiceTest.java test failing in macos14
JDK-8333472 problemlist tests failing on latest Windows 11 update
JDK-8333464 Reduce verbose locale output in -XshowSettings launcher option
JDK-8333483 Remove unused nativeUtils files
JDK-8333238 Skip ReplaceCriticalClassesForSubgraphs when EnableJVMCI is specified
JDK-8333613 Support JSplitPane for instructions and test UI
JDK-8333481 test java/awt/Robot/ManualInstructions/ManualInstructions.java isn't used
JDK-8333474 Test java/lang/Thread/virtual/Reflection.java timed out
JDK-8333240 vmTestbase/gc/gctests/LargeObjects/large003/TestDescription.java timed out

Ashutosh Mehra, Red Hat

Bug Summary
JDK-8333186 Incorrect comment in zAddress_aarch64.cpp

Christoph Langer, SAP

Bug Summary
JDK-8331266 Bump update version for OpenJDK: jdk-21.0.5
JDK-8334224 Cleanups for KeepAliveCache tests

Dmitry Chuyko, BellSoft

Bug Summary
JDK-8334103 AARCH64: Improve itable_stub
JDK-8334219 AArch64: Increase itable stub size estimate

Liang Mao, Alibaba

Bug Summary
JDK-8334292 Crash: assert(*lastPtr != 0) failed: Mismatched JNINativeInterface tables, check for new entries
JDK-8333429 YoungPLABSize and OldPLABSize not aligned by ObjectAlignmentInBytes
JDK-8333167 ZYoungCompactionLimit should have range check

Matthias Baesken, SAP

Bug Summary
JDK-8333475 NullPointerException in JTable of SwingSet2
JDK-8334236 Problem list security/infra/java/security/cert/CertPathValidator/certification/CAInterop.java#teliasonerarootcav1
JDK-8333882 test/hotspot/jtreg/gc/testlibrary/Helpers.java compileClass javadoc does not match after 8321812
JDK-8333965 ubsan ppc64le: c1_LIRGenerator_ppc.cpp:581:21: runtime error: signed integer overflow: 9223372036854775807 + 1 cannot be represented in type 'long int'
JDK-8333686 ubsan: deoptimization.cpp:403:29: runtime error: load of value 208, which is not a valid value for type 'bool'
JDK-8333883 ubsan: growableArray.hpp:290:10: runtime error: null pointer passed as argument 1, which is declared to never be null
JDK-8333881 ubsan: instanceKlass.cpp:3550:76: runtime error: member call on null pointer of type 'struct Array'
JDK-8333878 ubsan: unix/native/libjava/ProcessImpl_md.c:562:5: runtime error: null pointer passed as argument 2, which is declared to never be null
JDK-8333963 ubsan: vmError.cpp:2090:26: runtime error: division by zero

Martin Balao, Red Hat

Bug Summary
JDK-8334148 AES-CTR vector intrinsic may read out of bounds (x86_64, AVX-512)

Martin Doerr, SAP

Bug Summary
JDK-8333414 (fc) FileChannel.transferTo throws IOException when position equals size
JDK-8333547 tag doesn't strikethrough the text
JDK-8333420 [REDO] - [IMPROVE] OPEN_MAX is no longer the max limit on macOS >= 10.6 for RLIMIT_NOFILE
JDK-8333338 A few client tests intermittently throw ConcurrentModificationException
JDK-8334212 assert(m->is_entered(current)) failed: invariant
JDK-8333337 Avoid inflating monitors when installing hash codes for LM_LIGHTWEIGHT
JDK-8333416 BasicDirectoryModel getDirectories and DoChangeContents.run can deadlock
JDK-8333425 Better pkcs11 performance for libpkcs11:C_EncryptInit/libpkcs11:C_DecryptInit
JDK-8334309 BoxLockNode creation fails with assert(reg < CHUNK_SIZE) failed: sanity
JDK-8333422 ByteArrayOutputStream.writeTo(OutputStream) pins carrier
JDK-8334302 C2 compilation fails with "Bad graph detected in build_loop_late" after JDK-8279888
JDK-8334307 C2 compilation fails with assert(!x->as_Loop()->is_loop_nest_inner_loop()) failed: loop was transformed
JDK-8334213 C2 EA fails with "missing memory path" when encountering unsafe_arraycopy stub call
JDK-8334210 C2 remove_main_post_loops: check if main-loop belongs to pre-loop, not just assert
JDK-8334211 C2 SuperWord: bad AD file, with RotateRightV and first operand not a pack
JDK-8334208 C2: CmpU3Nodes are not pushed back to worklist in PhaseCCP leading to non-fixpoint assertion failure
JDK-8334310 C2: crash when ConvL2I is split thru phi at LongCountedLoop
JDK-8334206 C2: guard check is not generated in Arrays.copyOfRange intrinsic when allocation is eliminated by EA
JDK-8333695 C2: meet between unloaded and speculative types is not symmetric
JDK-8334306 C2: Partial peeling fails with assert "last_peel <- first_not_peeled"
JDK-8334209 C2: prevent elimination of unbalanced coarsened locking regions
JDK-8333549 C2: Unloaded signature class kills argument value
JDK-8334207 C2: ZGC fails with 'Incorrect load shift' when invoking Object.clone() reflectively on an array
JDK-8333626 Clarify failure_handler self-tests
JDK-8333335 Crash involving yield, switch and anonymous classes
JDK-8334205 DUIterator_Fast used before it is constructed
JDK-8333548 failure_handler: log directory of commands
JDK-8333381 getBounds API returns wrong value resulting in multiple Regression Test Failures on Ubuntu 23.04
JDK-8333694 HTMLReader uses ConvertAction instead of specified CharacterAction for , ,
JDK-8333426 IOException: Symbol not found: C_GetInterface for PKCS11 interface prior to V3.0
JDK-8333339 JDWP process management needs more efficient file descriptor handling
JDK-8333417 JEditorPane.read throws ChangedCharSetException
JDK-8333413 No native wrappers generated anymore with -XX:-TieredCompilation after JDK-8251462
JDK-8333423 nroff man page update for jar tool
JDK-8333415 Race in BasicDirectoryModel.validateFileCache
JDK-8334158 Race in CompileBroker::possibly_add_compiler_threads
JDK-8334308 safepoint scalarization doesn't keep track of the depth of the JVM state
JDK-8333424 SIGSEGV in JavaThread::is_lock_owned
JDK-8334159 TailCall should not use frame pointer register for jump target
JDK-8333693 text-decoration applied to lost when mixed with or
JDK-8334157 ubsan: vmreg.cpp checking error member call on misaligned address
JDK-8334004 unsafe.cpp:162:38: runtime error in index_oop_from_field_offset_long - applying non-zero offset 4563897424 to null pointer
JDK-8333421 Update GIFlib to 5.2.2
JDK-8333418 Update Libpng to 1.6.43
JDK-8333419 Win32ShellFolder2.compareTo is inconsistent
JDK-8333336 Write and clear stack trace table outside of safepoint

neethp, Amazon

Bug Summary
JDK-8333555 JFR ZGC Allocation Stall events should record stack traces
JDK-8333551 Lock contention in SchemaDVFactory.getInstance()
JDK-8333550 Restricted access to `/proc` can cause JFR initialization to crash
JDK-8334133 Shenandoah: Check for disarmed method before taking the nmethod lock

Per-Ake Minborg, Oracle

Bug Summary
JDK-8333367 AbstractMemorySegmentImpl#mismatch returns -1 when comparing distinct areas of the same instance of MemorySegment

Roy Soumadipta, Amazon

Bug Summary
JDK-8334003 Enable parallelism in vmTestbase/gc/gctests/LargeObjects tests

Richard Reingruber, SAP

Bug Summary
JDK-8333866 [macosx-aarch64] Various tests fail with -XX:+AssertWXAtThreadSync
JDK-8333777 Race: Thread::interrupt vs. AbstractInterruptibleChannel.begin

Sergey Bylokhov, Amazon

Bug Summary
JDK-8334327 Convert javax/swing/border/Test4129681.java applet test to main
JDK-8333231 Create a test to verify that the cmm id is not ignored
JDK-8333237 Disabled tests in test/jdk/sun/java2d/marlin
JDK-8333461 JavadocHelperTest.java OOMEs with Parallel GC and ZGC
JDK-8333380 JComboBox/DisabledComboBoxFontTestAuto: Enabled and disabled ComboBox does not match in these LAFs: GTK+
JDK-8333773 jmod create --target-platform should replace existing ModuleTarget attribute
JDK-8333385 Revert properties: vm.opt.x.*
JDK-8334049 Several Swing jtreg tests use class.forName on L&F classes
JDK-8333232 Test jdk/jfr/event/oldobject/TestSanityDefault.java times out for some heap sizes
JDK-8334054 Update ProblemList for JFileChooser/8194044/FileSystemRootTest.java

Aleksey Shipilev, Amazon

Bug Summary
JDK-8333869 AArch64: fix virtual threads with -XX:UseBranchProtection=pac-ret
JDK-8333715 fatal error: memory leak: allocating without ResourceMark
JDK-8334101 Freeze/Thaw code can crash in the presence of OSR frames
JDK-8333175 Make OopMapCache installation lock-free
JDK-8333966 Memory leak in SynchronousQueue
JDK-8333476 Promptly free OopMapEntry after fail to insert the entry to OopMapCache
JDK-8333330 Rename CollectedHeap::is_gc_active to be explicitly about STW GCs

syan, Unknown

Bug Summary
JDK-8333165 [jmh] the test security.CacheBench failed for multiple threads run
JDK-8333329 createJMHBundle.sh download jars fail when url needed to be redirected
JDK-8333918 Delete extra empty spaces in Makefiles
JDK-8333691 Gtest codestrings.validate_vm fail on linux x64 when hsdis is present
JDK-8333164 JMH org.openjdk.bench.java.util.zip.InflaterInputStreams.inflaterInputStreamRead OOM

xlpeng2018, Independent

Bug Summary
JDK-8334141 C2: Sort spilling/unspilling sequence for better ld/st merging into ldp/stp on AArch64

xlpeng, Amazon

Bug Summary
JDK-8333752 JFR: Avoid loading regex classes during startup
JDK-8333409 Reconsider TLAB zapping
JDK-8333305 Shenandoah: Avoid forwarding when objects don't move in full-GC
JDK-8333408 ZGC: Remove OopMapCacheAlloc_lock ordering workaround