UTC Time |
Priority |
Component |
Bug |
Summary |
This Release Push By |
Original Push By |
|
|
|
|
|
Name |
Affiliation |
Name |
Affiliation |
2025/04/02 10:09 |
P3 |
client-libs/java.awt |
JDK-8353540 |
Update Libpng to 1.6.47 |
Goetz Lindenmaier |
SAP |
Harshitha Onkar |
Oracle |
2025/04/02 10:04 |
P3 |
client-libs/2d |
JDK-8353538 |
Update HarfBuzz to 10.4.0 |
Goetz Lindenmaier |
SAP |
Harshitha Onkar |
Oracle |
2025/04/02 10:02 |
P4 |
hotspot/runtime |
JDK-8353536 |
More reliable OOM handling in ExceptionDuringDumpAtObjectsInitPhase test |
Goetz Lindenmaier |
SAP |
Aleksey Shipilev |
Amazon |
2025/04/02 10:00 |
P4 |
client-libs/java.awt |
JDK-8353535 |
Open source several AWT PopupMenu tests |
Goetz Lindenmaier |
SAP |
Abhishek Kumar |
Oracle |
2025/04/02 09:58 |
P4 |
client-libs/2d |
JDK-8353534 |
Open source several Java2D rendering loop tests. |
Goetz Lindenmaier |
SAP |
Philip Race |
Oracle |
2025/04/02 09:54 |
P4 |
client-libs/java.awt |
JDK-8353528 |
Opensource few AWT image tests |
Goetz Lindenmaier |
SAP |
Prasanta Sadhukhan |
Oracle |
2025/04/02 09:52 |
P4 |
client-libs/java.awt |
JDK-8353525 |
Open source several AWT focus tests - series 3 |
Goetz Lindenmaier |
SAP |
Prasanta Sadhukhan |
Oracle |
2025/04/02 09:50 |
P4 |
client-libs/java.awt |
JDK-8353524 |
Opensource few AWT PopupMenu tests |
Goetz Lindenmaier |
SAP |
Prasanta Sadhukhan |
Oracle |
2025/04/02 09:49 |
P3 |
hotspot/runtime |
JDK-8353522 |
Make os::Linux::active_processor_count() public |
Goetz Lindenmaier |
SAP |
Severin Gehwolf |
Red Hat |
2025/04/02 09:47 |
P4 |
client-libs/javax.swing |
JDK-8353520 |
Convert and Opensource few JFileChooser applet test to main |
Goetz Lindenmaier |
SAP |
Abhishek Kumar |
Oracle |
2025/04/02 09:46 |
P4 |
client-libs/javax.swing |
JDK-8353518 |
Open source several Swing HTMLEditorKit related tests |
Goetz Lindenmaier |
SAP |
Harshitha Onkar |
Oracle |
2025/03/31 18:42 |
P3 |
core-libs/java.lang |
JDK-8353301 |
Primitive caches must use boxed instances from the archive |
ssubramaniam |
Unknown |
Aleksey Shipilev |
Amazon |
2025/03/31 17:06 |
P4 |
hotspot/compiler |
JDK-8353292 |
Replaying compilation with null static final fields results in a crash |
ssubramaniam |
Unknown |
Roland Westrelin |
Red Hat |
2025/03/28 04:18 |
P3 |
client-libs/java.awt |
JDK-8353140 |
Desktop.browse method fails if earlier CoInitialize call as COINIT_MULTITHREADED |
Sergey Bylokhov |
Amazon |
(same) |
(same) |
2025/03/28 00:32 |
P4 |
hotspot/jfr |
JDK-8353128 |
JFR: Split JFRCheckpoint VM operation |
ssubramaniam |
Unknown |
Aleksey Shipilev |
Amazon |
2025/03/27 17:37 |
P3 |
hotspot/gc |
JDK-8353102 |
G1: NUMA migrations cause crashes in region allocation |
Thomas Stuefe |
Red Hat |
(same) |
(same) |
2025/03/27 16:30 |
P4 |
core-libs/java.net |
JDK-8353096 |
URLConnection.getLastModified() leaks file handles for jar:file and file: URLs |
costmuch |
Amazon |
jglick |
CloudBees |
2025/03/27 16:04 |
P4 |
security-libs/java.security |
JDK-8353086 |
Test sun/security/tools/jarsigner/ConciseJarsigner.java failed: unable to find valid certification path to requested target |
Goetz Lindenmaier |
SAP |
mikhail.yankelevich |
Oracle |
2025/03/27 16:02 |
P4 |
client-libs/java.awt |
JDK-8353082 |
Open source closed frame tests # 4 |
Goetz Lindenmaier |
SAP |
Alexander Zvegintsev |
Oracle |
2025/03/27 16:00 |
P4 |
client-libs/java.awt |
JDK-8353081 |
Open source some of the AWT Window tests |
Goetz Lindenmaier |
SAP |
Jayathirth D V |
Oracle |
2025/03/27 15:58 |
P4 |
client-libs/java.awt |
JDK-8353078 |
Open source couple more miscellaneous AWT tests |
Goetz Lindenmaier |
SAP |
Alexander Zuev |
Oracle |
2025/03/27 15:57 |
P4 |
client-libs/java.awt |
JDK-8353077 |
Open source several AWT focus tests - series 4 |
Goetz Lindenmaier |
SAP |
Prasanta Sadhukhan |
Oracle |
2025/03/27 15:55 |
P4 |
client-libs/java.awt |
JDK-8353076 |
Open source closed choice tests #1 |
Goetz Lindenmaier |
SAP |
Alexander Zvegintsev |
Oracle |
2025/03/27 15:54 |
P5 |
core-svc/debugger |
JDK-8353073 |
vmTestbase/nsk/jdb/stop_at/stop_at002/stop_at002.java failure goes undetected |
Goetz Lindenmaier |
SAP |
Chris Plummer |
Oracle |
2025/03/27 15:51 |
P4 |
client-libs/javax.swing |
JDK-8353072 |
Opensource five Swing component related regression tests |
Goetz Lindenmaier |
SAP |
Alexander Zuev |
Oracle |
2025/03/27 15:49 |
P4 |
client-libs/javax.swing |
JDK-8353071 |
Opensource five more random Swing tests |
Goetz Lindenmaier |
SAP |
Alexander Zuev |
Oracle |
2025/03/27 01:38 |
P4 |
performance/libraries |
JDK-8353018 |
Use -jvmArgsPrepend when running microbenchmarks in RunTests.gmk |
Sendao Yan |
Alibaba |
Claes Redestad |
Oracle |
2025/03/27 01:38 |
P4 |
performance/libraries |
JDK-8353017 |
Use jvmArgs consistently in microbenchmarks |
Sendao Yan |
Alibaba |
Claes Redestad |
Oracle |
2025/03/25 00:04 |
P4 |
hotspot/runtime |
JDK-8352772 |
OpenJDK fails to configure on linux aarch64 when CDS is disabled after JDK-8331942 |
ssubramaniam |
Unknown |
Vladimir Petko |
Canonical |
2025/03/25 00:03 |
P4 |
hotspot/jfr |
JDK-8352771 |
Crash: assert(h_array_list.not_null()) failed: invariant |
ssubramaniam |
Unknown |
Markus Grönlund |
Oracle |
2025/03/24 15:21 |
P4 |
tools/jar |
JDK-8352735 |
Clean up the code in sun.tools.jar.Main to properly close resources and use ZipFile during extract |
Martin Balao |
Red Hat |
Jaikiran Pai |
Oracle |
2025/03/24 03:45 |
P4 |
core-libs/java.lang |
JDK-8352658 |
[JMH] Cannot access class jdk.internal.vm.ContinuationScope |
Sendao Yan |
Alibaba |
(same) |
(same) |
2025/03/22 00:16 |
P4 |
core-libs/java.net |
JDK-8350610 |
HttpClient: improve HTTP/2 flow control checks |
Alexey Bakhtin |
Azul |
Daniel Fuchs |
Oracle |
2025/03/21 08:06 |
P4 |
core-libs/java.lang |
JDK-8352586 |
Some java/lang jtreg tests miss requires vm.hasJFR |
Matthias Baesken |
SAP |
(same) |
(same) |
2025/03/20 19:21 |
P4 |
security-libs/java.security |
JDK-8352548 |
Test sun/security/tools/jarsigner/TimestampCheck.java is failing |
Goetz Lindenmaier |
SAP |
Weijun Wang |
Oracle |
2025/03/20 19:20 |
P3 |
client-libs/2d |
JDK-8352544 |
Update LCMS to 2.17 |
Goetz Lindenmaier |
SAP |
Alisen Chung |
Oracle |
2025/03/20 19:18 |
P3 |
client-libs/java.awt |
JDK-8352543 |
[XWayland] No displayChanged event after setDisplayMode call |
Goetz Lindenmaier |
SAP |
Alexander Zvegintsev |
Oracle |
2025/03/20 19:15 |
P4 |
security-libs/javax.crypto |
JDK-8352540 |
Upgrade NSS binaries for interop tests |
Goetz Lindenmaier |
SAP |
Matthew Donovan |
Oracle |
2025/03/20 19:14 |
P4 |
client-libs |
JDK-8352539 |
Improve HTML instruction formatting in PassFailJFrame |
Goetz Lindenmaier |
SAP |
Alexey Ivanov |
Oracle |
2025/03/20 19:13 |
P4 |
client-libs |
JDK-8352538 |
Exception thrown before awaitAndCheck hangs PassFailJFrame |
Goetz Lindenmaier |
SAP |
Alexey Ivanov |
Oracle |
2025/03/20 19:11 |
P5 |
client-libs/javax.swing |
JDK-8352537 |
Use latch in AbstractButton/bug6298940.java instead of delay |
Goetz Lindenmaier |
SAP |
Alexey Ivanov |
Oracle |
2025/03/20 15:36 |
P3 |
hotspot/svc-agent |
JDK-8352526 |
Test serviceability/sa/ClhsdbCDSJstackPrintAll.java failed: ArrayIndexOutOfBoundsException |
Goetz Lindenmaier |
SAP |
Chris Plummer |
Oracle |
2025/03/20 15:36 |
P4 |
hotspot/svc-agent |
JDK-8352525 |
serviceability/sa/ClhsdbWhere.java fails AssertionFailure: Corrupted constant pool |
Goetz Lindenmaier |
SAP |
Chris Plummer |
Oracle |
2025/03/20 15:35 |
P4 |
core-svc/javax.management |
JDK-8352524 |
Adjust timeout in test javax/management/monitor/DerivedGaugeMonitorTest.java |
Goetz Lindenmaier |
SAP |
Kevin Walls |
Oracle |
2025/03/20 15:30 |
P4 |
hotspot/jvmti |
JDK-8352523 |
Enable debug logging for vmTestbase/nsk/jvmti/scenarios/sampling/SP05/sp05t003/TestDescription.java |
Goetz Lindenmaier |
SAP |
Alex Menkov |
Oracle |
2025/03/20 15:30 |
P4 |
client-libs/java.awt |
JDK-8352522 |
Open source few more AWT PopupMenu tests |
Goetz Lindenmaier |
SAP |
Abhishek Kumar |
Oracle |
2025/03/20 14:57 |
P4 |
client-libs/java.awt |
JDK-8352519 |
Open source more AWT window tests |
Goetz Lindenmaier |
SAP |
Jayathirth D V |
Oracle |
2025/03/20 14:56 |
P4 |
client-libs/java.awt |
JDK-8352518 |
Open source AWT FileDialog related tests |
Goetz Lindenmaier |
SAP |
Abhishek Kumar |
Oracle |
2025/03/20 14:54 |
P4 |
client-libs/java.awt |
JDK-8352517 |
Open source closed choice tests #3 |
Goetz Lindenmaier |
SAP |
Alexander Zvegintsev |
Oracle |
2025/03/20 14:53 |
P4 |
hotspot/runtime |
JDK-8352516 |
Update runtime/condy tests to be executed with VM flags |
Goetz Lindenmaier |
SAP |
Leonid Mesnik |
Oracle |
2025/03/20 14:52 |
P4 |
client-libs/javax.swing |
JDK-8352515 |
Open source several Swing PopupMenu related tests |
Goetz Lindenmaier |
SAP |
Tejesh R |
Oracle |
2025/03/20 14:14 |
P3 |
core-libs/java.net |
JDK-8352513 |
Incorrect handling of HTTP/2 GOAWAY frames in HttpClient |
Alexey Bakhtin |
Azul |
Jaikiran Pai |
Oracle |
2025/03/20 00:26 |
P4 |
core-libs |
JDK-8352438 |
[JMH] vector.IndexInRangeBenchmark failed with IndexOutOfBoundsException for size=1024 |
Sendao Yan |
Alibaba |
Vladimir Ivanov |
Intel |
2025/03/19 22:42 |
P3 |
hotspot/compiler |
JDK-8352436 |
[AArch64] C1: guarantee(val < (1ULL << nbits)) failed: Field too big for insn |
Dmitry Chuyko |
BellSoft |
Chad Rakoczy |
Amazon |
2025/03/19 22:06 |
P4 |
hotspot/compiler |
JDK-8350412 |
[21u] AArch64: Ambiguous frame layout leads to incorrect traces in JFR |
Dmitry Chuyko |
BellSoft |
(same) |
(same) |
2025/03/19 17:07 |
P4 |
core-libs/java.time |
JDK-8352996 |
(tz) zone.tab update missed in 2025a backport |
Andrew Hughes |
Red Hat |
(same) |
(same) |
2025/03/19 16:43 |
P4 |
core-libs/java.net |
JDK-8352425 |
HttpClient with StructuredTaskScope does not close when a task fails |
Alexey Bakhtin |
Azul |
Daniel Fuchs |
Oracle |
2025/03/18 16:15 |
P4 |
hotspot/runtime |
JDK-8352286 |
Give better error for ConcurrentHashTable corruption |
ssubramaniam |
Unknown |
Coleen Phillimore |
Oracle |
2025/03/18 16:13 |
P4 |
hotspot/compiler |
JDK-8352285 |
CTW: Attempt to preload all classes in constant pool |
ssubramaniam |
Unknown |
Aleksey Shipilev |
Amazon |
2025/03/18 16:02 |
P4 |
hotspot/gc |
JDK-8352283 |
Shenandoah: Improve handshake closure labels |
ssubramaniam |
Unknown |
Aleksey Shipilev |
Amazon |
2025/03/18 08:40 |
P4 |
client-libs |
JDK-8352240 |
Remove PassFailJFrame constructor with screenshots |
Goetz Lindenmaier |
SAP |
anass.baya |
Oracle |
2025/03/18 08:39 |
P4 |
core-libs/java.net |
JDK-8352238 |
test/jdk/java/net/httpclient/HttpsTunnelAuthTest.java fails intermittently |
Goetz Lindenmaier |
SAP |
Daniel Fuchs |
Oracle |
2025/03/18 08:37 |
P4 |
core-libs/java.nio |
JDK-8352234 |
(fs) Remove some extensions from java/nio/file/Files/probeContentType/Basic.java |
Goetz Lindenmaier |
SAP |
Brian Burkhalter |
Oracle |
2025/03/18 08:36 |
P4 |
client-libs/javax.swing |
JDK-8352233 |
JRadioButton/ButtonGroupFocusTest.java fails in CI on Linux |
Goetz Lindenmaier |
SAP |
Alexey Ivanov |
Oracle |
2025/03/18 08:34 |
P4 |
client-libs/java.awt |
JDK-8352232 |
Automate javax/print/attribute/PageRangesException.java |
Goetz Lindenmaier |
SAP |
Renjith Kannath Pariyangad |
Oracle |
2025/03/18 08:33 |
P4 |
hotspot/compiler |
JDK-8352230 |
CompileFramework: test library to conveniently compile java and jasm sources for fuzzing |
Goetz Lindenmaier |
SAP |
Emanuel Peter |
Oracle |
2025/03/18 08:30 |
P4 |
core-libs/java.net |
JDK-8352227 |
java/net/Socket/UdpSocket.java fails with "java.net.BindException: Address already in use" (macos-aarch64) |
Goetz Lindenmaier |
SAP |
Daniel Fuchs |
Oracle |
2025/03/18 08:29 |
P4 |
client-libs |
JDK-8352225 |
Open source some Desktop related tests |
Goetz Lindenmaier |
SAP |
Alexander Zuev |
Oracle |
2025/03/18 08:28 |
P4 |
client-libs/java.awt |
JDK-8352221 |
Open source few Component tests - Set1 |
Goetz Lindenmaier |
SAP |
Damon Nguyen |
Oracle |
2025/03/18 08:26 |
P4 |
core-libs/java.net |
JDK-8352220 |
assert fired in java/net/httpclient/DependentPromiseActionsTest (infrequent) |
Goetz Lindenmaier |
SAP |
Daniel Fuchs |
Oracle |
2025/03/17 22:59 |
P4 |
hotspot/compiler |
JDK-8352183 |
[x64] Fix useless padding |
ssubramaniam |
Unknown |
Vladimir Kozlov |
Oracle |
2025/03/17 17:24 |
P4 |
hotspot/runtime |
JDK-8352167 |
WB_IsFrameDeoptimized miss ResourceMark |
ssubramaniam |
Unknown |
Leonid Mesnik |
Oracle |
2025/03/17 08:24 |
P4 |
core-libs/java.util:i18n |
JDK-8352076 |
[21u] Problem list tests that fail in 21 and would be fixed by 8309622 |
Goetz Lindenmaier |
SAP |
(same) |
(same) |
2025/03/15 20:19 |
P4 |
client-libs/java.awt |
JDK-8352104 |
Open source several AWT Dialog tests - Batch 4 |
Goetz Lindenmaier |
SAP |
Tejesh R |
Oracle |
2025/03/15 20:18 |
P4 |
client-libs/java.awt |
JDK-8352103 |
Open source some Component/Panel/EventQueue tests - Set2 |
Goetz Lindenmaier |
SAP |
Damon Nguyen |
Oracle |
2025/03/14 12:41 |
P4 |
client-libs/java.awt |
JDK-8352051 |
Open source closed frame tests # 2 |
Goetz Lindenmaier |
SAP |
Alexander Zvegintsev |
Oracle |
2025/03/14 10:46 |
P4 |
client-libs/java.awt |
JDK-8352041 |
Open source DnD tests - Set5 |
Goetz Lindenmaier |
SAP |
Harshitha Onkar |
Oracle |
2025/03/14 10:36 |
P4 |
client-libs/java.awt |
JDK-8352036 |
Open source few Checkbox and Cursor tests - Set1 |
Goetz Lindenmaier |
SAP |
Damon Nguyen |
Oracle |
2025/03/14 10:35 |
P4 |
client-libs/java.awt |
JDK-8352035 |
Open source several AWT focus tests - series 5 |
Goetz Lindenmaier |
SAP |
Prasanta Sadhukhan |
Oracle |
2025/03/14 10:34 |
P4 |
client-libs/java.awt |
JDK-8352034 |
Open source closed choice tests #2 |
Goetz Lindenmaier |
SAP |
Alexander Zvegintsev |
Oracle |
2025/03/14 10:33 |
P4 |
client-libs/java.awt |
JDK-8352033 |
Open source AWT MenuItem related tests |
Goetz Lindenmaier |
SAP |
Abhishek Kumar |
Oracle |
2025/03/14 10:26 |
P4 |
client-libs/java.awt |
JDK-8352032 |
Open source several AWT focus tests - series 2 |
Goetz Lindenmaier |
SAP |
Prasanta Sadhukhan |
Oracle |
2025/03/14 10:25 |
P4 |
client-libs/java.awt |
JDK-8352031 |
Open source several AWT focus tests - series 1 |
Goetz Lindenmaier |
SAP |
Prasanta Sadhukhan |
Oracle |
2025/03/14 10:23 |
P4 |
client-libs/java.awt |
JDK-8352030 |
Convert and Open source few manual applet test to main based |
Goetz Lindenmaier |
SAP |
Tejesh R |
Oracle |
2025/03/14 10:22 |
P4 |
client-libs/javax.swing |
JDK-8352029 |
Remove applet usage from JFileChooser tests bug4150029 |
Goetz Lindenmaier |
SAP |
Alisen Chung |
Oracle |
2025/03/14 10:21 |
P4 |
client-libs/javax.swing |
JDK-8352028 |
Automate and open source few closed manual applet test |
Goetz Lindenmaier |
SAP |
Abhishek Kumar |
Oracle |
2025/03/14 10:20 |
P4 |
hotspot/runtime |
JDK-8352026 |
Replace NULL with nullptr in HotSpot gtests |
Goetz Lindenmaier |
SAP |
Coleen Phillimore |
Oracle |
2025/03/14 10:17 |
P4 |
client-libs/javax.swing |
JDK-8352025 |
Open source several Swing RootPane and Slider related tests |
Goetz Lindenmaier |
SAP |
Tejesh R |
Oracle |
2025/03/14 01:25 |
P4 |
core-libs/java.net |
JDK-8352000 |
java/net/ipv6tests/UdpTest.java fails with checkTime failed |
Sendao Yan |
Alibaba |
serhiy.sachkov |
Oracle |
2025/03/13 16:08 |
P3 |
security-libs/java.security |
JDK-8351960 |
Remove Baltimore root certificate expiring in May 2025 |
Severin Gehwolf |
Red Hat |
Rajan Halade |
Oracle |
2025/03/13 09:57 |
P3 |
hotspot/runtime |
JDK-8351924 |
serviceability/dcmd/vm/SystemMapTest.java and SystemDumpMapTest.java may fail after JDK-8326586 |
Andreas Steiner |
SAP |
Thomas Stuefe |
Red Hat |
2025/03/13 08:06 |
P4 |
hotspot/runtime |
JDK-8351920 |
Improve Speed of System.map |
Andreas Steiner |
SAP |
Thomas Stuefe |
Red Hat |
2025/03/13 01:34 |
P4 |
hotspot/gc |
JDK-8351899 |
Bug in jdk.jfr.event.gc.collection.TestSystemGC |
Sendao Yan |
Alibaba |
Robert Toyonaga |
Red Hat |
2025/03/12 17:17 |
P3 |
client-libs/2d |
JDK-8351879 |
print/Dialog/PaperSizeError.java fails with MediaSizeName is not A4: A4 |
Sergey Bylokhov |
Amazon |
164895822+GennadiyKrivoshein |
Independent |
2025/03/12 16:17 |
P4 |
hotspot/runtime |
JDK-8351872 |
Skip ValidateHazardPtrsClosure in non-debug builds |
ssubramaniam |
Unknown |
David Holmes |
Oracle |
2025/03/12 09:49 |
P4 |
hotspot/gc |
JDK-8351831 |
Move BufferNode from PtrQueue files to new files |
Goetz Lindenmaier |
SAP |
Kim Barrett |
Oracle |
2025/03/12 09:48 |
P4 |
client-libs/javax.swing |
JDK-8351830 |
Open source several Swing Scroll related tests |
Goetz Lindenmaier |
SAP |
Tejesh R |
Oracle |
2025/03/11 17:01 |
P4 |
hotspot/compiler |
JDK-8351684 |
"Total compile time" counter should include time spent in failing/bailout compiles |
ssubramaniam |
Unknown |
Aleksey Shipilev |
Amazon |
2025/03/11 09:12 |
P3 |
hotspot/runtime |
JDK-8351637 |
Out of bounds access on Linux aarch64 in os::print_register_info |
Matthias Baesken |
SAP |
(same) |
(same) |
2025/03/10 17:23 |
P4 |
hotspot/gc |
JDK-8351559 |
gc/stress/TestStressG1Uncommit.java gets OOM-killed |
ssubramaniam |
Unknown |
Aleksey Shipilev |
Amazon |
2025/03/10 16:57 |
P4 |
hotspot/runtime |
JDK-8351557 |
Add jcmd to print annotated process memory map |
Andreas Steiner |
SAP |
Thomas Stuefe |
Red Hat |
2025/03/10 14:38 |
P3 |
client-libs/2d |
JDK-8351538 |
Update FreeType to 2.13.3 |
Goetz Lindenmaier |
SAP |
Alisen Chung |
Oracle |
2025/03/10 14:26 |
P3 |
client-libs/javax.accessibility |
JDK-8351533 |
[Accessibility,macOS,Screen Magnifier]: JCheckbox unchecked state does not magnify but works for checked state |
Goetz Lindenmaier |
SAP |
Abhishek Kumar |
Oracle |
2025/03/10 14:26 |
P3 |
client-libs/javax.accessibility |
JDK-8351532 |
[Accessibility,macOS,VoiceOver] VoiceOver doesn't announce untick on toggling the checkbox with "space" key on macOS |
Goetz Lindenmaier |
SAP |
Abhishek Kumar |
Oracle |
2025/03/10 14:25 |
P4 |
client-libs/java.awt |
JDK-8351531 |
AIX build failure after upgrade pipewire to 1.3.81 |
Goetz Lindenmaier |
SAP |
Alexander Zvegintsev |
Oracle |
2025/03/10 14:21 |
P3 |
client-libs/java.awt |
JDK-8351528 |
Update PipeWire to 1.3.81 |
Goetz Lindenmaier |
SAP |
Alexander Zvegintsev |
Oracle |
2025/03/10 14:20 |
P4 |
client-libs/java.awt |
JDK-8351527 |
Update List/ItemEventTest/ItemEventTest.java |
Goetz Lindenmaier |
SAP |
Alexey Ivanov |
Oracle |
2025/03/10 14:18 |
P4 |
client-libs |
JDK-8351522 |
Open source several Choice related tests (part 2) |
Goetz Lindenmaier |
SAP |
Alexander Zuev |
Oracle |
2025/03/10 14:16 |
P4 |
client-libs/2d |
JDK-8351521 |
sun/awt/font/TestDevTransform.java fails with RuntimeException: Different rendering |
Goetz Lindenmaier |
SAP |
Philip Race |
Oracle |
2025/03/10 14:03 |
P3 |
security-libs/java.security |
JDK-8351512 |
Jarsigner should print a warning if an entry is removed |
Roman Marchenko |
Azul |
Weijun Wang |
Oracle |
2025/03/10 14:01 |
P4 |
client-libs |
JDK-8351511 |
Open Source several AWT/2D font and rendering tests |
Goetz Lindenmaier |
SAP |
Philip Race |
Oracle |
2025/03/10 14:00 |
P4 |
client-libs/javax.swing |
JDK-8351510 |
[macos] Menu or JPopupMenu not closed when main window is resized |
Goetz Lindenmaier |
SAP |
Prasanta Sadhukhan |
Oracle |
2025/03/10 13:58 |
P4 |
hotspot/runtime |
JDK-8351508 |
[Testbug] g-tests for cgroup leave files in /tmp on linux |
Goetz Lindenmaier |
SAP |
Arno Zeller |
SAP |
2025/03/10 13:56 |
P4 |
client-libs/2d |
JDK-8351507 |
ColorConvertOp - typo for non-ICC conversions needs one-line fix |
Goetz Lindenmaier |
SAP |
Renjith Kannath Pariyangad |
Oracle |
2025/03/10 13:54 |
P4 |
client-libs/javax.swing |
JDK-8351506 |
Open source several Swing CSS related tests |
Goetz Lindenmaier |
SAP |
Harshitha Onkar |
Oracle |
2025/03/06 17:29 |
P4 |
hotspot/runtime |
JDK-8351358 |
Corrupted timezone string in JVM crash log |
Dhamoder Nalla |
Microsoft |
(same) |
(same) |
2025/03/06 09:46 |
P3 |
hotspot/runtime |
JDK-8351341 |
Out-of-bounds array access in secondary_super_cache |
Andrew Haley |
Red Hat |
(same) |
(same) |
2025/03/06 09:46 |
P3 |
hotspot/compiler |
JDK-8351340 |
secondary_super_cache does not scale well |
Andrew Haley |
Red Hat |
(same) |
(same) |
2025/03/05 06:18 |
P4 |
security-libs/javax.crypto:pkcs11 |
JDK-8351239 |
Failure when creating non-CRT RSA private keys in SunPKCS11 |
ssarathi |
Unknown |
Martin Balao |
Red Hat |
2025/03/04 15:35 |
P4 |
hotspot/gc |
JDK-8351191 |
3 gc/epsilon tests ignore external vm options |
Sendao Yan |
Alibaba |
Ramkumar Sunderbabu |
Oracle |
2025/03/04 15:35 |
P4 |
core-libs/java.util:i18n |
JDK-8351190 |
[JMH] time.format.ZonedDateTimeFormatterBenchmark fails |
Sendao Yan |
Alibaba |
(same) |
(same) |
2025/03/03 10:05 |
P4 |
hotspot/jfr |
JDK-8351031 |
Problemlist jdk/jfr/event/oldobject/TestShenandoah.java after JDK-8279016 |
Aleksey Shipilev |
Amazon |
(same) |
(same) |
2025/03/03 10:05 |
P3 |
hotspot/jfr |
JDK-8351030 |
JFR Leak Profiler is broken with Shenandoah |
Aleksey Shipilev |
Amazon |
(same) |
(same) |
2025/03/03 08:53 |
P4 |
tools/jshell |
JDK-8351022 |
Test FailOverDirectExecutionControlTest.java fails with -Xcomp |
Sendao Yan |
Alibaba |
Jan Lahoda |
Oracle |
2025/02/28 12:46 |
P4 |
core-libs/java.lang.foreign |
JDK-8350950 |
ProgrammableUpcallHandler::on_entry/on_exit access thread fields from native |
Andrew Hughes |
Red Hat |
Jorn Vernee |
Oracle |
2025/02/28 12:46 |
P4 |
core-libs/java.lang.foreign |
JDK-8350949 |
UpcallLinker::on_entry racingly clears pending exception with GC safepoints |
Andrew Hughes |
Red Hat |
Jorn Vernee |
Oracle |
2025/02/28 12:46 |
P3 |
core-libs/java.lang.foreign |
JDK-8350948 |
UpcallLinker::on_exit races with GC when copying frame anchor |
Andrew Hughes |
Red Hat |
Jorn Vernee |
Oracle |
2025/02/27 13:32 |
P4 |
hotspot/jvmti |
JDK-8350862 |
Output JVMTI agent information in hserr files |
Matthias Baesken |
SAP |
(same) |
(same) |
2025/02/27 12:49 |
P3 |
hotspot/compiler |
JDK-8350856 |
[PPC64] Make intrinsic conversions between bit representations of half precision values and floats |
Martin Doerr |
SAP |
(same) |
(same) |
2025/02/26 08:14 |
P4 |
infrastructure/release_eng |
JDK-8350650 |
Bump update version for OpenJDK: jdk-21.0.8 |
Goetz Lindenmaier |
SAP |
(same) |
(same) |
Bug |
Summary |
JDK-8352234 |
(fs) Remove some extensions from java/nio/file/Files/probeContentType/Basic.java |
JDK-8352076 |
[21u] Problem list tests that fail in 21 and would be fixed by 8309622 |
JDK-8351533 |
[Accessibility,macOS,Screen Magnifier]: JCheckbox unchecked state does not magnify but works for checked state |
JDK-8351532 |
[Accessibility,macOS,VoiceOver] VoiceOver doesn't announce untick on toggling the checkbox with "space" key on macOS |
JDK-8351510 |
[macos] Menu or JPopupMenu not closed when main window is resized |
JDK-8351508 |
[Testbug] g-tests for cgroup leave files in /tmp on linux |
JDK-8352543 |
[XWayland] No displayChanged event after setDisplayMode call |
JDK-8352524 |
Adjust timeout in test javax/management/monitor/DerivedGaugeMonitorTest.java |
JDK-8351531 |
AIX build failure after upgrade pipewire to 1.3.81 |
JDK-8352220 |
assert fired in java/net/httpclient/DependentPromiseActionsTest (infrequent) |
JDK-8352028 |
Automate and open source few closed manual applet test |
JDK-8352232 |
Automate javax/print/attribute/PageRangesException.java |
JDK-8350650 |
Bump update version for OpenJDK: jdk-21.0.8 |
JDK-8351507 |
ColorConvertOp - typo for non-ICC conversions needs one-line fix |
JDK-8352230 |
CompileFramework: test library to conveniently compile java and jasm sources for fuzzing |
JDK-8352030 |
Convert and Open source few manual applet test to main based |
JDK-8353520 |
Convert and Opensource few JFileChooser applet test to main |
JDK-8352523 |
Enable debug logging for vmTestbase/nsk/jvmti/scenarios/sampling/SP05/sp05t003/TestDescription.java |
JDK-8352538 |
Exception thrown before awaitAndCheck hangs PassFailJFrame |
JDK-8352539 |
Improve HTML instruction formatting in PassFailJFrame |
JDK-8352227 |
java/net/Socket/UdpSocket.java fails with "java.net.BindException: Address already in use" (macos-aarch64) |
JDK-8352233 |
JRadioButton/ButtonGroupFocusTest.java fails in CI on Linux |
JDK-8353522 |
Make os::Linux::active_processor_count() public |
JDK-8353536 |
More reliable OOM handling in ExceptionDuringDumpAtObjectsInitPhase test |
JDK-8351831 |
Move BufferNode from PtrQueue files to new files |
JDK-8352518 |
Open source AWT FileDialog related tests |
JDK-8352033 |
Open source AWT MenuItem related tests |
JDK-8353076 |
Open source closed choice tests #1 |
JDK-8352034 |
Open source closed choice tests #2 |
JDK-8352517 |
Open source closed choice tests #3 |
JDK-8352051 |
Open source closed frame tests # 2 |
JDK-8353082 |
Open source closed frame tests # 4 |
JDK-8353078 |
Open source couple more miscellaneous AWT tests |
JDK-8352041 |
Open source DnD tests - Set5 |
JDK-8352036 |
Open source few Checkbox and Cursor tests - Set1 |
JDK-8352221 |
Open source few Component tests - Set1 |
JDK-8352522 |
Open source few more AWT PopupMenu tests |
JDK-8352519 |
Open source more AWT window tests |
JDK-8352104 |
Open source several AWT Dialog tests - Batch 4 |
JDK-8352031 |
Open source several AWT focus tests - series 1 |
JDK-8352032 |
Open source several AWT focus tests - series 2 |
JDK-8353525 |
Open source several AWT focus tests - series 3 |
JDK-8353077 |
Open source several AWT focus tests - series 4 |
JDK-8352035 |
Open source several AWT focus tests - series 5 |
JDK-8353535 |
Open source several AWT PopupMenu tests |
JDK-8351511 |
Open Source several AWT/2D font and rendering tests |
JDK-8351522 |
Open source several Choice related tests (part 2) |
JDK-8353534 |
Open source several Java2D rendering loop tests. |
JDK-8351506 |
Open source several Swing CSS related tests |
JDK-8353518 |
Open source several Swing HTMLEditorKit related tests |
JDK-8352515 |
Open source several Swing PopupMenu related tests |
JDK-8352025 |
Open source several Swing RootPane and Slider related tests |
JDK-8351830 |
Open source several Swing Scroll related tests |
JDK-8352103 |
Open source some Component/Panel/EventQueue tests - Set2 |
JDK-8352225 |
Open source some Desktop related tests |
JDK-8353081 |
Open source some of the AWT Window tests |
JDK-8353528 |
Opensource few AWT image tests |
JDK-8353524 |
Opensource few AWT PopupMenu tests |
JDK-8353071 |
Opensource five more random Swing tests |
JDK-8353072 |
Opensource five Swing component related regression tests |
JDK-8352029 |
Remove applet usage from JFileChooser tests bug4150029 |
JDK-8352240 |
Remove PassFailJFrame constructor with screenshots |
JDK-8352026 |
Replace NULL with nullptr in HotSpot gtests |
JDK-8352525 |
serviceability/sa/ClhsdbWhere.java fails AssertionFailure: Corrupted constant pool |
JDK-8351521 |
sun/awt/font/TestDevTransform.java fails with RuntimeException: Different rendering |
JDK-8352526 |
Test serviceability/sa/ClhsdbCDSJstackPrintAll.java failed: ArrayIndexOutOfBoundsException |
JDK-8353086 |
Test sun/security/tools/jarsigner/ConciseJarsigner.java failed: unable to find valid certification path to requested target |
JDK-8352548 |
Test sun/security/tools/jarsigner/TimestampCheck.java is failing |
JDK-8352238 |
test/jdk/java/net/httpclient/HttpsTunnelAuthTest.java fails intermittently |
JDK-8351538 |
Update FreeType to 2.13.3 |
JDK-8353538 |
Update HarfBuzz to 10.4.0 |
JDK-8352544 |
Update LCMS to 2.17 |
JDK-8353540 |
Update Libpng to 1.6.47 |
JDK-8351527 |
Update List/ItemEventTest/ItemEventTest.java |
JDK-8351528 |
Update PipeWire to 1.3.81 |
JDK-8352516 |
Update runtime/condy tests to be executed with VM flags |
JDK-8352540 |
Upgrade NSS binaries for interop tests |
JDK-8352537 |
Use latch in AbstractButton/bug6298940.java instead of delay |
JDK-8353073 |
vmTestbase/nsk/jdb/stop_at/stop_at002/stop_at002.java failure goes undetected |