PUSHES REPORT: 23

This report shows who pushed the backports to the given release. This usually shows who did the backporting, testing, and review work.

Report generated: Fri Mar 01 08:09:04 CET 2024

Distribution by priority

Count Priority
12 P1
50 P2
160 P3
653 P4
34 P5

Distribution by components

Count Component
909 100% Total
511 56.2% hotspot
158 17.4% hotspot/gc
156 17.2% hotspot/compiler
114 12.5% hotspot/runtime
28 3.1% hotspot/jfr
20 2.2% hotspot/jvmti
11 1.2% hotspot/svc
10 1.1% hotspot/test
8 0.9% hotspot
4 0.4% hotspot/svc-agent
2 0.2% hotspot/other
165 18.2% core-libs
26 2.9% core-libs/java.nio
20 2.2% core-libs/java.lang
18 2.0% core-libs/java.util.jar
16 1.8% core-libs
12 1.3% core-libs/java.lang.foreign
11 1.2% core-libs/java.io
8 0.9% core-libs/java.net
8 0.9% core-libs/java.text
7 0.8% core-libs/java.util:i18n
6 0.7% core-libs/java.util.concurrent
6 0.7% core-libs/javax.lang.model
5 0.6% core-libs/java.lang:reflect
5 0.6% core-libs/java.time
3 0.3% core-libs/java.io:serialization
3 0.3% core-libs/java.lang.classfile
2 0.2% core-libs/java.util
2 0.2% core-libs/java.lang.invoke
2 0.2% core-libs/java.util:collections
1 0.1% core-libs/java.sql
1 0.1% core-libs/javax.script
1 0.1% core-libs/java.util.logging
1 0.1% core-libs/java.math
1 0.1% core-libs/javax.naming
59 6.5% tools
25 2.8% tools/javac
17 1.9% tools/javadoc(tool)
5 0.6% tools/jlink
5 0.6% tools
3 0.3% tools/jshell
2 0.2% tools/jpackage
1 0.1% tools/jar
1 0.1% tools/launcher
58 6.4% client-libs
17 1.9% client-libs/2d
17 1.9% client-libs/java.awt
17 1.9% client-libs/javax.swing
3 0.3% client-libs
2 0.2% client-libs/javax.imageio
2 0.2% client-libs/javax.accessibility
53 5.8% infrastructure
52 5.7% infrastructure/build
1 0.1% infrastructure
30 3.3% security-libs
14 1.5% security-libs/java.security
4 0.4% security-libs/javax.net.ssl
4 0.4% security-libs/javax.crypto
3 0.3% security-libs/javax.crypto:pkcs11
3 0.3% security-libs
2 0.2% security-libs/org.ietf.jgss
23 2.5% core-svc
10 1.1% core-svc/debugger
4 0.4% core-svc/java.lang.management
3 0.3% core-svc/tools
3 0.3% core-svc/javax.management
2 0.2% core-svc/java.lang.instrument
1 0.1% core-svc
4 0.4% xml
2 0.2% xml/javax.xml.stream
1 0.1% xml/jaxp
1 0.1% xml
2 0.2% docs
1 0.1% docs/tools
1 0.1% docs/hotspot
2 0.2% globalization
2 0.2% globalization/translation
1 0.1% install
1 0.1% install/test
1 0.1% performance
1 0.1% performance/hotspot

Distribution by affiliation

This Release Pushes

Original Pushes

Count Committer
909 100% Total
613 67.4% Oracle
84 9.2% Albert Yang
32 3.5% Kim Barrett
28 3.1% Magnus Ihse Bursie
22 2.4% Joe Darcy
19 2.1% Emanuel Peter
16 1.8% Brian Burkhalter
15 1.7% Thomas Schatzl
15 1.7% Daniel Daugherty
14 1.5% Stefan Karlsson
13 1.4% Alan Bateman
13 1.4% David Holmes
11 1.2% Alex Menkov
10 1.1% Justin Lu
9 1.0% Calvin Cheung
9 1.0% Jan Lahoda
9 1.0% Chris Plummer
9 1.0% Claes Redestad
9 1.0% Naoto Sato
8 0.9% Markus Grönlund
8 0.9% Leonid Mesnik
8 0.9% Axel Boldt-Christmas
8 0.9% Jaikiran Pai
8 0.9% Per-Ake Minborg
7 0.8% Weijun Wang
7 0.8% Jorn Vernee
7 0.8% Erik Gahlin
7 0.8% Hannes Wallnoefer
7 0.8% Jonathan Gibbons
6 0.7% Douglas Simon
6 0.7% Tobias Hartmann
6 0.7% Christian Hagedorn
5 0.6% Harshitha Onkar
5 0.6% Tejesh R
5 0.6% Tobias Holenstein
5 0.6% Rajat Mahajan
5 0.6% Angelos Bimpoudis
5 0.6% Daniel Jelinski
5 0.6% Lance Andersen
5 0.6% Prasanta Sadhukhan
5 0.6% Matias Saavedra Silva
5 0.6% Alexey Ivanov
5 0.6% Vladimir Kozlov
5 0.6% Serguei Spitsyn
4 0.4% Patricio Chilano Mateo
4 0.4% Pavel Rappo
4 0.4% Roger Riggs
4 0.4% Kevin Walls
4 0.4% Adam Sotona
4 0.4% daniel.lunden
4 0.4% Fredrik Bredberg
4 0.4% Renjith Kannath Pariyangad
4 0.4% Coleen Phillimore
4 0.4% Afshin Zafari
4 0.4% Mandy Chung
4 0.4% Alisen Chung
4 0.4% Mikael Vidstedt
3 0.3% Joe Wang
3 0.3% Gerard Ziemski
3 0.3% Darragh Clarke
3 0.3% Anthony Scarpino
3 0.3% Matthew Donovan
3 0.3% Erik Österlund
3 0.3% Christian Stein
3 0.3% Ioi Lam
3 0.3% Johan Sjölen
3 0.3% Philip Race
3 0.3% Viktor Klang
2 0.2% Sean Coffey
2 0.2% ben.perez
2 0.2% Alexander Zuev
2 0.2% Raffaello Giulietti
2 0.2% Tom Rodriguez
2 0.2% johny.jose
2 0.2% Damon Fenacci
2 0.2% Alexey Semenyuk
2 0.2% Vicente Arturo Romero Zaldivar
2 0.2% Ivan Walulya
1 0.1% raphael.m.mosaner
1 0.1% Roberto Castaneda Lozano
1 0.1% Mark Powers
1 0.1% Stefan Johansson
1 0.1% Leo Korinth
1 0.1% anupam.dev
1 0.1% Jim Laskey
1 0.1% Alexander Zvegintsev
1 0.1% Abhishek Kumar
1 0.1% David Leopoldseder
1 0.1% Erik Joelsson
1 0.1% Paul Sandoz
1 0.1% Aleksandre Iline
1 0.1% Rajan Halade
1 0.1% Tim Prinzing
1 0.1% Sundararajan Athijegannathan
1 0.1% Weibing Xiao
1 0.1% Jamil Nimeh
76 8.4% Independent
19 2.1% Eirik Bjørsnøs
12 1.3% lizbing07734
8 0.9% Guoxiong Li
6 0.7% Gui Cao
3 0.3% Zhengyu Gu
3 0.3% Julian Waters
3 0.3% Chen Liang
2 0.2% Archie Cobbs
2 0.2% zhiqiang.zang
2 0.2% Sergey Tsypanov
1 0.1% zjx001202
1 0.1% Laurent Bourgès
1 0.1% korov9
1 0.1% stevenschlansker
1 0.1% Kangcheng Xu
1 0.1% vtsty.dev
1 0.1% 103394724+kurashige23
1 0.1% antbob
1 0.1% Artem Semenov
1 0.1% Quan Anh Mai
1 0.1% Markus Karg
1 0.1% thihup
1 0.1% Yuri Gaevsky
1 0.1% Chris Hegarty
1 0.1% ckozak
1 0.1% Ilya Gavrilin
62 6.8% Amazon
15 1.7% Aleksey Shipilev
14 1.5% William Kemper
11 1.2% Joshua Cao
7 0.8% Sergey Bylokhov
3 0.3% Roman Kennke
2 0.2% Yi-Fan Tsai
2 0.2% Oli Gillespie
2 0.2% Evgeny Astigeevich
2 0.2% Xin Liu
1 0.1% Dan Lutker
1 0.1% Elif Aslan
1 0.1% Y. Ramakrishna
1 0.1% Volker Simonis
41 4.5% SAP
25 2.8% Matthias Baesken
4 0.4% Christoph Langer
4 0.4% Martin Doerr
3 0.3% Richard Reingruber
2 0.2% Goetz Lindenmaier
2 0.2% Joachim Kern
1 0.1% Johannes Bechberger
25 2.8% Alibaba
15 1.7% Denghui Dong
2 0.2% Wang Zhuo
2 0.2% kuaiwei.kw
1 0.1% yansendao.ysd
1 0.1% Yi Yang
1 0.1% Shaojin Wen
1 0.1% Yude Lin
1 0.1% xingqizheng.xqz
1 0.1% yifeng.jyf
20 2.2% Red Hat
5 0.6% Thomas Stuefe
3 0.3% Andrew Leonard
3 0.3% Roland Westrelin
2 0.2% Sonia Zaldana Calles
2 0.2% Frederic Thevenet
2 0.2% Zdenek Zambersky
1 0.1% Robert Toyonaga
1 0.1% Martin Balao
1 0.1% Jiří Vaněk
10 1.1% Huawei
10 1.1% Hamlin Li
8 0.9% Unknown
4 0.4% syan
3 0.3% dlunden
1 0.1% sroy
7 0.8% IBM
3 0.3% Amit Kumar
3 0.3% Varada M
1 0.1% psoujany
7 0.8% Tencent
4 0.4% John Jiang
2 0.2% Jie Fu
1 0.1% Peng Xie
6 0.7% Rivos
4 0.4% Robbin Ehn
2 0.2% Ludovic Henry
5 0.6% Google
2 0.2% Jiangli Zhou
2 0.2% Liam Miller-Cushon
1 0.1% Eamonn McManus
5 0.6% Intel
2 0.2% Jatin Bhateja
1 0.1% Scott Gibbons
1 0.1% Sandhya Viswanathan
1 0.1% Srinivas Parasa
4 0.4% Azul
2 0.2% Jan Kratochvil
1 0.1% Dmitry Cherepanov
1 0.1% Olga Mikhaltcova
4 0.4% BellSoft
2 0.2% Aleksei Voitylov
1 0.1% Alexandr Scherbatiy
1 0.1% Boris Ulasevich
4 0.4% Microsoft
3 0.3% Cesar Soares
1 0.1% George Adams
2 0.2% @gentoo.org
2 0.2% sam
2 0.2% ARM
2 0.2% Bhavana Kilambi
2 0.2% Ampere
1 0.1% Patrick Zhang
1 0.1% limingliu
1 0.1% @geomatys.com
1 0.1% martin.desruisseaux
1 0.1% @hibox.tv
1 0.1% sebastian.lovdahl
1 0.1% @imt-soft.com
1 0.1% songpv
1 0.1% Canonical
1 0.1% Vladimir Petko
1 0.1% Loongson
1 0.1% Sun Yaqi
1 0.1% NTT DATA
1 0.1% Koichi Sakata
Count Committer
909 100% Total
613 67.4% Oracle
84 9.2% Albert Yang
32 3.5% Kim Barrett
28 3.1% Magnus Ihse Bursie
22 2.4% Joe Darcy
19 2.1% Emanuel Peter
16 1.8% Brian Burkhalter
15 1.7% Thomas Schatzl
15 1.7% Daniel Daugherty
14 1.5% Stefan Karlsson
13 1.4% Alan Bateman
13 1.4% David Holmes
11 1.2% Alex Menkov
10 1.1% Justin Lu
9 1.0% Calvin Cheung
9 1.0% Jan Lahoda
9 1.0% Chris Plummer
9 1.0% Claes Redestad
9 1.0% Naoto Sato
8 0.9% Markus Grönlund
8 0.9% Leonid Mesnik
8 0.9% Axel Boldt-Christmas
8 0.9% Jaikiran Pai
8 0.9% Per-Ake Minborg
7 0.8% Weijun Wang
7 0.8% Jorn Vernee
7 0.8% Erik Gahlin
7 0.8% Hannes Wallnoefer
7 0.8% Jonathan Gibbons
6 0.7% Douglas Simon
6 0.7% Tobias Hartmann
6 0.7% Christian Hagedorn
5 0.6% Harshitha Onkar
5 0.6% Tejesh R
5 0.6% Tobias Holenstein
5 0.6% Rajat Mahajan
5 0.6% Angelos Bimpoudis
5 0.6% Daniel Jelinski
5 0.6% Lance Andersen
5 0.6% Prasanta Sadhukhan
5 0.6% Matias Saavedra Silva
5 0.6% Alexey Ivanov
5 0.6% Vladimir Kozlov
5 0.6% Serguei Spitsyn
4 0.4% Patricio Chilano Mateo
4 0.4% Pavel Rappo
4 0.4% Roger Riggs
4 0.4% Kevin Walls
4 0.4% Adam Sotona
4 0.4% daniel.lunden
4 0.4% Fredrik Bredberg
4 0.4% Renjith Kannath Pariyangad
4 0.4% Coleen Phillimore
4 0.4% Afshin Zafari
4 0.4% Mandy Chung
4 0.4% Alisen Chung
4 0.4% Mikael Vidstedt
3 0.3% Joe Wang
3 0.3% Gerard Ziemski
3 0.3% Darragh Clarke
3 0.3% Anthony Scarpino
3 0.3% Matthew Donovan
3 0.3% Erik Österlund
3 0.3% Christian Stein
3 0.3% Ioi Lam
3 0.3% Johan Sjölen
3 0.3% Philip Race
3 0.3% Viktor Klang
2 0.2% Sean Coffey
2 0.2% ben.perez
2 0.2% Alexander Zuev
2 0.2% Raffaello Giulietti
2 0.2% Tom Rodriguez
2 0.2% johny.jose
2 0.2% Damon Fenacci
2 0.2% Alexey Semenyuk
2 0.2% Vicente Arturo Romero Zaldivar
2 0.2% Ivan Walulya
1 0.1% raphael.m.mosaner
1 0.1% Roberto Castaneda Lozano
1 0.1% Mark Powers
1 0.1% Stefan Johansson
1 0.1% Leo Korinth
1 0.1% anupam.dev
1 0.1% Jim Laskey
1 0.1% Alexander Zvegintsev
1 0.1% Abhishek Kumar
1 0.1% David Leopoldseder
1 0.1% Erik Joelsson
1 0.1% Paul Sandoz
1 0.1% Aleksandre Iline
1 0.1% Rajan Halade
1 0.1% Tim Prinzing
1 0.1% Sundararajan Athijegannathan
1 0.1% Weibing Xiao
1 0.1% Jamil Nimeh
76 8.4% Independent
19 2.1% Eirik Bjørsnøs
12 1.3% lizbing07734
8 0.9% Guoxiong Li
6 0.7% Gui Cao
3 0.3% Zhengyu Gu
3 0.3% Julian Waters
3 0.3% Chen Liang
2 0.2% Archie Cobbs
2 0.2% zhiqiang.zang
2 0.2% Sergey Tsypanov
1 0.1% zjx001202
1 0.1% Laurent Bourgès
1 0.1% korov9
1 0.1% stevenschlansker
1 0.1% Kangcheng Xu
1 0.1% vtsty.dev
1 0.1% 103394724+kurashige23
1 0.1% antbob
1 0.1% Artem Semenov
1 0.1% Quan Anh Mai
1 0.1% Markus Karg
1 0.1% thihup
1 0.1% Yuri Gaevsky
1 0.1% Chris Hegarty
1 0.1% ckozak
1 0.1% Ilya Gavrilin
62 6.8% Amazon
15 1.7% Aleksey Shipilev
14 1.5% William Kemper
11 1.2% Joshua Cao
7 0.8% Sergey Bylokhov
3 0.3% Roman Kennke
2 0.2% Yi-Fan Tsai
2 0.2% Oli Gillespie
2 0.2% Evgeny Astigeevich
2 0.2% Xin Liu
1 0.1% Dan Lutker
1 0.1% Elif Aslan
1 0.1% Y. Ramakrishna
1 0.1% Volker Simonis
41 4.5% SAP
25 2.8% Matthias Baesken
4 0.4% Christoph Langer
4 0.4% Martin Doerr
3 0.3% Richard Reingruber
2 0.2% Goetz Lindenmaier
2 0.2% Joachim Kern
1 0.1% Johannes Bechberger
25 2.8% Alibaba
15 1.7% Denghui Dong
2 0.2% Wang Zhuo
2 0.2% kuaiwei.kw
1 0.1% yansendao.ysd
1 0.1% Yi Yang
1 0.1% Shaojin Wen
1 0.1% Yude Lin
1 0.1% xingqizheng.xqz
1 0.1% yifeng.jyf
20 2.2% Red Hat
5 0.6% Thomas Stuefe
3 0.3% Andrew Leonard
3 0.3% Roland Westrelin
2 0.2% Sonia Zaldana Calles
2 0.2% Frederic Thevenet
2 0.2% Zdenek Zambersky
1 0.1% Robert Toyonaga
1 0.1% Martin Balao
1 0.1% Jiří Vaněk
10 1.1% Huawei
10 1.1% Hamlin Li
8 0.9% Unknown
4 0.4% syan
3 0.3% dlunden
1 0.1% sroy
7 0.8% IBM
3 0.3% Amit Kumar
3 0.3% Varada M
1 0.1% psoujany
7 0.8% Tencent
4 0.4% John Jiang
2 0.2% Jie Fu
1 0.1% Peng Xie
6 0.7% Rivos
4 0.4% Robbin Ehn
2 0.2% Ludovic Henry
5 0.6% Google
2 0.2% Jiangli Zhou
2 0.2% Liam Miller-Cushon
1 0.1% Eamonn McManus
5 0.6% Intel
2 0.2% Jatin Bhateja
1 0.1% Scott Gibbons
1 0.1% Sandhya Viswanathan
1 0.1% Srinivas Parasa
4 0.4% Azul
2 0.2% Jan Kratochvil
1 0.1% Dmitry Cherepanov
1 0.1% Olga Mikhaltcova
4 0.4% BellSoft
2 0.2% Aleksei Voitylov
1 0.1% Alexandr Scherbatiy
1 0.1% Boris Ulasevich
4 0.4% Microsoft
3 0.3% Cesar Soares
1 0.1% George Adams
2 0.2% @gentoo.org
2 0.2% sam
2 0.2% ARM
2 0.2% Bhavana Kilambi
2 0.2% Ampere
1 0.1% Patrick Zhang
1 0.1% limingliu
1 0.1% @geomatys.com
1 0.1% martin.desruisseaux
1 0.1% @hibox.tv
1 0.1% sebastian.lovdahl
1 0.1% @imt-soft.com
1 0.1% songpv
1 0.1% Canonical
1 0.1% Vladimir Petko
1 0.1% Loongson
1 0.1% Sun Yaqi
1 0.1% NTT DATA
1 0.1% Koichi Sakata

Chronological push log:

UTC Time This Release Push By Original Push By Bug Summary
Name Affiliation Name Affiliation
2024/03/01 05:35 Joshua Cao Amazon (same) (same) JDK-8324790 ifnode::fold_compares_helper cleanup
2024/03/01 03:09 Prasanta Sadhukhan Oracle (same) (same) JDK-8327040 Problemlist ActionListenerCalledTwiceTest.java test failing in macos14
2024/02/29 23:46 Denghui Dong Alibaba (same) (same) JDK-8327056 Remove unused static char array in JvmtiAgentList::lookup
2024/02/29 22:11 Douglas Simon Oracle (same) (same) JDK-8326959 Improve JVMCI option help
2024/02/29 20:20 Vladimir Kozlov Oracle (same) (same) JDK-8322743 C2: prevent lock region elimination in OSR compilation
2024/02/29 20:18 Erik Gahlin Oracle (same) (same) JDK-8326838 JFR: Native mirror events
2024/02/29 17:51 Alex Menkov Oracle (same) (same) JDK-8326525 com/sun/tools/attach/BasicTests.java does not verify AgentLoadException case
2024/02/29 16:56 Elif Aslan Amazon (same) (same) JDK-8318605 Enable parallelism in vmTestbase/nsk/stress/stack tests
2024/02/29 16:47 Brian Burkhalter Oracle (same) (same) JDK-8326897 (fs) The utility TestUtil.supportsLinks is wrongly used to check for hard link support
2024/02/29 16:47 Brian Burkhalter Oracle (same) (same) JDK-8326944 (ch) Minor typo in the ScatteringByteChannel.read(ByteBuffer[] dsts,int offset,int length) javadoc
2024/02/29 14:36 Albert Yang Oracle (same) (same) JDK-8326975 Parallel: Remove redundant PSOldGen::is_allocated
2024/02/29 12:08 Matthew Donovan Oracle (same) (same) JDK-8319673 Few security tests ignore VM flags
2024/02/29 09:55 Alexey Ivanov Oracle (same) (same) JDK-8326948 Force English locale for timeout formatting
2024/02/29 08:15 Matthias Baesken SAP (same) (same) JDK-8326140 src/jdk.accessibility/windows/native/libjavaaccessbridge/AccessBridgeJavaEntryPoints.cpp ReleaseStringChars might be missing in early returns
2024/02/29 06:24 Kim Barrett Oracle (same) (same) JDK-8324799 Use correct extension for C++ test headers
2024/02/29 05:28 David Holmes Oracle (same) (same) JDK-8318302 ThreadCountLimit.java failed with "Native memory allocation (mprotect) failed to protect 16384 bytes for memory to guard stack pages"
2024/02/28 22:48 Magnus Ihse Bursie Oracle (same) (same) JDK-8326953 Race in creation of win-exports.def with static-libs
2024/02/28 18:13 Hannes Wallnoefer Oracle (same) (same) JDK-8326694 Defer setting of autocapitalize attribute
2024/02/28 17:14 Lance Andersen Oracle (same) (same) JDK-8326687 Inconsistent use of "ZIP", "Zip" and "zip" in java.util.zip/jar zipfs javadoc
2024/02/28 16:04 Vladimir Kozlov Oracle (same) (same) JDK-8324969 C2: prevent elimination of unbalanced coarsened locking regions
2024/02/28 15:14 Albert Yang Oracle (same) (same) JDK-8326763 Consolidate print methods in ContiguousSpace
2024/02/28 14:42 Alexey Ivanov Oracle (same) (same) JDK-8325762 Use PassFailJFrame.Builder.splitUI() in PrintLatinCJKTest.java
2024/02/28 13:55 Zhengyu Gu Independent (same) (same) JDK-8326892 Remove unused PSAdaptiveSizePolicyResizeVirtualSpaceAlot develop flag
2024/02/28 10:42 Thomas Schatzl Oracle (same) (same) JDK-8326590 Improve description of MarkStackSize[Max] flags
2024/02/28 10:37 Thomas Schatzl Oracle (same) (same) JDK-8326781 G1ConcurrentMark::top_at_rebuild_start() should take a HeapRegion* not an uint
2024/02/28 10:31 Magnus Ihse Bursie Oracle (same) (same) JDK-8326509 Clean up JNIEXPORT in Hotspot after JDK-8017234
2024/02/28 08:44 kuaiwei.kw Alibaba (same) (same) JDK-8326135 Enhance adlc to report unused operands
2024/02/28 08:37 Andrew Leonard Red Hat (same) (same) JDK-8326685 Linux builds not reproducible if two builds configured in different build folders
2024/02/28 08:37 Matthias Baesken SAP (same) (same) JDK-8326389 [test] improve assertEquals failure output
2024/02/28 07:03 Christian Hagedorn Oracle (same) (same) JDK-8325746 Refactor Loop Unswitching code
2024/02/28 00:50 Robert Toyonaga Red Hat (same) (same) JDK-8326529 JFR: Test for CompilerCompile events fails due to time out
2024/02/27 23:06 William Kemper Amazon (same) (same) JDK-8325807 Shenandoah: Refactor full gc in preparation for generational mode changes
2024/02/27 22:26 Weijun Wang Oracle (same) (same) JDK-8325680 Uninitialised memory in deleteGSSCB of GSSLibStub.c:179
2024/02/27 22:19 syan Unknown (same) (same) JDK-8326726 Problem list Exhaustiveness.java due to 8326616
2024/02/27 20:08 Hamlin Li Huawei (same) (same) JDK-8326824 Test: remove redundant test in compiler/vectorapi/reshape/utils/TestCastMethods.java
2024/02/27 16:58 Tobias Hartmann Oracle (same) (same) JDK-8326638 Crash in PhaseIdealLoop::remix_address_expressions due to unexpected Region instead of Loop
2024/02/27 16:43 Jiangli Zhou Google (same) (same) JDK-8326714 Make file-local functions static in src/java.base/unix/native/libjava/childproc.c
2024/02/27 15:09 Zhengyu Gu Independent (same) (same) JDK-8326722 Cleanup unnecessary forward declaration in collectedHeap.hpp
2024/02/27 11:41 Markus Grönlund Oracle (same) (same) JDK-8326219 applications/kitchensink/Kitchensink8H.java timed out
2024/02/27 11:14 Magnus Ihse Bursie Oracle (same) (same) JDK-8326583 Remove over-generalized DefineNativeToolchain solution
2024/02/27 10:54 Magnus Ihse Bursie Oracle (same) (same) JDK-8326406 Remove mapfile support from makefiles
2024/02/27 10:39 103394724+kurashige23 Independent (same) (same) JDK-8313710 jcmd: typo in the documentation of JFR.start and JFR.dump
2024/02/27 10:38 Viktor Klang Oracle (same) (same) JDK-8325754 Dead AbstractQueuedSynchronizer$ConditionNodes survive minor garbage collections
2024/02/27 10:26 Magnus Ihse Bursie Oracle (same) (same) JDK-8017234 Hotspot should stop using mapfiles
2024/02/27 10:26 Kim Barrett Oracle (same) (same) JDK-8326524 Rename agent_common.h
2024/02/27 09:15 sroy Unknown (same) (same) JDK-8320005 Allow loading of shared objects with .a extension on AIX
2024/02/27 09:12 Albert Yang Oracle (same) (same) JDK-8326659 Serial: Remove redundant TenuredSpace::print_on
2024/02/27 08:59 Afshin Zafari Oracle (same) (same) JDK-8324828 Avoid multiple search of reserved regions during splitting
2024/02/27 08:58 lizbing07734 Independent (same) (same) JDK-8325082 Rename headers named 'heapRegion*' of G1
2024/02/27 08:28 Denghui Dong Alibaba (same) (same) JDK-8325144 C1: Optimize CriticalEdgeFinder
2024/02/27 08:17 Hamlin Li Huawei (same) (same) JDK-8322179 RISC-V: Implement SHA-1 intrinsic
2024/02/27 08:14 syan Unknown (same) (same) JDK-8326636 Problem list StartupOutput.java due to 8326615
2024/02/27 07:34 Dan Lutker Amazon (same) (same) JDK-8326717 Disable stringop-overflow in shenandoahLock.cpp
2024/02/27 07:06 Daniel Jelinski Oracle (same) (same) JDK-8325247 Memory leak in SessionKeyRef class def when using PKCS11 security provider
2024/02/27 01:34 Jiangli Zhou Google (same) (same) JDK-8326433 Make file-local functions static in src/jdk.jdwp.agent/unix/native/libjdwp/exec_md.c
2024/02/26 23:43 Justin Lu Oracle (same) (same) JDK-8325898 ChoiceFormat returns erroneous result when formatting bad pattern
2024/02/26 23:29 Patricio Chilano Mateo Oracle (same) (same) JDK-8322962 Upcall stub might go undetected when freezing frames
2024/02/26 23:18 Alex Menkov Oracle (same) (same) JDK-8325530 Vague error message when com.sun.tools.attach.VirtualMachine fails to load agent library
2024/02/26 21:52 Weijun Wang Oracle (same) (same) JDK-8325506 Ensure randomness is only read from provided SecureRandom object
2024/02/26 21:00 Anthony Scarpino Oracle (same) (same) JDK-8326699 Problemlist CertMsgCheck.java
2024/02/26 20:47 Sun Yaqi Loongson (same) (same) JDK-8322881 java/nio/file/Files/CopyMoveVariations.java fails with AccessDeniedException due to permissions of files in /tmp
2024/02/26 16:49 Anthony Scarpino Oracle (same) (same) JDK-8311644 Server should not send bad_certificate alert when the client does not send any certificates
2024/02/26 16:05 Claes Redestad Oracle (same) (same) JDK-8325340 Add ASCII fast-path to Data-/ObjectInputStream.readUTF
2024/02/26 15:43 Magnus Ihse Bursie Oracle (same) (same) JDK-8326587 Separate out Microsoft toolchain linking
2024/02/26 15:34 Albert Yang Oracle (same) (same) JDK-8325553 Parallel: Use per-marker cache for marking stats during Full GC
2024/02/26 15:31 Lance Andersen Oracle (same) (same) JDK-8321156 Improve the handling of invalid UTF-8 byte sequences for ZipInputStream::getNextEntry and ZipFile::getComment
2024/02/26 15:30 Claes Redestad Oracle (same) (same) JDK-8326653 Remove jdk.internal.reflect.UTF8
2024/02/26 14:15 Eirik Bjørsnøs Independent (same) (same) JDK-8326099 GZIPOutputStream should use Deflater.getBytesRead() instead of Deflater.getTotalIn()
2024/02/26 13:02 Emanuel Peter Oracle (same) (same) JDK-8325589 C2 SuperWord refactoring: create VLoopAnalyzer with Submodules
2024/02/26 12:10 Chen Liang Independent (same) (same) JDK-8323698 Class use page does not include extends/implements type arguments
2024/02/26 09:36 Albert Yang Oracle (same) (same) JDK-8326575 Remove unused ContiguousSpace::set_top_for_allocations
2024/02/26 07:28 Thomas Schatzl Oracle (same) (same) JDK-8325857 G1 Full GC flushes mark stats cache too early
2024/02/25 11:52 korov9 Independent (same) (same) JDK-8310351 Typo in ImmutableCollections
2024/02/23 19:58 Leonid Mesnik Oracle (same) (same) JDK-8326006 Allow TEST_VM_FLAGLESS to set flagless mode
2024/02/23 18:03 Joe Darcy Oracle (same) (same) JDK-8326530 Widen allowable error bound of Math.tan
2024/02/23 17:31 Magnus Ihse Bursie Oracle (same) (same) JDK-8326585 COMPARE_BUILD=PATCH fails if patch -R fails
2024/02/23 16:10 Weijun Wang Oracle (same) (same) JDK-8311003 missing @since info in jdk.security.jgss
2024/02/23 13:52 Martin Doerr SAP (same) (same) JDK-8326378 [PPC64] CodeEntryAlignment too large
2024/02/23 11:47 Albert Yang Oracle (same) (same) JDK-8326065 Merge Space into ContiguousSpace
2024/02/23 10:48 Ivan Walulya Oracle (same) (same) JDK-8325202 gc/g1/TestMarkStackOverflow.java intermittently crash: G1CMMarkStack::ChunkAllocator::allocate_new_chunk
2024/02/23 10:09 Roland Westrelin Red Hat (same) (same) JDK-8325372 Shenandoah: SIGSEGV crash in unnecessary_acquire due to LoadStore split through phi
2024/02/23 10:08 Jan Lahoda Oracle (same) (same) JDK-8326129 Java Record Pattern Match leads to infinite loop
2024/02/23 10:05 Roman Kennke Amazon (same) (same) JDK-8139457 Relax alignment of array elements
2024/02/23 08:56 Jan Lahoda Oracle (same) (same) JDK-8325215 Incorrect not exhaustive switch error
2024/02/23 02:02 Erik Gahlin Oracle (same) (same) JDK-8325994 JFR: Examples in JFR.start help use incorrect separator
2024/02/23 00:53 Jaikiran Pai Oracle (same) (same) JDK-8278527 java/util/concurrent/tck/JSR166TestCase.java fails nanoTime test
2024/02/22 22:27 Justin Lu Oracle (same) (same) JDK-8318761 MessageFormat pattern support for CompactNumberFormat, ListFormat, and DateTimeFormatter
2024/02/22 17:45 Thomas Stuefe Red Hat (same) (same) JDK-8326376 java -version failed with CONF=fastdebug -XX:InitialCodeCacheSize=1024K -XX:ReservedCodeCacheSize=1200k
2024/02/22 16:02 Stefan Karlsson Oracle (same) (same) JDK-8325752 Remove badMetaWordVal
2024/02/22 15:58 Stefan Karlsson Oracle (same) (same) JDK-8325742 Remove MetaWord usage from MemRegion
2024/02/22 15:29 Erik Gahlin Oracle (same) (same) JDK-8324832 JFR: Improve sorting of 'jfr summary'
2024/02/22 14:05 Renjith Kannath Pariyangad Oracle (same) (same) JDK-8321192 j.a.PrintJob/ImageTest/ImageTest.java: Fail or skip the test if there's no printer
2024/02/22 13:07 Fredrik Bredberg Oracle (same) (same) JDK-8325153 SEGV in stackChunkOopDesc::derelativize_address(int)
2024/02/22 11:07 Roland Westrelin Red Hat (same) (same) JDK-8323274 C2: array load may float above range check
2024/02/22 09:59 syan Unknown (same) (same) JDK-8326461 tools/jlink/CheckExecutable.java fails as .debuginfo files are not executable
2024/02/22 09:14 Axel Boldt-Christmas Oracle (same) (same) JDK-8325870 Zap end padding bits for ArrayOops in non-release builds
2024/02/22 07:57 Albert Yang Oracle (same) (same) JDK-8326414 Serial: Inline SerialHeap::create_rem_set
2024/02/22 07:57 Laurent Bourgès Independent (same) (same) JDK-8323695 RenderPerf (2D) enhancements (23.12)
2024/02/22 06:27 sam @gentoo.org (same) (same) JDK-8324243 Compilation failures in java.desktop module with gcc 14
2024/02/21 22:34 Magnus Ihse Bursie Oracle (same) (same) JDK-8325342 Remove unneeded exceptions in compare.sh
2024/02/21 16:53 Naoto Sato Oracle (same) (same) JDK-8326158 Javadoc for java.time.DayOfWeek#minus(long)
2024/02/21 14:51 Lance Andersen Oracle (same) (same) JDK-8326351 Update the Zlib version in open/src/java.base/share/legal/zlib.md to 1.3.1
2024/02/21 14:33 Robbin Ehn Rivos (same) (same) JDK-8326235 RISC-V: Size CodeCache for short calls encoding
2024/02/21 14:10 Magnus Ihse Bursie Oracle (same) (same) JDK-8326412 debuginfo files should not have executable bit set
2024/02/21 13:44 Magnus Ihse Bursie Oracle (same) (same) JDK-8326375 [REDO] Clean up NativeCompilation.gmk and its newly created parts
2024/02/21 13:38 Markus Grönlund Oracle (same) (same) JDK-8326334 JFR failed assert(used(klass)) failed: invariant
2024/02/21 11:48 Aleksey Shipilev Amazon (same) (same) JDK-8325587 Shenandoah: ShenandoahLock should allow blocking in VM
2024/02/21 11:19 Claes Redestad Oracle (same) (same) JDK-8326370 Remove redundant and misplaced micros from StringBuffers
2024/02/21 10:27 Albert Yang Oracle (same) (same) JDK-8326319 G1: Remove unused G1ConcurrentMark::_init_times
2024/02/21 08:58 Robbin Ehn Rivos (same) (same) JDK-8321075 RISC-V: UseSystemMemoryBarrier lacking proper OS support
2024/02/21 05:54 Tejesh R Oracle (same) (same) JDK-8187759 Background not refreshed when painting over a transparent JFrame
2024/02/21 05:37 Amit Kumar IBM (same) (same) JDK-8326201 [S390] Need to bailout cleanly if creation of stubs fails when code cache is out of space
2024/02/21 04:39 Thomas Stuefe Red Hat (same) (same) JDK-8325496 Make TrimNativeHeapInterval a product switch
2024/02/21 03:09 Kim Barrett Oracle (same) (same) JDK-8326090 Rename jvmti_aod.h
2024/02/21 01:26 Jaikiran Pai Oracle (same) (same) JDK-8326233 Utils#copySSLParameters loses needClientAuth Setting
2024/02/21 01:15 David Holmes Oracle (same) (same) JDK-8326371 [BACKOUT] Clean up NativeCompilation.gmk and its newly created parts
2024/02/20 22:25 Magnus Ihse Bursie Oracle (same) (same) JDK-8325963 Clean up NativeCompilation.gmk and its newly created parts
2024/02/20 22:24 Magnus Ihse Bursie Oracle (same) (same) JDK-8326368 compare.sh -2bins prints ugly errors on Windows
2024/02/20 21:10 Calvin Cheung Oracle (same) (same) JDK-8320002 Remove obsolete CDS check in Reflection::verify_class_access()
2024/02/20 20:28 Claes Redestad Oracle (same) (same) JDK-8325730 StringBuilder.toString allocation for the empty String
2024/02/20 19:56 Hannes Wallnoefer Oracle (same) (same) JDK-8164094 javadoc allows to create a @link to a non-existent method
2024/02/20 19:22 Hannes Wallnoefer Oracle (same) (same) JDK-8326089 Text incorrectly placed in breadcrumbs list in generated docs
2024/02/20 16:30 Alexey Ivanov Oracle (same) (same) JDK-8294148 Support JSplitPane for instructions and test UI
2024/02/20 16:00 Darragh Clarke Oracle (same) (same) JDK-8319651 Several network tests ignore vm flags when start java process
2024/02/20 15:49 Tobias Holenstein Oracle (same) (same) JDK-8325441 IGV: update pom.xml such that IntelliJ can import as maven project
2024/02/20 09:38 Albert Yang Oracle (same) (same) JDK-8326196 Serial: Remove SerialHeap::generation_iterate
2024/02/20 09:38 Albert Yang Oracle (same) (same) JDK-8326209 G1: Remove G1ConcurrentMark::_total_cleanup_time
2024/02/20 09:19 Albert Yang Oracle (same) (same) JDK-8326171 Serial: Remove VerifyGCLevel
2024/02/20 08:54 Joshua Cao Amazon (same) (same) JDK-8325542 CTW: Runner can produce negative StressSeed
2024/02/20 08:54 Joshua Cao Amazon (same) (same) JDK-8325610 CTW: Add StressIncrementalInlining to stress options
2024/02/20 07:01 Christian Stein Oracle (same) (same) JDK-8318812 LauncherHelper.checkAndLoadMain closes jar file that's about to be re-opened
2024/02/20 01:25 David Holmes Oracle (same) (same) JDK-8326222 Fix copyright year in src/hotspot/share/gc/shenandoah/shenandoahHeap.cpp
2024/02/20 00:41 Denghui Dong Alibaba (same) (same) JDK-8326127 JFR: Add SafepointCleanupTask to hardToTestEvents of TestLookForUntestedEvents
2024/02/20 00:39 Denghui Dong Alibaba (same) (same) JDK-8326111 JFR: Cleanup for JFR_ONLY
2024/02/19 22:00 David Holmes Oracle (same) (same) JDK-8326126 Update the java manpage with the changes from JDK-8322478
2024/02/19 19:33 Thomas Stuefe Red Hat (same) (same) JDK-8326067 Remove os::remap_memory and simplify os::map_memory
2024/02/19 16:13 Magnus Ihse Bursie Oracle (same) (same) JDK-8325950 Make sure all files in the JDK pass jcheck
2024/02/19 16:11 Magnus Ihse Bursie Oracle (same) (same) JDK-8325972 Add -x to bash for building with LOG=debug
2024/02/19 15:20 Martin Doerr SAP (same) (same) JDK-8326101 [PPC64] Need to bailout cleanly if creation of stubs fails when code cache is out of space
2024/02/19 14:07 Chen Liang Independent (same) (same) JDK-8294977 Convert test/jdk/java tests from ASM library to Classfile API
2024/02/19 13:33 Per-Ake Minborg Oracle (same) (same) JDK-8326112 Javadoc snippet for Linker.Option.captureCallState is wrong
2024/02/19 13:19 Markus Grönlund Oracle (same) (same) JDK-8326106 Write and clear stack trace table outside of safepoint
2024/02/19 13:15 vtsty.dev Independent (same) (same) JDK-8307246 Printing: banded raster path doesn't account for device offset values
2024/02/19 13:09 Albert Yang Oracle (same) (same) JDK-8326170 Parallel: Remove unused enum CollectionType in ParallelScavengeHeap
2024/02/19 12:52 Matthias Baesken SAP (same) (same) JDK-8325116 Amend jdk.ContainerConfiguration by swap related value
2024/02/19 09:56 Jaikiran Pai Oracle (same) (same) JDK-8326152 Bad copyright header in test/jdk/java/util/zip/DeflaterDictionaryTests.java
2024/02/19 09:15 Eirik Bjørsnøs Independent (same) (same) JDK-8326100 DeflaterDictionaryTests should use Deflater.getBytesWritten instead of Deflater.getTotalOut
2024/02/19 08:34 Denghui Dong Alibaba (same) (same) JDK-8324630 C1: Canonicalizer::do_LookupSwitch doesn't break the loop when the successor is found
2024/02/19 07:38 Yi Yang Alibaba (same) (same) JDK-8323795 jcmd Compiler.codecache should print total size of code cache
2024/02/18 18:10 Daniel Daugherty Oracle (same) (same) JDK-8326120 ProblemList sun/java2d/X11SurfaceData/SharedMemoryPixmapsTest/SharedMemoryPixmapsTest.sh on macosx-aarch64
2024/02/18 18:10 Daniel Daugherty Oracle (same) (same) JDK-8326117 ProblemList serviceability/jvmti/vthread/SuspendWithInterruptLock/SuspendWithInterruptLock.java#default in Xcomp mode
2024/02/18 16:14 Prasanta Sadhukhan Oracle (same) (same) JDK-6510914 JScrollBar.getMinimumSize() breaks the contract of JComponent.setMinimumSize()
2024/02/18 15:25 Eirik Bjørsnøs Independent (same) (same) JDK-8303972 (zipfs) Make test/jdk/jdk/nio/zipfs/TestLocOffsetFromZip64EF.java independent of the zip command line
2024/02/18 15:25 Eirik Bjørsnøs Independent (same) (same) JDK-8301183 (zipfs) jdk/jdk/nio/zipfs/TestLocOffsetFromZip64EF.java failing with ZipException:R0 on OL9
2024/02/18 06:58 Christoph Langer SAP (same) (same) JDK-8326000 Remove obsolete comments for class sun.security.ssl.SunJSSE
2024/02/17 19:19 Leonid Mesnik Oracle (same) (same) JDK-8299023 TestPLABResize.java and TestPLABPromotion.java are failing intermittently
2024/02/17 16:37 Jan Kratochvil Azul (same) (same) JDK-8317697 refactor-encapsulate x86 VM_Version::CpuidInfo
2024/02/16 22:56 Joe Darcy Oracle (same) (same) JDK-8325687 SimpleJavaFileObject specification would benefit from implSpec
2024/02/16 22:16 Jiří Vaněk Red Hat (same) (same) JDK-8323170 j2dbench is using outdated javac source/target to be able to build by itself
2024/02/16 21:21 Serguei Spitsyn Oracle (same) (same) JDK-8324680 Replace NULL with nullptr in JVMTI generated code
2024/02/16 18:07 Rajan Halade Oracle (same) (same) JDK-8321408 Add Certainly roots R1 and E1
2024/02/16 17:14 Justin Lu Oracle (same) (same) JDK-8325908 Finish removal of IntlTest and CollatorTest
2024/02/16 16:39 Albert Yang Oracle (same) (same) JDK-8325941 Remove unused Space::block_size
2024/02/16 16:06 Brian Burkhalter Oracle (same) (same) JDK-8325990 Remove use of snippet @replace annotation in java.base
2024/02/16 16:03 Daniel Daugherty Oracle (same) (same) JDK-8326062 ProblemList jcstress tests that are failing due to JDK-8325984
2024/02/16 15:58 Martin Doerr SAP (same) (same) JDK-8325326 [PPC64] Don't relocate in case of allocation failure
2024/02/16 14:51 ben.perez Oracle (same) (same) JDK-8265372 Simplify PKCS9Attribute
2024/02/16 14:10 Alexey Ivanov Oracle (same) (same) JDK-8323801 tag doesn't strikethrough the text
2024/02/16 13:13 Matthias Baesken SAP (same) (same) JDK-8325862 set -XX:+ErrorFileToStderr when executing java in containers for some container related jtreg tests
2024/02/16 09:23 Leo Korinth Oracle (same) (same) JDK-8325763 Revert properties: vm.opt.x.*
2024/02/16 08:40 Richard Reingruber SAP (same) (same) JDK-8323782 Race: Thread::interrupt vs. AbstractInterruptibleChannel.begin
2024/02/16 08:34 Axel Boldt-Christmas Oracle (same) (same) JDK-8325074 ZGC fails assert(index == 0 || is_power_of_2(index)) failed: Incorrect load shift: 11
2024/02/16 08:27 Afshin Zafari Oracle (same) (same) JDK-8316813 NMT: Using WhiteBox API, virtual memory tracking should also be stressed in JMH tests
2024/02/16 08:21 Matthias Baesken SAP (same) (same) JDK-8325876 crashes in docker container tests on Linuxppc64le Power8 machines
2024/02/16 07:18 Axel Boldt-Christmas Oracle (same) (same) JDK-8319801 Recursive lightweight locking: aarch64 implementation
2024/02/15 22:50 Leonid Mesnik Oracle (same) (same) JDK-8316451 6 java/lang/instrument/PremainClass tests ignore VM flags
2024/02/15 22:36 Christoph Langer SAP (same) (same) JDK-8323664 java/awt/font/JNICheck/FreeTypeScalerJNICheck.java still fails with JNI warning on some Windows configurations
2024/02/15 21:10 Zdenek Zambersky Red Hat (same) (same) JDK-8325983 Build failure after JDK-8324580
2024/02/15 18:18 Alexander Zuev Oracle (same) (same) JDK-8322239 [macos] a11y : java.lang.NullPointerException is thrown when focus is moved on the JTabbedPane
2024/02/15 17:52 Alexander Zvegintsev Oracle (same) (same) JDK-8322750 Test "api/java_awt/interactive/SystemTrayTests.html" failed because A blue ball icon is added outside of the system tray
2024/02/15 16:01 Zdenek Zambersky Red Hat (same) (same) JDK-8324580 SIGFPE on THP initialization on kernels < 4.10
2024/02/15 15:06 Leonid Mesnik Oracle (same) (same) JDK-8325906 Problemlist vmTestbase/vm/mlvm/meth/stress/compiler/deoptimize/Test.java#id1 until JDK-8320865 is fixed
2024/02/15 14:48 Matias Saavedra Silva Oracle (same) (same) JDK-8324584 Optimize Symbol and char* handling in ClassLoader
2024/02/15 11:27 Daniel Jelinski Oracle (same) (same) JDK-8325162 Remove duplicate GCMParameters class
2024/02/15 10:38 Magnus Ihse Bursie Oracle (same) (same) JDK-8325877 Split up NativeCompilation.gmk
2024/02/15 10:20 Albert Yang Oracle (same) (same) JDK-8325860 Serial: Move Generation.java to serial folder
2024/02/15 09:36 Albert Yang Oracle (same) (same) JDK-8325882 Serial: Move is_maximal_no_gc to TenuredGeneration
2024/02/15 09:26 Erik Österlund Oracle (same) (same) JDK-8324933 ConcurrentHashTable::statistics_calculate synchronization is expensive
2024/02/15 09:17 Robbin Ehn Rivos (same) (same) JDK-8321282 RISC-V: SpinPause() not implemented
2024/02/15 08:03 Sonia Zaldana Calles Red Hat (same) (same) JDK-8323994 gtest runner repeats test name for every single gtest assertion
2024/02/15 03:54 Kim Barrett Oracle (same) (same) JDK-8325910 Rename jnihelper.h
2024/02/14 23:06 Kim Barrett Oracle (same) (same) JDK-8325682 Rename nsk_strace.h
2024/02/14 16:54 William Kemper Amazon (same) (same) JDK-8325574 Shenandoah: Simplify and enhance reporting of requested GCs
2024/02/14 16:29 Magnus Ihse Bursie Oracle (same) (same) JDK-8252136 Several methods in hotspot are missing "static"
2024/02/14 15:59 Brian Burkhalter Oracle (same) (same) JDK-8316340 (bf) Missing {@inheritDoc} for exception in MappedByteBuffer::compact
2024/02/14 15:19 Albert Yang Oracle (same) (same) JDK-8325643 G1: Refactor G1FlushHumongousCandidateRemSets
2024/02/14 14:59 Stefan Johansson Oracle (same) (same) JDK-8325403 Add SystemGC JMH benchmarks
2024/02/14 14:30 Jorn Vernee Oracle (same) (same) JDK-8318966 Some methods make promises about Java array element alignment that are too strong
2024/02/14 14:10 Markus Grönlund Oracle (same) (same) JDK-8323883 JFR AssertionError: Missing object ID 15101
2024/02/14 13:17 Albert Yang Oracle (same) (same) JDK-8325767 Serial: Move transform_stack_chunk out of TenuredGeneration::promote
2024/02/14 13:02 Erik Gahlin Oracle (same) (same) JDK-8325809 JFR: Remove unnecessary annotation
2024/02/14 11:44 Erik Österlund Oracle (same) (same) JDK-8322630 Remove ICStubs and related safepoints
2024/02/14 09:19 Angelos Bimpoudis Oracle (same) (same) JDK-8325653 Erroneous exhaustivity analysis for primitive patterns
2024/02/14 08:31 Matthias Baesken SAP (same) (same) JDK-8325743 test/jdk/java/nio/channels/unixdomain/SocketOptions.java enhance user name output in error case
2024/02/14 07:34 Tobias Hartmann Oracle (same) (same) JDK-8325449 [BACKOUT] use "dmb.ishst+dmb.ishld" for release barrier
2024/02/14 07:18 Axel Boldt-Christmas Oracle (same) (same) JDK-8319799 Recursive lightweight locking: x86 implementation
2024/02/14 05:30 Dmitry Cherepanov Azul (same) (same) JDK-8325395 Missing copyright header in StackFilter.java
2024/02/13 21:23 Mikael Vidstedt Oracle (same) (same) JDK-8325800 Drop unused cups declaration from Oracle build configuration
2024/02/13 16:26 Eirik Bjørsnøs Independent (same) (same) JDK-8303866 Allow ZipInputStream.readEnd to parse small Zip64 ZIP files
2024/02/13 16:18 Eirik Bjørsnøs Independent (same) (same) JDK-8303891 Speed up Zip64SizeTest using a small ZIP64 file
2024/02/13 16:18 Eirik Bjørsnøs Independent (same) (same) JDK-8259866 two java.util tests failed with "IOException: There is not enough space on the disk"
2024/02/13 16:15 Douglas Simon Oracle (same) (same) JDK-8325750 Fix spelling of ForceTranslateFailure help message
2024/02/13 16:09 Emanuel Peter Oracle (same) (same) JDK-8325672 C2: allocate PhaseIdealLoop::_loop_or_ctrl from C->comp_arena()
2024/02/13 16:07 Emanuel Peter Oracle (same) (same) JDK-8325541 C2 SuperWord: refactor filter / split
2024/02/13 15:53 Brian Burkhalter Oracle (same) (same) JDK-8325382 (fc) FileChannel.transferTo throws IOException when position equals size
2024/02/13 15:16 Roger Riggs Oracle (same) (same) JDK-8325590 Regression in round-tripping UTF-16 strings after JDK-8311906
2024/02/13 15:00 Albert Yang Oracle (same) (same) JDK-8325748 Serial: Move Generation::promote to TenuredGeneration
2024/02/13 13:50 Cesar Soares Microsoft (same) (same) JDK-8322854 Incorrect rematerialization of scalar replaced objects in C2
2024/02/13 13:22 Albert Yang Oracle (same) (same) JDK-8323520 Drop unnecessary virtual specifier in Space
2024/02/13 12:59 Stefan Karlsson Oracle (same) (same) JDK-8325616 JFR ZGC Allocation Stall events should record stack traces
2024/02/13 12:31 Johannes Bechberger SAP (same) (same) JDK-8325731 Installation instructions for Debian/Ubuntu don't mention autoconf
2024/02/13 11:21 Hannes Wallnoefer Oracle (same) (same) JDK-8325325 Breadcrumb navigation shows preview link for modules and packages
2024/02/13 11:08 Hannes Wallnoefer Oracle (same) (same) JDK-8325650 Table of contents scroll timeout not long enough
2024/02/13 10:00 Magnus Ihse Bursie Oracle (same) (same) JDK-8325558 Add jcheck whitespace checking for properties files
2024/02/13 09:51 Magnus Ihse Bursie Oracle (same) (same) JDK-8325626 Allow selection of non-matching configurations using CONF=!string
2024/02/13 09:41 Albert Yang Oracle (same) (same) JDK-8325633 Use stricter assertion in callers of Space::is_aligned
2024/02/13 09:32 Axel Boldt-Christmas Oracle (same) (same) JDK-8319797 Recursive lightweight locking: Runtime implementation
2024/02/13 09:03 Matthias Baesken SAP (same) (same) JDK-8325470 [AIX] use fclose after fopen in read_psinfo
2024/02/13 08:47 Albert Yang Oracle (same) (same) JDK-8325635 Serial: Inline verify_used_region_at_save_marks
2024/02/13 02:03 Kim Barrett Oracle (same) (same) JDK-8325458 Rename mlvmJvmtiUtils.h
2024/02/12 21:10 Jonathan Gibbons Oracle (same) (same) JDK-8323628 Update license on "pass-through" files
2024/02/12 20:26 Mikael Vidstedt Oracle (same) (same) JDK-8325570 Update to Graphviz 9.0.0
2024/02/12 19:53 Jonathan Gibbons Oracle (same) (same) JDK-8322865 JavaDoc fails on aggregator modules
2024/02/12 19:49 Jonathan Gibbons Oracle (same) (same) JDK-8322874 Redirection loop in index.html
2024/02/12 19:47 Jonathan Gibbons Oracle (same) (same) JDK-8325529 Remove unused imports from `ModuleGenerator` test file
2024/02/12 18:55 Patricio Chilano Mateo Oracle (same) (same) JDK-8320302 compiler/arguments/TestC1Globals.java hits SIGSEGV in ContinuationEntry::set_enter_code
2024/02/12 18:04 Alisen Chung Oracle (same) (same) JDK-8316931 [macos14] Test "java/awt/TrayIcon/ShowAfterDisposeTest/ShowAfterDisposeTest.html" throws an exception on macOS 14(x64, aarch64)
2024/02/12 12:25 Albert Yang Oracle (same) (same) JDK-8325503 Add GC specific prefix for CheckForUnmarked related classes
2024/02/12 09:26 Denghui Dong Alibaba (same) (same) JDK-8322694 C1: Handle Constant and IfOp in NullCheckEliminator
2024/02/12 08:18 Christian Hagedorn Oracle (same) (same) JDK-8325606 compiler/predicates/TestPredicatesBasic.java does not compile
2024/02/12 08:04 Magnus Ihse Bursie Oracle (same) (same) JDK-8324539 Do not use LFS64 symbols in JDK libs
2024/02/12 07:54 Daniel Jelinski Oracle (same) (same) JDK-8323089 networkaddress.cache.ttl is not a system property
2024/02/12 06:29 Joshua Cao Amazon (same) (same) JDK-8325451 Missed elimination of assertion predicates
2024/02/11 15:34 Albert Yang Oracle (same) (same) JDK-8325565 Remove unused SpaceClosure
2024/02/10 14:19 Emanuel Peter Oracle (same) (same) JDK-8324890 C2 SuperWord: refactor out VLoop, make unrolling_analysis static, remove init/reset mechanism
2024/02/10 14:07 yifeng.jyf Alibaba (same) (same) JDK-8325464 GCCause.java out of sync with gcCause.hpp
2024/02/10 01:48 Sergey Bylokhov Amazon (same) (same) JDK-8318603 Parallelize sun/java2d/marlin/ClipShapeTest.java
2024/02/10 00:56 Alex Menkov Oracle (same) (same) JDK-8311076 RedefineClasses doesn't check for ConstantPool overflow
2024/02/09 20:49 Daniel Daugherty Oracle (same) (same) JDK-8325569 ProblemList gc/parallel/TestAlwaysPreTouchBehavior.java on linux
2024/02/09 18:40 Leonid Mesnik Oracle (same) (same) JDK-8319578 Few java/lang/instrument ignore test.java.opts and accept test.vm.opts only
2024/02/09 18:40 Leonid Mesnik Oracle (same) (same) JDK-8316460 4 javax/management tests ignore VM flags
2024/02/09 18:32 sebastian.lovdahl @hibox.tv (same) (same) JDK-8226919 attach in linux hangs due to permission denied accessing /proc/pid/root
2024/02/09 18:06 Calvin Cheung Oracle (same) (same) JDK-8325038 runtime/cds/appcds/ProhibitedPackage.java can fail with UseLargePages
2024/02/09 17:05 Alexey Semenyuk Oracle (same) (same) JDK-8325203 System.exit(0) kills the launched 3rd party application
2024/02/09 16:57 Bhavana Kilambi ARM (same) (same) JDK-8325264 two compiler/intrinsics/float16 tests fail after JDK-8324724
2024/02/09 16:53 William Kemper Amazon (same) (same) JDK-8325517 Shenandoah: Reduce unnecessary includes from shenandoahControlThread.cpp
2024/02/09 16:33 Albert Yang Oracle (same) (same) JDK-8325563 Remove unused Space::is_in
2024/02/09 15:01 Albert Yang Oracle (same) (same) JDK-8325551 Remove unused obj_is_alive and block_start in Space
2024/02/09 14:38 Oli Gillespie Amazon (same) (same) JDK-8324646 Avoid Class.forName in SecureRandom constructor
2024/02/09 14:36 Oli Gillespie Amazon (same) (same) JDK-8324648 Avoid NoSuchMethodError when instantiating NativePRNG
2024/02/09 13:09 Stefan Karlsson Oracle (same) (same) JDK-8325437 Safepoint polling in monitor deflation can cause massive logs
2024/02/09 11:51 Jan Lahoda Oracle (same) (same) JDK-8325440 Confusing error reported for octal literals with wrong digits
2024/02/09 11:46 Alexey Ivanov Oracle (same) (same) JDK-8325309 Amend "Listeners and Threads" in AWTThreadIssues.html
2024/02/09 11:05 Albert Yang Oracle (same) (same) JDK-8325510 Serial: Remove redundant arg in non_clean_card_iterate
2024/02/09 09:00 Axel Boldt-Christmas Oracle (same) (same) JDK-8325471 CHeapBitMap(MEMFLAGS flags) constructor misleading use of super-constructor
2024/02/09 08:52 Angelos Bimpoudis Oracle (same) (same) JDK-8314275 Incorrect stepping in switch
2024/02/09 07:42 William Kemper Amazon (same) (same) JDK-8325516 Shenandoah: Move heap change tracking into ShenandoahHeap
2024/02/09 05:30 Emanuel Peter Oracle (same) (same) JDK-8324641 [IR Framework] Add Setup method to provide custom arguments and set fields
2024/02/09 04:49 Koichi Sakata NTT DATA (same) (same) JDK-8322927 Unused code in LIR_Assembler::verify_oop_map
2024/02/08 22:50 Patrick Zhang Ampere (same) (same) JDK-8324824 AArch64: Detect Ampere-1B core and update default options for Ampere CPUs
2024/02/08 21:56 thihup Independent (same) (same) JDK-8325505 Fix Javadoc ResourceBundle::getString
2024/02/08 17:22 Kim Barrett Oracle (same) (same) JDK-8325456 Rename nsk_mutex.h
2024/02/08 16:20 Albert Yang Oracle (same) (same) JDK-8325259 Serial: Inline OldGenScanClosure during Young GC
2024/02/08 14:22 Albert Yang Oracle (same) (same) JDK-8325436 G1: Remove unused G1RegionMarkStats::is_clear
2024/02/08 14:05 Christoph Langer SAP (same) (same) JDK-8325444 GHA: JDK-8325194 causes a regression
2024/02/08 11:55 Prasanta Sadhukhan Oracle (same) (same) JDK-6507038 Memory Leak in JTree / BasicTreeUI
2024/02/08 11:02 Matthias Baesken SAP (same) (same) JDK-8325432 enhance assert message "relocation addr must be in this section"
2024/02/08 10:54 Per-Ake Minborg Oracle (same) (same) JDK-8323746 Add PathElement hashCode and equals
2024/02/08 09:15 johny.jose Oracle (same) (same) JDK-8325150 (tz) Update Timezone Data to 2024a
2024/02/08 07:56 Alan Bateman Oracle (same) (same) JDK-8325399 Add tests for virtual threads doing Selector operations
2024/02/08 07:55 Alan Bateman Oracle (same) (same) JDK-8325028 (ch) Pipe channels should lazily set socket to non-blocking mode on first use by virtual thread
2024/02/08 06:35 Jaikiran Pai Oracle (same) (same) JDK-8325304 Several classes in java.util.jar and java.util.zip don't specify the behaviour for null arguments
2024/02/08 00:00 Kim Barrett Oracle (same) (same) JDK-8325367 Rename nsk_list.h
2024/02/07 23:39 Chris Plummer Oracle (same) (same) JDK-8323681 SA PointerFinder code should support G1
2024/02/07 20:05 Joe Darcy Oracle (same) (same) JDK-8325189 Enable this-escape javac warning in java.base
2024/02/07 19:02 Brian Burkhalter Oracle (same) (same) JDK-8325302 Files.move(REPLACE_EXISTING) throws NoSuchFileException on deleted target
2024/02/07 18:03 Joe Darcy Oracle (same) (same) JDK-8325268 Add policy statement to langtools makefiles concerning warnings
2024/02/07 15:50 Magnus Ihse Bursie Oracle (same) (same) JDK-8325109 Sort method modifiers in canonical order
2024/02/07 15:49 Axel Boldt-Christmas Oracle (same) (same) JDK-8324881 ObjectSynchronizer::inflate(Thread* current...) is invoked for non-current thread
2024/02/07 15:05 Albert Yang Oracle (same) (same) JDK-8325416 Parallel: Refactor CheckForUnmarkedOops
2024/02/07 14:54 Thomas Stuefe Red Hat (same) (same) JDK-8325306 Rename static huge pages to explicit huge pages
2024/02/07 12:21 Albert Yang Oracle (same) (same) JDK-8325248 Serial: Remove Generation::space_iterate
2024/02/07 12:21 Albert Yang Oracle (same) (same) JDK-8325221 Obsolete TLABStats
2024/02/07 10:01 dlunden Unknown (same) (same) JDK-8317349 Randomize order of macro node expansion in C2
2024/02/07 07:54 Chen Liang Independent (same) (same) JDK-8319463 ClassSignature should have superclass and superinterfaces as ClassTypeSig
2024/02/07 06:59 Angelos Bimpoudis Oracle (same) (same) JDK-8325257 jshell reports NoSuchFieldError with instanceof primitive type
2024/02/06 23:42 Kim Barrett Oracle (same) (same) JDK-8325347 Rename native_thread.h
2024/02/06 23:22 Joe Darcy Oracle (same) (same) JDK-8322218 Better escaping of single and double quotes in annotation toString() results
2024/02/06 19:49 Martin Balao Red Hat (same) (same) JDK-8325254 CKA_TOKEN private and secret keys are not necessarily sensitive
2024/02/06 19:35 Brian Burkhalter Oracle (same) (same) JDK-8325152 Clarify specification of java.io.RandomAccessFile.setLength
2024/02/06 17:43 Naoto Sato Oracle (same) (same) JDK-8324665 Loose matching of space separators in the lenient date/time parsing mode
2024/02/06 17:15 Kim Barrett Oracle (same) (same) JDK-8325180 Rename jvmti_FollowRefObjects.h
2024/02/06 17:03 Mandy Chung Oracle (same) (same) JDK-8325262 jdeps can drop printing stack trace when FindException is thrown due to modules not found
2024/02/06 17:03 Mandy Chung Oracle (same) (same) JDK-8321703 jdeps generates illegal dot file containing nodesep=0,500000
2024/02/06 15:16 Shaojin Wen Alibaba (same) (same) JDK-8316704 Regex-free parsing of Formatter and FormatProcessor specifiers
2024/02/06 14:37 Kangcheng Xu Independent (same) (same) JDK-8320237 C2: late inlining of method handle invoke causes duplicate lines in PrintInlining output
2024/02/06 14:05 Douglas Simon Oracle (same) (same) JDK-8316992 Potential null pointer from get_current_thread JVMCI helper function.
2024/02/06 13:28 George Adams Microsoft (same) (same) JDK-8325194 GHA: Add macOS M1 testing
2024/02/06 13:25 Fredrik Bredberg Oracle (same) (same) JDK-8322535 Change default AArch64 SpinPause instruction
2024/02/06 09:34 Damon Fenacci Oracle (same) (same) JDK-8325313 Header format error in TestIntrinsicBailOut after JDK-8317299
2024/02/06 08:54 Evgeny Astigeevich Amazon (same) (same) JDK-8324874 AArch64: crypto pmull based CRC32/CRC32C intrinsics clobber V8-V15 registers
2024/02/06 08:04 Magnus Ihse Bursie Oracle (same) (same) JDK-8298046 Fix hidden but significant trailing whitespace in properties files for serviceability code
2024/02/06 07:53 Damon Fenacci Oracle (same) (same) JDK-8317299 safepoint scalarization doesn't keep track of the depth of the JVM state
2024/02/06 07:03 Sonia Zaldana Calles Red Hat (same) (same) JDK-8324126 Error message for mistyping -XX:+Unlock...Options is not helpful
2024/02/06 06:56 Martin Doerr SAP (same) (same) JDK-8325213 Flags introduced by configure script are not passed to ADLC build
2024/02/06 02:11 Joe Darcy Oracle (same) (same) JDK-8325266 Enable this-escape javac warning in jdk.javadoc
2024/02/06 01:06 lizbing07734 Independent (same) (same) JDK-8325081 Move '_soft_ref_policy' to 'CollectedHeap'
2024/02/05 23:14 Archie Cobbs Independent (same) (same) JDK-8323699 MessageFormat.toPattern() generates non-equivalent MessageFormat pattern
2024/02/05 22:49 Daniel Daugherty Oracle (same) (same) JDK-8325270 ProblemList two compiler/intrinsics/float16 tests that fail due to JDK-8324724
2024/02/05 21:57 Alex Menkov Oracle (same) (same) JDK-8317636 Improve heap walking API tests to verify correctness of field indexes
2024/02/05 21:55 Alex Menkov Oracle (same) (same) JDK-8318566 Heap walking functions should not use FilteredFieldStream
2024/02/05 21:31 Brian Burkhalter Oracle (same) (same) JDK-8324960 Unsafe.allocateMemory documentation incorrect regarding zero return value
2024/02/05 19:35 Gerard Ziemski Oracle (same) (same) JDK-8321931 memory_swap_current_in_bytes reports 0 as "unlimited"
2024/02/05 18:29 Bhavana Kilambi ARM (same) (same) JDK-8324724 Add Stub routines for FP16 conversions on aarch64
2024/02/05 17:59 Eirik Bjørsnøs Independent (same) (same) JDK-8325199 (zipfs) jdk/nio/zipfs/TestPosix.java failed 6 sub-tests
2024/02/05 17:43 Tom Rodriguez Oracle (same) (same) JDK-8324983 Race in CompileBroker::possibly_add_compiler_threads
2024/02/05 16:30 Claes Redestad Oracle (same) (same) JDK-8321468 Remove StringUTF16::equals
2024/02/05 16:30 Claes Redestad Oracle (same) (same) JDK-8325169 Reduce String::indexOf overheads
2024/02/05 16:28 Emanuel Peter Oracle (same) (same) JDK-8325064 C2 SuperWord: refactor construct_bb
2024/02/05 14:06 Magnus Ihse Bursie Oracle (same) (same) JDK-8321373 Build should use LC_ALL=C.UTF-8
2024/02/05 11:18 Albert Yang Oracle (same) (same) JDK-8323809 Serial: Refactor card table verification
2024/02/05 10:54 Albert Yang Oracle (same) (same) JDK-8325134 Serial: Remove Generation::used_region
2024/02/05 10:53 dlunden Unknown (same) (same) JDK-8291809 Convert compiler/c2/cr7200264/TestSSE2IntVect.java to IR verification test
2024/02/05 09:27 Johan Sjölen Oracle (same) (same) JDK-8325133 Missing MEMFLAGS parameter in parts of os API
2024/02/05 08:59 Angelos Bimpoudis Oracle (same) (same) JDK-8323502 javac crash with wrongly typed method block in Flow
2024/02/05 07:00 Julian Waters Independent (same) (same) JDK-8325049 stubGenerator_ppc.cpp should use alignas
2024/02/05 06:53 Emanuel Peter Oracle (same) (same) JDK-8325159 C2 SuperWord: measure time for CITime
2024/02/05 06:29 Amit Kumar IBM (same) (same) JDK-8315762 Update subtype check profile collection on s390x following 8308869
2024/02/05 06:19 Wang Zhuo Alibaba (same) (same) JDK-8324817 Parallel GC does not pre-touch all heap pages when AlwaysPreTouch enabled and large page disabled
2024/02/04 21:01 Eirik Bjørsnøs Independent (same) (same) JDK-8325201 (zipfs) Disable TestPosix.setPermissionsShouldConvertToUnix which fails on Windows
2024/02/04 09:46 Hamlin Li Huawei (same) (same) JDK-8325037 x86: enable and fix hotspot/jtreg/compiler/vectorization/TestRoundVectFloat.java
2024/02/02 21:50 Eirik Bjørsnøs Independent (same) (same) JDK-8324635 (zipfs) Regression in Files.setPosixFilePermissions called on existing MSDOS entries
2024/02/02 20:41 Chris Plummer Oracle (same) (same) JDK-8323680 SA PointerFinder code can do a better job of leveraging existing code to determine if an address is in the TLAB
2024/02/02 20:21 Eirik Bjørsnøs Independent (same) (same) JDK-8321396 Retire test/jdk/java/util/zip/NoExtensionSignature.java
2024/02/02 20:20 Eirik Bjørsnøs Independent (same) (same) JDK-8313739 ZipOutputStream.close() should always close the wrapped stream
2024/02/02 17:47 Joe Darcy Oracle (same) (same) JDK-8325148 Enable restricted javac warning in java.base
2024/02/02 16:53 Paul Sandoz Oracle (same) (same) JDK-8324858 [vectorapi] Bounds checking issues when accessing memory segments
2024/02/02 16:30 Mark Powers Oracle (same) (same) JDK-8318105 [jmh] the test java.security.HSS failed with 2 active threads
2024/02/02 16:19 Kim Barrett Oracle (same) (same) JDK-8325055 Rename Injector.h
2024/02/02 10:44 Douglas Simon Oracle (same) (same) JDK-8325137 com/sun/management/ThreadMXBean/ThreadCpuTimeArray.java can fail in Xcomp with out of expected range
2024/02/02 09:01 psoujany IBM (same) (same) JDK-8311893 Interactive component with ARIA role 'tabpanel' does not have a programmatically associated name
2024/02/01 22:21 Justin Lu Oracle (same) (same) JDK-6285888 ChoiceFormat can support unescaped relational symbols in the Format segment
2024/02/01 20:20 Joe Darcy Oracle (same) (same) JDK-8325078 Better escaping of single and double quotes in javac annotation toString() results
2024/02/01 19:39 Coleen Phillimore Oracle (same) (same) JDK-8324679 Replace NULL with nullptr in HotSpot .ad files
2024/02/01 19:24 Chris Plummer Oracle (same) (same) JDK-8324066 "clhsdb jstack" should not by default scan for j.u.c locks because it can be very slow
2024/02/01 15:52 Denghui Dong Alibaba (same) (same) JDK-8324974 JFR: EventCompilerPhase should be created as UNTIMED
2024/02/01 14:05 Tejesh R Oracle (same) (same) JDK-8323670 A few client tests intermittently throw ConcurrentModificationException
2024/02/01 13:54 Sean Coffey Oracle (same) (same) JDK-8325096 Test java/security/cert/CertPathBuilder/akiExt/AKISerialNumber.java is failing
2024/02/01 13:09 Magnus Ihse Bursie Oracle (same) (same) JDK-8324834 Use _LARGE_FILES on AIX
2024/02/01 12:50 Matthias Baesken SAP (same) (same) JDK-8324287 Record total and free swap space in JFR
2024/02/01 11:53 Per-Ake Minborg Oracle (same) (same) JDK-8325001 Typo in the javadocs for the Arena::ofShared method
2024/02/01 11:00 Albert Yang Oracle (same) (same) JDK-8325053 Serial: Move Generation::save_used_region to TenuredGeneration
2024/02/01 09:18 Kevin Walls Oracle (same) (same) JDK-8324845 management.properties text "interface name" is misleading
2024/02/01 08:37 Daniel Jelinski Oracle (same) (same) JDK-8324585 JVM native memory leak in PCKS11-NSS security provider
2024/02/01 08:11 Aleksey Shipilev Amazon (same) (same) JDK-8324937 GHA: Avoid multiple test suites per job
2024/02/01 05:55 Jaikiran Pai Oracle (same) (same) JDK-8324668 JDWP process management needs more efficient file descriptor handling
2024/02/01 05:54 Julian Waters Independent (same) (same) JDK-8324838 test_nmt_locationprinting.cpp broken in the gcc windows build
2024/02/01 03:08 syan Unknown (same) (same) JDK-8325024 java/security/cert/CertPathValidator/OCSP/OCSPTimeout.java incorrect comment information
2024/02/01 02:35 John Jiang Tencent (same) (same) JDK-8325022 Incorrect error message on client authentication
2024/01/31 19:42 Vladimir Kozlov Oracle (same) (same) JDK-8324174 assert(m->is_entered(current)) failed: invariant
2024/01/31 19:19 Kim Barrett Oracle (same) (same) JDK-8325042 Remove unused JVMDITools test files
2024/01/31 17:59 Per-Ake Minborg Oracle (same) (same) JDK-8323621 JDK build should exclude snippet class in java.lang.foreign
2024/01/31 17:42 Harshitha Onkar Oracle (same) (same) JDK-8324238 [macOS] java/awt/Frame/ShapeNotSetSometimes/ShapeNotSetSometimes.java fails with the shape has not been applied msg
2024/01/31 17:35 Rajat Mahajan Oracle (same) (same) JDK-8320342 Use PassFailJFrame for TruncatedPopupMenuTest.java
2024/01/31 16:42 William Kemper Amazon (same) (same) JDK-8324981 Shenandoah: Move commit and soft max heap changed methods into heap
2024/01/31 14:18 Angelos Bimpoudis Oracle (same) (same) JDK-8303374 Implement JEP 455: Primitive Types in Patterns, instanceof, and switch (Preview)
2024/01/31 13:59 Eirik Bjørsnøs Independent (same) (same) JDK-8320712 Rewrite BadFactoryTest in pure Java
2024/01/31 12:44 Albert Yang Oracle (same) (same) JDK-8324771 Obsolete RAMFraction related flags
2024/01/31 12:44 Albert Yang Oracle (same) (same) JDK-8324970 Serial: Refactor signature of maintain_old_to_young_invariant
2024/01/31 11:06 Lance Andersen Oracle (same) (same) JDK-8324632 Update Zlib Data Compression Library to Version 1.3.1
2024/01/31 09:54 Per-Ake Minborg Oracle (same) (same) JDK-8323601 Improve LayoutPath.PathElement::toString
2024/01/31 06:12 Varada M IBM (same) (same) JDK-8322648 Improve class initialization barrier in TemplateTable::_new for PPC
2024/01/31 05:26 Tejesh R Oracle (same) (same) JDK-8259550 The content of the print out displayed incomplete with the NimbusLAF
2024/01/31 04:41 Amit Kumar IBM (same) (same) JDK-8322649 Improve class initialization barrier in TemplateTable::_new for S390
2024/01/30 23:56 Leonid Mesnik Oracle (same) (same) JDK-8324861 Exceptions::wrap_dynamic_exception() doesn't have ResourceMark
2024/01/30 23:52 Eirik Bjørsnøs Independent (same) (same) JDK-8324998 Add test cases for String.regionMatches comparing Turkic dotted/dotless I with uppercase latin I
2024/01/30 21:05 Leonid Mesnik Oracle (same) (same) JDK-8324582 Replace -Djava.util.concurrent.ForkJoinPool.common.parallelism to -Djdk.virtualThreadScheduler.maxPoolSize in jvmti vthread tests
2024/01/30 20:14 Emanuel Peter Oracle (same) (same) JDK-8324794 C2 SuperWord: do not ignore reductions in SuperWord::unrolling_analysis
2024/01/30 20:00 Calvin Cheung Oracle (same) (same) JDK-8323950 Null CLD while loading shared lambda proxy class with javaagent active
2024/01/30 18:10 Kim Barrett Oracle (same) (same) JDK-8324880 Rename get_stack_trace.h
2024/01/30 13:26 Roman Kennke Amazon (same) (same) JDK-8324734 Relax too-strict assert(VM_Version::supports_evex()) in Assembler::locate_operand()
2024/01/30 08:52 Albert Yang Oracle (same) (same) JDK-8324856 Serial: Move Generation::is_in to DefNewGeneration
2024/01/30 02:07 Gui Cao Independent (same) (same) JDK-8324125 Improve class initialization barrier in TemplateTable::_new for RISC-V
2024/01/30 01:08 Vladimir Kozlov Oracle (same) (same) JDK-8324865 windows-x64-slowdebug still does not build after JDK-8324840
2024/01/29 21:28 Vladimir Petko Canonical (same) (same) JDK-8242564 javadoc crashes:: class cast exception com.sun.tools.javac.code.Symtab$6
2024/01/29 20:25 Aleksey Shipilev Amazon (same) (same) JDK-8323503 x86: Shorter movptr(reg, imm) for 32-bit unsigned immediates
2024/01/29 19:54 Joshua Cao Amazon (same) (same) JDK-8324667 fold Parse::seems_stable_comparison()
2024/01/29 19:12 Douglas Simon Oracle (same) (same) JDK-8324717 Remove HotSpotJVMCICompilerFactory
2024/01/29 18:03 Harshitha Onkar Oracle (same) (same) JDK-8324733 [macos14] Problem list tests which fail due to macOS bug described in JDK-8322653
2024/01/29 17:12 Coleen Phillimore Oracle (same) (same) JDK-8324678 Replace NULL with nullptr in HotSpot gtests
2024/01/29 17:07 Coleen Phillimore Oracle (same) (same) JDK-8324681 Replace NULL with nullptr in HotSpot jtreg test native code files
2024/01/29 15:13 Aleksey Shipilev Amazon (same) (same) JDK-8324723 GHA: Upgrade some actions to avoid deprecated Node 16
2024/01/29 13:55 Thomas Schatzl Oracle (same) (same) JDK-8324840 windows-x64-slowdebug does not build anymore after JDK-8317572
2024/01/29 12:42 Albert Yang Oracle (same) (same) JDK-8324769 Serial: Remove unused TenuredGeneration::unsafe_max_alloc_nogc
2024/01/29 10:13 Emanuel Peter Oracle (same) (same) JDK-8317572 C2 SuperWord: refactor/improve TraceSuperWord, replace VectorizeDebugOption with TraceAutoVectorization
2024/01/29 09:47 Denghui Dong Alibaba (same) (same) JDK-8324213 C1: There is no need for Canonicalizer to handle IfOp
2024/01/29 09:33 kuaiwei.kw Alibaba (same) (same) JDK-8324186 use "dmb.ishst+dmb.ishld" for release barrier
2024/01/29 09:20 Christian Hagedorn Oracle (same) (same) JDK-8324236 compiler/ciReplay/TestInliningProtectionDomain.java failed with RuntimeException: should only dump inline information for ... expected true, was false
2024/01/29 09:17 Hamlin Li Huawei (same) (same) JDK-8324304 RISC-V: add hw probe flags
2024/01/29 09:14 dlunden Unknown (same) (same) JDK-8322996 BoxLockNode creation fails with assert(reg < CHUNK_SIZE) failed: sanity
2024/01/29 08:50 Emanuel Peter Oracle (same) (same) JDK-8324750 C2: rename Matcher methods using "superword" -> "autovectorization"
2024/01/29 08:46 Emanuel Peter Oracle (same) (same) JDK-8324775 C2 SuperWord: refactor visited sets
2024/01/29 08:37 Tobias Holenstein Oracle (same) (same) JDK-8210858 AArch64: remove Math.log intrinsic
2024/01/29 08:36 Thomas Schatzl Oracle (same) (same) JDK-8322484 22-b26 Regression in J2dBench-bimg_misc-G1 (and more) on Windows-x64 and macOS-x64
2024/01/29 08:03 Julian Waters Independent (same) (same) JDK-8324800 gcc windows build broken after 8322757
2024/01/29 07:38 Matthias Baesken SAP (same) (same) JDK-8324753 [AIX] adjust os_posix after JDK-8318696
2024/01/29 07:00 Emanuel Peter Oracle (same) (same) JDK-8324765 C2 SuperWord: remove dead code: SuperWord::insert_extracts
2024/01/29 06:54 Emanuel Peter Oracle (same) (same) JDK-8324752 C2 Superword: remove SuperWordRTDepCheck
2024/01/26 22:33 Joe Darcy Oracle (same) (same) JDK-8175386 Clarify exception behavior of Types utility methods
2024/01/26 22:01 Daniel Daugherty Oracle (same) (same) JDK-8324786 validate-source fails after JDK-8042981
2024/01/26 20:55 Joe Darcy Oracle (same) (same) JDK-8042981 Strip type annotations in Types' utility methods
2024/01/26 20:18 Daniel Daugherty Oracle (same) (same) JDK-8324785 ProblemList two tests on linux due to JDK-8315923
2024/01/26 18:34 Vicente Arturo Romero Zaldivar Oracle (same) (same) JDK-8323835 Updating ASM to 9.6 for JDK 23
2024/01/26 16:42 limingliu Ampere (same) (same) JDK-8315923 pretouch_memory by atomic-add-0 fragments huge pages unexpectedly
2024/01/26 13:11 Volker Simonis Amazon (same) (same) JDK-8324241 Always record evol_method deps to avoid excessive method flushing
2024/01/26 13:03 Albert Yang Oracle (same) (same) JDK-8324722 Serial: Inline block_is_obj of subclasses of Generation
2024/01/26 13:03 Albert Yang Oracle (same) (same) JDK-8324301 Obsolete MaxGCMinorPauseMillis
2024/01/26 08:51 Aleksey Shipilev Amazon (same) (same) JDK-8324659 GHA: Generic jtreg errors are not reported
2024/01/26 08:46 Sergey Bylokhov Amazon (same) (same) JDK-8324347 Enable "maybe-uninitialized" warning for FreeType 2.13.1
2024/01/26 07:57 Matthias Baesken SAP (same) (same) JDK-8324637 [aix] Implement support for reporting swap space in jdk.management
2024/01/26 03:47 Alisen Chung Oracle (same) (same) JDK-8324571 JDK 23 L10n resource files update
2024/01/26 02:30 Wang Zhuo Alibaba (same) (same) JDK-8324123 aarch64: fix prfm literal encoding in assembler
2024/01/25 22:17 Joe Darcy Oracle (same) (same) JDK-8302019 Clarify Elements.overrides
2024/01/25 22:01 Daniel Jelinski Oracle (same) (same) JDK-8223696 java/net/httpclient/MaxStreams.java failed with didn't finish within the time-out
2024/01/25 18:35 Kim Barrett Oracle (same) (same) JDK-8324492 Remove Atomic support for OopHandle
2024/01/25 18:03 Aleksey Shipilev Amazon (same) (same) JDK-8323717 Introduce test keyword for tests that need external dependencies
2024/01/25 15:50 Emanuel Peter Oracle (same) (same) JDK-8306767 Concurrent repacking of extra data in MethodData is potentially unsafe
2024/01/25 14:51 Roger Riggs Oracle (same) (same) JDK-8324657 Intermittent OOME on exception message create
2024/01/25 14:25 Albert Yang Oracle (same) (same) JDK-8324636 Serial: Remove Generation::block_is_obj
2024/01/25 10:36 Matthias Baesken SAP (same) (same) JDK-8324598 use mem_unit when working with sysinfo memory and swap related information
2024/01/25 10:07 Jatin Bhateja Intel (same) (same) JDK-8322768 Optimize non-subword vector compress and expand APIs for AVX2 target.
2024/01/25 09:35 Jaikiran Pai Oracle (same) (same) JDK-8323645 Remove unused internal sun.net.www.protocol.jar.URLJarFileCallBack interface
2024/01/25 05:44 Kim Barrett Oracle (same) (same) JDK-8324242 Avoid null check for OopHandle::ptr_raw()
2024/01/25 05:26 David Holmes Oracle (same) (same) JDK-8307788 vmTestbase/gc/gctests/LargeObjects/large003/TestDescription.java timed out
2024/01/25 03:10 xingqizheng.xqz Alibaba (same) (same) JDK-8324280 RISC-V: Incorrect implementation in VM_Version::parse_satp_mode
2024/01/24 23:42 Justin Lu Oracle (same) (same) JDK-6503196 API doc for DecimalFormat::getMaximumIntegerDigits is unclear
2024/01/24 23:25 Jie Fu Tencent (same) (same) JDK-8324647 Invalid test group of lib-test after JDK-8323515
2024/01/24 22:10 Alexander Zuev Oracle (same) (same) JDK-8320692 Null icon returned for .exe without custom icon
2024/01/24 19:15 William Kemper Amazon (same) (same) JDK-8324553 Shenandoah: Move periodic tasks closer to their collaborators
2024/01/24 19:05 Christian Stein Oracle (same) (same) JDK-8323815 Source launcher should find classes with $ in names
2024/01/24 18:52 Joshua Cao Amazon (same) (same) JDK-8322149 ConcurrentHashMap smarter presizing for copy constructor and putAll
2024/01/24 17:40 Aleksey Shipilev Amazon (same) (same) JDK-8324514 ClassLoaderData::print_on should print address of class loader
2024/01/24 16:19 Raffaello Giulietti Oracle (same) (same) JDK-8324220 jdk/jfr/event/io/TestSerializationMisdeclarationEvent.java had 22 failures
2024/01/24 13:03 Albert Yang Oracle (same) (same) JDK-8324613 Serial: Rename GenerationPool to TenuredGenerationPool
2024/01/24 12:00 Thomas Schatzl Oracle (same) (same) JDK-8321512 runtime/CommandLine/OptionsValidation/TestOptionsWithRanges.java fails on 32-bit platforms
2024/01/24 10:09 Magnus Ihse Bursie Oracle (same) (same) JDK-8324537 Remove superfluous _FILE_OFFSET_BITS=64
2024/01/24 10:02 Albert Yang Oracle (same) (same) JDK-8324512 Serial: Remove Generation::Name
2024/01/24 10:02 Albert Yang Oracle (same) (same) JDK-8324543 Remove Space::object_iterate
2024/01/24 03:14 David Holmes Oracle (same) (same) JDK-8324578 [BACKOUT] [IMPROVE] OPEN_MAX is no longer the max limit on macOS >= 10.6 for RLIMIT_NOFILE
2024/01/24 02:08 William Kemper Amazon (same) (same) JDK-8324334 Shenandoah: Improve end of process report
2024/01/23 22:22 Justin Lu Oracle (same) (same) JDK-8321545 Override toString() for Format subclasses
2024/01/23 20:33 Chris Plummer Oracle (same) (same) JDK-8323546 Cleanup jcmd docs for Compiler.perfmap and VM.cds filename parameter
2024/01/23 17:03 Aleksey Shipilev Amazon (same) (same) JDK-8323515 Create test alias "all" for all test roots
2024/01/23 16:15 Gerard Ziemski Oracle (same) (same) JDK-8300088 [IMPROVE] OPEN_MAX is no longer the max limit on macOS >= 10.6 for RLIMIT_NOFILE
2024/01/23 15:51 Albert Yang Oracle (same) (same) JDK-8324513 Inline ContiguousSpace::object_iterate_from
2024/01/23 14:07 Darragh Clarke Oracle (same) (same) JDK-8314164 java/net/HttpURLConnection/HttpURLConnectionExpectContinueTest.java fails intermittently in timeout
2024/01/23 13:19 yansendao.ysd Alibaba (same) (same) JDK-8323640 [TESTBUG]testMemoryFailCount in jdk/internal/platform/docker/TestDockerMemoryMetrics.java always fail because OOM killed
2024/01/23 12:02 Hamlin Li Huawei (same) (same) JDK-8318228 RISC-V: C2 ConvF2HF
2024/01/23 09:40 Albert Yang Oracle (same) (same) JDK-8324207 Serial: Remove Space::set_saved_mark_word
2024/01/23 09:38 Albert Yang Oracle (same) (same) JDK-8324210 Serial: Remove unused methods in Generation
2024/01/23 08:49 Kim Barrett Oracle (same) (same) JDK-8324286 Fix backsliding on use of nullptr instead of NULL
2024/01/23 08:17 Matthias Baesken SAP (same) (same) JDK-8323964 runtime/Thread/ThreadCountLimit.java fails intermittently on AIX
2024/01/23 01:09 David Holmes Oracle (same) (same) JDK-8323438 Enhance assertions for Windows sync API failures
2024/01/22 22:50 Vladimir Kozlov Oracle (same) (same) JDK-8324050 Issue store-store barrier after re-materializing objects during deoptimization
2024/01/22 19:51 Y. Ramakrishna Amazon (same) (same) JDK-8314329 AgeTable: add is_clear() & allocation spec, and relax assert to allow use of 0-index slot
2024/01/22 17:15 Naoto Sato Oracle (same) (same) JDK-8324065 Daylight saving information for `Africa/Casablanca` are incorrect
2024/01/22 13:06 Jan Lahoda Oracle (same) (same) JDK-8323657 Compilation of snippet results in VerifyError at runtime with --release 9 (and above)
2024/01/22 12:30 Aleksey Shipilev Amazon (same) (same) JDK-8322282 Incorrect LoaderConstraintTable::add_entry after JDK-8298468
2024/01/22 12:18 Tobias Holenstein Oracle (same) (same) JDK-8321984 IGV: Upgrade to Netbeans Platform 20
2024/01/22 11:03 Johan Sjölen Oracle (same) (same) JDK-8314186 runtime/8176717/TestInheritFD.java failed with "Log file was leaked"
2024/01/22 10:55 Jan Lahoda Oracle (same) (same) JDK-8323057 Recoverable errors may be reported before unrecoverable errors when annotation processing is skipped
2024/01/22 10:41 Emanuel Peter Oracle (same) (same) JDK-8324129 C2: Remove some ttyLocker usages in preparation for JDK-8306767
2024/01/22 10:14 Hamlin Li Huawei (same) (same) JDK-8323748 RISC-V: Add Zfh probe code
2024/01/22 08:22 Cesar Soares Microsoft (same) (same) JDK-8322572 AllocationMergesTests.java fails with "IRViolationException: There were one or multiple IR rule failures."
2024/01/21 23:47 martin.desruisseaux @geomatys.com (same) (same) JDK-8323108 BufferedImage.setData(Raster) should not cast float and double values to integers
2024/01/21 02:28 Kim Barrett Oracle (same) (same) JDK-8324240 Remove unused GrowableArrayView::EMPTY
2024/01/20 18:21 Erik Gahlin Oracle (same) (same) JDK-8324229 JFR: Temporarily disable assertion for missing object reference
2024/01/20 18:12 Jonathan Gibbons Oracle (same) (same) JDK-8324231 bad command-line option in make/Docs.gmk
2024/01/20 09:49 sam @gentoo.org (same) (same) JDK-8318696 Do not use LFS64 symbols on Linux
2024/01/19 22:31 Magnus Ihse Bursie Oracle (same) (same) JDK-8323675 Race in jdk.javadoc-gendata
2024/01/19 21:42 Harshitha Onkar Oracle (same) (same) JDK-8320113 [macos14] : ShapeNotSetSometimes.java fails intermittently on macOS 14
2024/01/19 18:40 Serguei Spitsyn Oracle (same) (same) JDK-8322744 VirtualThread.notifyJvmtiDisableSuspend should be static
2024/01/19 17:42 Mandy Chung Oracle (same) (same) JDK-8159927 Add a test to verify JMOD files created in the images do not have debug symbols
2024/01/19 17:11 Calvin Cheung Oracle (same) (same) JDK-8323556 CDS archive space addresses should be randomized with ArchiveRelocationMode=1
2024/01/19 17:02 Calvin Cheung Oracle (same) (same) JDK-8324041 ModuleOption.java failed with update release versioning scheme
2024/01/19 16:54 Coleen Phillimore Oracle (same) (same) JDK-8323685 PrintSystemDictionaryAtExit has mutex rank assert
2024/01/19 15:49 Christian Hagedorn Oracle (same) (same) JDK-8323154 C2: assert(cmp != nullptr && cmp->Opcode() == Op_Cmp(bt)) failed: no exit test
2024/01/19 12:59 Roman Kennke Amazon (same) (same) JDK-8322383 G1: Only preserve marks on objects that are actually moved
2024/01/19 11:48 Albert Yang Oracle (same) (same) JDK-8324147 Serial: Remove generation::compute_new_size
2024/01/19 09:10 Matthias Baesken SAP (same) (same) JDK-8322366 Add IEEE rounding mode corruption check to JNI checks
2024/01/19 08:14 Matthias Baesken SAP (same) (same) JDK-8222719 libperfstat on AIX - cleanup old API versions
2024/01/19 05:57 Tejesh R Oracle (same) (same) JDK-8295804 javax/swing/JFileChooser/JFileChooserSetLocationTest.java failed with "setLocation() is not working properly"
2024/01/18 22:28 Pavel Rappo Oracle (same) (same) JDK-8324053 Use the blessed modifier order for sealed in java.base
2024/01/18 19:06 Hannes Wallnoefer Oracle (same) (same) JDK-8320458 Improve structural navigation in API documentation
2024/01/18 19:04 Joe Darcy Oracle (same) (same) JDK-8323684 TypeMirror.{getAnnotationsByType, getAnnotation} return uninformative results
2024/01/18 17:42 Daniel Daugherty Oracle (same) (same) JDK-8324161 validate-source fails after JDK-8275338
2024/01/18 17:33 Matthew Donovan Oracle (same) (same) JDK-8321925 sun/security/mscapi/KeytoolChangeAlias.java fails with "Alias <246810> does not exist"
2024/01/18 17:05 Raffaello Giulietti Oracle (same) (same) JDK-8275338 Add JFR events for notable serialization situations
2024/01/18 15:40 Claes Redestad Oracle (same) (same) JDK-8323995 Suppress notes generated on incremental microbenchmark builds
2024/01/18 15:23 Albert Yang Oracle (same) (same) JDK-8324132 G1: Remove unimplemented G1MonitoringSupport::recalculate_eden_size
2024/01/18 15:22 Albert Yang Oracle (same) (same) JDK-8323993 Serial: Refactor gc_prologue and gc_epilogue
2024/01/18 13:16 Daniel Daugherty Oracle (same) (same) JDK-8324074 increase timeout for jvmci test TestResolvedJavaMethod.java
2024/01/18 13:15 Daniel Daugherty Oracle (same) (same) JDK-8321938 java/foreign/critical/TestCriticalUpcall.java does not need a core file
2024/01/18 13:15 Daniel Daugherty Oracle (same) (same) JDK-8324082 more monitoring test timeout adjustments
2024/01/18 12:16 Patricio Chilano Mateo Oracle (same) (same) JDK-8323595 is_aligned(p, alignof(OopT))) assertion fails in Jetty without compressed OOPs
2024/01/18 10:03 songpv @imt-soft.com (same) (same) JDK-8317287 [macos14] InterJVMGetDropSuccessTest.java: Child VM: abnormal termination
2024/01/18 09:56 Andrew Leonard Red Hat (same) (same) JDK-8323667 Library debug files contain non-reproducible full gcc include paths
2024/01/18 02:28 Gui Cao Independent (same) (same) JDK-8323694 RISC-V: Unnecessary ResourceMark in NativeCall::set_destination_mt_safe
2024/01/18 01:23 Renjith Kannath Pariyangad Oracle (same) (same) JDK-8316497 ColorConvertOp - typo for non-ICC conversions needs one-line fix
2024/01/17 19:35 Sergey Bylokhov Amazon (same) (same) JDK-8323554 The typos in Javadoc: "@return if "
2024/01/17 18:08 Anthony Scarpino Oracle (same) (same) JDK-8322100 Fix GCMIncrementByte4 & GCMIncrementDirect4, and increase overlap testing
2024/01/17 16:44 Artem Semenov Independent (same) (same) JDK-8317771 [macos14] Expand/collapse a JTree using keyboard freezes the application in macOS 14 Sonoma
2024/01/17 16:34 Brian Burkhalter Oracle (same) (same) JDK-8323710 (fc) FileChannel.lock creates a FileKey with a poor hashCode after JDK-8321429 (win)
2024/01/17 16:34 Brian Burkhalter Oracle (same) (same) JDK-8321561 (fs) Clarify non-atomic behavior of Files.move
2024/01/17 15:41 Claes Redestad Oracle (same) (same) JDK-8323794 Remove unused jimage compressor plugin configuration
2024/01/17 12:48 Aleksey Shipilev Amazon (same) (same) JDK-8321137 Reconsider ICStub alignment
2024/01/17 10:56 Alan Bateman Oracle (same) (same) JDK-8323612 IOVecWrapper should be changed to be TerminatingThreadLocal
2024/01/17 10:25 Albert Yang Oracle (same) (same) JDK-8323779 Serial: Remove Generation::promotion_attempt_is_safe
2024/01/17 09:34 Joachim Kern SAP (same) (same) JDK-8319382 com/sun/jdi/JdwpAllowTest.java shows failures on AIX if prefixLen of mask is larger than 32 in IPv6 case
2024/01/17 08:07 Tobias Holenstein Oracle (same) (same) JDK-8316756 C2 EA fails with "missing memory path" when encountering unsafe_arraycopy stub call
2024/01/17 07:50 Roberto Castaneda Lozano Oracle (same) (same) JDK-8322692 ZGC: avoid over-unrolling due to hidden barrier size
2024/01/17 06:50 Richard Reingruber SAP (same) (same) JDK-8290965 PPC64: Implement post-call NOPs
2024/01/17 02:28 Prasanta Sadhukhan Oracle (same) (same) JDK-8318112 CSS percentage values are capped at 100%
2024/01/17 00:29 Joe Darcy Oracle (same) (same) JDK-8323839 Expand use of Messager convenience methods in langtools regression tests
2024/01/16 22:54 John Jiang Tencent (same) (same) JDK-8320449 ECDHKeyAgreement should validate parameters before using them
2024/01/16 22:01 Joshua Cao Amazon (same) (same) JDK-8323820 [MacOS] build failure: non-void function does not return a value
2024/01/16 19:31 Douglas Simon Oracle (same) (same) JDK-8323616 [JVMCI] TestInvalidJVMCIOption.java fails intermittently with NPE
2024/01/16 18:41 Jonathan Gibbons Oracle (same) (same) JDK-8299627 Fix/improve handling of "missing" element-list file
2024/01/16 14:42 Thomas Schatzl Oracle (same) (same) JDK-8323731 Unproblemlist gc/stress/TestStressG1Humongous.java
2024/01/16 14:26 Albert Yang Oracle (same) (same) JDK-8323800 Serial: Fix include guard macro in generation.hpp
2024/01/16 14:26 Stefan Karlsson Oracle (same) (same) JDK-8323730 Tweak TestZAllocationStallEvent.java to allocate smaller objects
2024/01/16 13:59 Erik Gahlin Oracle (same) (same) JDK-8322675 JFR: Fail-fast mode when constants cannot be resolved
2024/01/16 13:31 Markus Grönlund Oracle (same) (same) JDK-8323631 JfrTypeSet::write_klass can enqueue a CLD klass that is unloading
2024/01/16 13:25 Jorn Vernee Oracle (same) (same) JDK-8323651 compiler/c2/irTests/TestPrunedExHandler.java fails with -XX:+DeoptimizeALot
2024/01/16 12:13 Chris Hegarty Independent (same) (same) JDK-8323659 LinkedTransferQueue add and put methods call overridable offer
2024/01/16 12:00 Thomas Schatzl Oracle (same) (same) JDK-8323635 Test gc/g1/TestHumongousAllocConcurrentStart.java fails with -XX:TieredStopAtLevel=3
2024/01/16 11:56 Albert Yang Oracle (same) (same) JDK-8323780 Serial: Remove unused _full_collections_completed
2024/01/16 10:30 Stefan Karlsson Oracle (same) (same) JDK-8323716 Only print ZGC Phase Switch events in hs_err files when running with ZGC
2024/01/16 10:15 Emanuel Peter Oracle (same) (same) JDK-8320175 [BACKOUT] 8316533: C2 compilation fails with assert(verify(phase)) failed: missing Value() optimization
2024/01/16 08:39 Albert Yang Oracle (same) (same) JDK-8323715 Serial: Move genMemoryPools to serial folder
2024/01/16 08:38 Albert Yang Oracle (same) (same) JDK-8323738 Serial: Remove unreachable methods in Generation
2024/01/16 05:15 Yude Lin Alibaba (same) (same) JDK-8323122 AArch64: Increase itable stub size estimate
2024/01/15 18:41 Hamlin Li Huawei (same) (same) JDK-8318227 RISC-V: C2 ConvHF2F
2024/01/15 16:30 Per-Ake Minborg Oracle (same) (same) JDK-8323745 Missing comma in copyright header in TestScope
2024/01/15 16:10 zjx001202 Independent (same) (same) JDK-8321620 Optimize JImage decompressors
2024/01/15 15:21 Albert Yang Oracle (same) (same) JDK-8323726 Serial: Remove unused definitions in Generation
2024/01/15 14:39 Andrew Leonard Red Hat (same) (same) JDK-8323671 DevKit build gcc libraries contain full paths to source location
2024/01/15 14:34 Guoxiong Li Independent (same) (same) JDK-8322279 Generational ZGC: Use ZFragmentationLimit and ZYoungCompactionLimit as percentage instead of multiples
2024/01/15 14:14 Magnus Ihse Bursie Oracle (same) (same) JDK-8323637 Capture hotspot replay files in GHA
2024/01/15 13:09 Rajat Mahajan Oracle (same) (same) JDK-8320328 Restore interrupted flag in ImageIcon.loadImage
2024/01/15 12:58 Albert Yang Oracle (same) (same) JDK-8323722 Serial: Remove unused no_gc_in_progress
2024/01/15 12:16 Christian Hagedorn Oracle (same) (same) JDK-8323101 C2: assert(n->in(0) == nullptr) failed: divisions with zero check should already have bailed out earlier in split-if
2024/01/15 12:03 Aleksey Shipilev Amazon (same) (same) JDK-8323584 AArch64: Unnecessary ResourceMark in NativeCall::set_destination_mt_safe
2024/01/15 11:20 Jan Kratochvil Azul (same) (same) JDK-8323700 Add fontconfig requirement to building.md for Alpine Linux
2024/01/15 11:12 Kevin Walls Oracle (same) (same) JDK-8318707 Remove the Java Management Extension (JMX) Management Applet (m-let) feature
2024/01/15 10:44 Emanuel Peter Oracle (same) (same) JDK-8323641 Test compiler/loopopts/superword/TestAlignVectorFuzzer.java timed out
2024/01/15 10:41 Emanuel Peter Oracle (same) (same) JDK-8323577 C2 SuperWord: remove AlignVector restrictions on IR tests added in JDK-8305055
2024/01/15 09:35 Thomas Schatzl Oracle (same) (same) JDK-8323610 G1: HeapRegion pin count should be size_t to avoid overflows
2024/01/15 09:13 lizbing07734 Independent (same) (same) JDK-8323660 Serial: Fix header ordering and indentation
2024/01/15 09:10 Aleksey Shipilev Amazon (same) (same) JDK-8323519 Add applications/ctw/modules to Hotspot tiered testing
2024/01/15 07:40 lizbing07734 Independent (same) (same) JDK-8323693 Update some copyright announcements in the new files created in 8234502
2024/01/15 06:48 zhiqiang.zang Independent (same) (same) JDK-8322077 Add Ideal transformation: (~a) | (~b) => ~(a & b)
2024/01/14 23:05 Sergey Bylokhov Amazon (same) (same) JDK-4760025 sRGB conversions to and from CIE XYZ incorrect
2024/01/14 22:01 David Holmes Oracle (same) (same) JDK-8323243 JNI invocation of an abstract instance method corrupts the stack
2024/01/13 14:12 Varada M IBM (same) (same) JDK-8301466 [AIX] Revisit CommittedVirtualMemoryTest
2024/01/12 23:50 Sergey Bylokhov Amazon (same) (same) JDK-8323562 SaslInputStream.read() may return wrong value
2024/01/12 22:16 Alisen Chung Oracle (same) (same) JDK-8321489 Update LCMS to 2.16
2024/01/12 20:41 Alex Menkov Oracle (same) (same) JDK-8318563 GetClassFields should not use random access to field
2024/01/12 19:40 Joe Darcy Oracle (same) (same) JDK-8322979 Add informative discussion to Modifier
2024/01/12 19:21 Harshitha Onkar Oracle (same) (same) JDK-8323617 Add missing null checks to GetMousePositionWithPopup.java test
2024/01/12 18:57 William Kemper Amazon (same) (same) JDK-8323627 Shenandoah: Refactor init logger
2024/01/12 17:56 Harshitha Onkar Oracle (same) (same) JDK-8312518 [macos13] setFullScreenWindow() shows black screen on macOS 13 & above
2024/01/12 17:14 Rajat Mahajan Oracle (same) (same) JDK-8301994 Remove unused code from awt_List.cpp
2024/01/12 17:04 William Kemper Amazon (same) (same) JDK-8323629 Shenandoah: Fix missing include and declaration
2024/01/12 15:21 Denghui Dong Alibaba (same) (same) JDK-8322735 C2: minor improvements of bubble sort used in SuperWord::packset_sort
2024/01/12 14:34 Axel Boldt-Christmas Oracle (same) (same) JDK-8319773 Avoid inflating monitors when installing hash codes for LM_LIGHTWEIGHT
2024/01/12 13:51 Albert Yang Oracle (same) (same) JDK-8322537 Parallel: Remove experimental adjustment in PSAdaptiveSizePolicy
2024/01/12 13:12 Erik Gahlin Oracle (same) (same) JDK-8323425 JFR: Auto-generated filename doesn't work with time-limited recording
2024/01/12 12:29 Matthias Baesken SAP (same) (same) JDK-8323008 filter out harmful -std* flags added by autoconf from CXX
2024/01/12 10:56 lizbing07734 Independent (same) (same) JDK-8234502 Merge GenCollectedHeap and SerialHeap
2024/01/12 10:43 Cesar Soares Microsoft (same) (same) JDK-8323190 Segfault during deoptimization of C2-compiled code
2024/01/12 10:00 Claes Redestad Oracle (same) (same) JDK-8323529 Relativize test image dependencies in microbenchmarks
2024/01/12 09:32 Stefan Karlsson Oracle (same) (same) JDK-8322957 Generational ZGC: Relocation selection must join the STS
2024/01/12 08:57 Stefan Karlsson Oracle (same) (same) JDK-8323297 Fix incorrect placement of precompiled.hpp include lines
2024/01/12 08:33 Alan Bateman Oracle (same) (same) JDK-8323296 java/lang/Thread/virtual/stress/GetStackTraceALotWhenPinned.java#id1 timed out
2024/01/12 08:21 Afshin Zafari Oracle (same) (same) JDK-8280056 gtest/LargePageGtests.java#use-large-pages failed "os.release_one_mapping_multi_commits_vm"
2024/01/12 07:53 Abhishek Kumar Oracle (same) (same) JDK-8258979 The image didn't show correctly with GTK LAF
2024/01/12 06:12 Kim Barrett Oracle (same) (same) JDK-8322757 Enable -Wparentheses warnings
2024/01/12 02:55 Renjith Kannath Pariyangad Oracle (same) (same) JDK-8320673 PageFormat/CustomPaper.java has no Pass/Fail buttons; multiple instructions
2024/01/11 22:58 Alexey Semenyuk Oracle (same) (same) JDK-8322799 Test JPKG003-013: ServiceTest fails because the user cannot uninstall the "servicetest" package on OEL 9.2 x64 and OEL 9.2 64-bit Arm (aarch64)
2024/01/11 22:38 Joe Wang Oracle (same) (same) JDK-8323571 Regression in source resolution process
2024/01/11 21:48 Pavel Rappo Oracle (same) (same) JDK-8310813 Simplify and modernize equals, hashCode, and compareTo for BigInteger
2024/01/11 20:59 Justin Lu Oracle (same) (same) JDK-8322235 Split up and improve LocaleProvidersRun
2024/01/11 18:13 Chris Plummer Oracle (same) (same) JDK-8323213 Fix some javadoc broken links in ObjectReference, and other misc javadoc cleanups
2024/01/11 17:37 Tim Prinzing Oracle (same) (same) JDK-8319571 Update jni/nullCaller/NullCallerTest.java to accept flags or mark as flagless
2024/01/11 16:54 Sandhya Viswanathan Intel (same) (same) JDK-8321712 C2: "failed: Multiple uses of register" in C2_MacroAssembler::vminmax_fp
2024/01/11 15:19 Matthew Donovan Oracle (same) (same) JDK-8319128 sun/security/pkcs11 tests fail on OL 7.9 aarch64
2024/01/11 13:45 Weijun Wang Oracle (same) (same) JDK-8322971 KEM.getInstance() should check if a 3rd-party security provider is signed
2024/01/11 13:12 Joachim Kern SAP (same) (same) JDK-8320890 [AIX] Find a better way to mimic dl handle equality
2024/01/11 12:17 Varada M IBM (same) (same) JDK-8323276 StressDirListings.java fails on AIX
2024/01/11 09:00 Roland Westrelin Red Hat (same) (same) JDK-8319793 C2 compilation fails with "Bad graph detected in build_loop_late" after JDK-8279888
2024/01/11 08:16 Viktor Klang Oracle (same) (same) JDK-8314515 java/util/concurrent/SynchronousQueue/Fairness.java failed with "Error: fair=false i=8 j=0"
2024/01/11 08:13 Matthias Baesken SAP (same) (same) JDK-8323330 [BACKOUT] JDK-8276809: java/awt/font/JNICheck/FreeTypeScalerJNICheck.java shows JNI warning on Windows
2024/01/11 07:34 Tejesh R Oracle (same) (same) JDK-8264102 JTable Keyboards Navigation differs with Test Instructions.
2024/01/11 07:17 Denghui Dong Alibaba (same) (same) JDK-8323188 JFR: Needless RESOURCE_ARRAY when sending EventOSInformation
2024/01/11 06:32 Eirik Bjørsnøs Independent (same) (same) JDK-8322830 Add test case for ZipFile opening a ZIP with no entries
2024/01/11 06:32 Eirik Bjørsnøs Independent (same) (same) JDK-8321616 Retire binary test vectors in test/jdk/java/util/zip/ZipFile
2024/01/11 00:36 Alex Menkov Oracle (same) (same) JDK-8317804 com/sun/jdi/JdwpAllowTest.java fails on Alpine 3.17 / 3.18
2024/01/10 21:42 Eirik Bjørsnøs Independent (same) (same) JDK-8322565 (zipfs) Files.setPosixPermissions should preserve 'external file attributes' bits
2024/01/10 19:42 Xin Liu Amazon (same) (same) JDK-8322982 CTW fails to build after 8308753
2024/01/10 18:54 Naoto Sato Oracle (same) (same) JDK-8320788 The system properties page is missing some properties
2024/01/10 18:46 Joe Darcy Oracle (same) (same) JDK-8322878 Including sealing information Class.toGenericString()
2024/01/10 18:37 Markus Grönlund Oracle (same) (same) JDK-8323540 assert((!((((method)->is_trace_flag_set(((1 << 4) << 8))))))) failed: invariant
2024/01/10 17:52 Vicente Arturo Romero Zaldivar Oracle (same) (same) JDK-8322477 order of subclasses in the permits clause can differ between compilations
2024/01/10 17:29 Gerard Ziemski Oracle (same) (same) JDK-8313083 Print 'rss' and 'cache' as part of the container information
2024/01/10 17:10 William Kemper Amazon (same) (same) JDK-8323428 Shenandoah: Unused memory in regions compacted during a full GC should be mangled
2024/01/10 16:42 Viktor Klang Oracle (same) (same) JDK-8309218 java/util/concurrent/locks/Lock/OOMEInAQS.java still times out with ZGC, Generational ZGC, and SerialGC
2024/01/10 16:34 Brian Burkhalter Oracle (same) (same) JDK-7057369 (fs spec) FileStore getUsableSpace and getUnallocatedSpace could be clearer
2024/01/10 15:19 Albert Yang Oracle (same) (same) JDK-8323518 Parallel: Remove unused methods in psParallelCompact.hpp
2024/01/10 15:18 Albert Yang Oracle (same) (same) JDK-8323005 Parallel: Refactor PSPromotionManager::claim_or_forward_depth
2024/01/10 15:03 Matthias Baesken SAP (same) (same) JDK-8323331 fix typo hpage_pdm_size
2024/01/10 14:07 Serguei Spitsyn Oracle (same) (same) JDK-8321685 Missing ResourceMark in code called from JvmtiEnvBase::get_vthread_jvf
2024/01/10 13:25 Stefan Karlsson Oracle (same) (same) JDK-8323508 Remove TestGCLockerWithShenandoah.java line from TEST.groups
2024/01/10 13:13 Jorn Vernee Oracle (same) (same) JDK-8322637 java/foreign/critical/TestCriticalUpcall.java timed out
2024/01/10 13:13 Jorn Vernee Oracle (same) (same) JDK-8322324 java/foreign/TestStubAllocFailure.java times out while waiting for forked process
2024/01/10 13:03 Markus Grönlund Oracle (same) (same) JDK-8316241 Test jdk/jdk/jfr/jvm/TestChunkIntegrity.java failed
2024/01/10 12:18 Guoxiong Li Independent (same) (same) JDK-8322278 Generational ZGC: Adjust the comment of ZHeuristics::use_per_cpu_shared_small_pages
2024/01/10 12:18 Richard Reingruber SAP (same) (same) JDK-8322294 Cleanup NativePostCallNop
2024/01/10 12:15 Guoxiong Li Independent (same) (same) JDK-8314629 Generational ZGC: Clearing All SoftReferences log line lacks GCId
2024/01/10 11:28 Albert Yang Oracle (same) (same) JDK-8322828 Parallel: Rename ParallelCompactData::_region_start
2024/01/10 10:56 Albert Yang Oracle (same) (same) JDK-8323499 Remove unused methods in space.hpp
2024/01/10 09:57 Thomas Schatzl Oracle (same) (same) JDK-8322987 Remove gc/stress/gclocker/TestGCLocker* since they always fail with OOME
2024/01/10 08:30 Tobias Holenstein Oracle (same) (same) JDK-8277869 Maven POMs are using HTTP links where HTTPS is available
2024/01/10 07:31 zhiqiang.zang Independent (same) (same) JDK-8322589 Add Ideal transformation: (~a) & (~b) => ~(a | b)
2024/01/10 00:19 Kim Barrett Oracle (same) (same) JDK-8322816 RISC-V: Incorrect guarantee in patch_vtype
2024/01/09 23:11 Naoto Sato Oracle (same) (same) JDK-8320919 Clarify Locale related system properties
2024/01/09 22:47 Kim Barrett Oracle (same) (same) JDK-8322817 RISC-V: Eliminate -Wparentheses warnings in riscv code
2024/01/09 22:33 Kim Barrett Oracle (same) (same) JDK-8323115 x86-32: Incorrect predicates for cmov instruct transforms with UseSSE
2024/01/09 22:26 Kim Barrett Oracle (same) (same) JDK-8322880 Eliminate -Wparentheses warnings in arm32 code
2024/01/09 22:05 Sergey Bylokhov Amazon (same) (same) JDK-8323210 Update the usage of cmsFLAGS_COPY_ALPHA
2024/01/09 22:04 Mandy Chung Oracle (same) (same) JDK-8322809 SystemModulesMap::classNames and moduleNames arrays do not match the order
2024/01/09 19:37 Albert Yang Oracle (same) (same) JDK-8323318 Remove unused Space::is_free_block
2024/01/09 19:31 Alex Menkov Oracle (same) (same) JDK-8322237 Heap dump contains duplicate thread records for mounted virtual threads
2024/01/09 17:03 Thomas Schatzl Oracle (same) (same) JDK-8323066 gc/g1/TestSkipRebuildRemsetPhase.java fails with 'Skipping Remembered Set Rebuild.' missing
2024/01/09 15:52 lizbing07734 Independent (same) (same) JDK-8322890 Directly return in OldPLABSizeConstraintFunc
2024/01/09 14:23 Albert Yang Oracle (same) (same) JDK-8323284 Remove unused FilteringClosure declaration
2024/01/09 13:47 Thomas Schatzl Oracle (same) (same) JDK-8322330 JavadocHelperTest.java OOMEs with Parallel GC and ZGC
2024/01/09 13:26 lizbing07734 Independent (same) (same) JDK-8233443 G1 DetailedUsage class names overly generic for global namespace
2024/01/09 11:36 Pavel Rappo Oracle (same) (same) JDK-8322936 Update blessed-modifier-order.sh for default, sealed, and non-sealed
2024/01/09 11:31 Pavel Rappo Oracle (same) (same) JDK-8310277 jdk/javadoc/doclet/testMethodCommentAlgorithm/TestMethodCommentsAlgorithm.java fails with IllegalStateException
2024/01/09 10:37 Albert Yang Oracle (same) (same) JDK-8323264 Serial: Remove unused GenerationBlockSizeClosure
2024/01/09 10:33 Boris Ulasevich BellSoft (same) (same) JDK-8322858 compiler/c2/aarch64/TestFarJump.java fails on AArch64 due to unexpected PrintAssembly output
2024/01/09 08:19 David Holmes Oracle (same) (same) JDK-8323241 jcmd manpage should use lists for argument lists
2024/01/09 07:34 Robbin Ehn Rivos (same) (same) JDK-8320069 RISC-V: Add Zcb instructions
2024/01/09 07:26 Ludovic Henry Rivos (same) (same) JDK-8319716 RISC-V: Add SHA-2
2024/01/09 07:05 Alan Bateman Oracle (same) (same) JDK-8322829 Refactor nioBlocker to avoid blocking while holding Thread's interrupt lock
2024/01/09 06:11 Albert Yang Oracle (same) (same) JDK-8320864 Serial: Extract out Full GC related fields from ContiguousSpace
2024/01/09 04:36 Sundararajan Athijegannathan Oracle (same) (same) JDK-8310995 missing @since tags in 36 jdk.dynalink classes
2024/01/09 04:04 Weibing Xiao Oracle (same) (same) JDK-8318971 Better Error Handling for Jar Tool When Processing Non-existent Files
2024/01/08 23:53 Calvin Cheung Oracle (same) (same) JDK-8322657 CDS filemap fastdebug assert while loading Graal CE Polyglot in isolated classloader
2024/01/08 22:41 Calvin Cheung Oracle (same) (same) JDK-8323032 OptimizedModuleHandlingTest failed in dynamic CDS archive mode
2024/01/08 21:26 Kim Barrett Oracle (same) (same) JDK-8322759 Eliminate -Wparentheses warnings in compiler code
2024/01/08 20:17 Mikael Vidstedt Oracle (same) (same) JDK-8274300 Address dsymutil warning by excluding platform specific files
2024/01/08 19:58 Rajat Mahajan Oracle (same) (same) JDK-8322545 Declare newInsets as static in ThemeReader.cpp
2024/01/08 19:46 Joshua Cao Amazon (same) (same) JDK-8323095 Expand TraceOptoParse block output abbreviations
2024/01/08 18:53 Xin Liu Amazon (same) (same) JDK-8320128 Clean up Parse constructor for OSR
2024/01/08 16:56 Chris Plummer Oracle (same) (same) JDK-8322980 Debug agent's dumpThread() API should update thread's name before printing it
2024/01/08 16:44 William Kemper Amazon (same) (same) JDK-8323086 Shenandoah: Heap could be corrupted by oom during evacuation
2024/01/08 16:10 Emanuel Peter Oracle (same) (same) JDK-8310190 C2 SuperWord: AlignVector is broken, generates misaligned packs
2024/01/08 15:53 Ilya Gavrilin Independent (same) (same) JDK-8322790 RISC-V: Tune costs for shuffles with no conversion
2024/01/08 14:55 Jorn Vernee Oracle (same) (same) JDK-8320310 CompiledMethod::has_monitors flag can be incorrect
2024/01/08 14:09 Jan Lahoda Oracle (same) (same) JDK-8322003 JShell - Incorrect type inference in lists of records implementing interfaces
2024/01/08 13:47 Thomas Stuefe Red Hat (same) (same) JDK-8318444 Write details about compilation bailouts into crash reports
2024/01/08 13:32 Fredrik Bredberg Oracle (same) (same) JDK-8320317 ObjectMonitor NotRunnable is not really an optimization
2024/01/08 13:30 Fredrik Bredberg Oracle (same) (same) JDK-8321371 SpinPause() not implemented for bsd_aarch64/macOS
2024/01/08 12:57 Christian Hagedorn Oracle (same) (same) JDK-8310711 [IR Framework] Remove safepoint while printing handling
2024/01/08 11:45 Matthias Baesken SAP (same) (same) JDK-8276809 java/awt/font/JNICheck/FreeTypeScalerJNICheck.java shows JNI warning on Windows
2024/01/08 11:41 Markus Grönlund Oracle (same) (same) JDK-8322489 22-b27: Up to 7% regression in all Footprint3-*-G1/ZGC
2024/01/08 10:27 Aleksey Shipilev Amazon (same) (same) JDK-8323065 Unneccesary CodeBlob lookup in CompiledIC::internal_set_ic_destination
2024/01/08 09:01 Kim Barrett Oracle (same) (same) JDK-8323110 Eliminate -Wparentheses warnings in ppc code
2024/01/08 08:20 Per-Ake Minborg Oracle (same) (same) JDK-8321786 SegmentAllocator:allocateFrom(ValueLayout, MemorySegment,ValueLayout,long,long) spec mismatch in exception scenario
2024/01/08 07:30 Kim Barrett Oracle (same) (same) JDK-8322806 Eliminate -Wparentheses warnings in aarch64 code
2024/01/08 02:46 Prasanta Sadhukhan Oracle (same) (same) JDK-8322754 click JComboBox when dialog about to close causes IllegalComponentStateException
2024/01/08 02:37 Kim Barrett Oracle (same) (same) JDK-8322815 Eliminate -Wparentheses warnings in shenandoah code
2024/01/06 18:24 Alan Bateman Oracle (same) (same) JDK-8322846 Running with -Djdk.tracePinnedThreads set can hang
2024/01/06 08:52 Alan Bateman Oracle (same) (same) JDK-8319757 java/nio/channels/DatagramChannel/InterruptibleOrNot.java failed: wrong exception thrown
2024/01/05 22:16 Jonathan Gibbons Oracle (same) (same) JDK-8323016 Improve reporting for bad options
2024/01/05 19:00 David Leopoldseder Oracle (same) (same) JDK-8322636 [JVMCI] HotSpotSpeculationLog can be inconsistent across a single compile
2024/01/05 17:53 Chris Plummer Oracle (same) (same) JDK-8322981 Fix 2 locations in JDI that throw IOException without using the "Caused by" exception
2024/01/05 17:04 Aleksey Shipilev Amazon (same) (same) JDK-8322954 Shenandoah: Convert evac-update closures asserts to rich asserts
2024/01/05 16:26 Daniel Daugherty Oracle (same) (same) JDK-8323075 ProblemList runtime/cds/appcds/jigsaw/modulepath/OptimizeModuleHandlingTest.java
2024/01/05 16:26 Daniel Daugherty Oracle (same) (same) JDK-8323073 ProblemList gc/g1/TestSkipRebuildRemsetPhase.java on linux-aarch64
2024/01/05 15:40 Tobias Hartmann Oracle (same) (same) JDK-8322985 [BACKOUT] 8318562: Computational test more than 2x slower when AVX instructions are used
2024/01/05 13:48 Tobias Hartmann Oracle (same) (same) JDK-8310844 [AArch64] C1 compilation fails because monitor offset in OSR buffer is too large for immediate
2024/01/05 11:34 Jan Lahoda Oracle (same) (same) JDK-8322532 JShell : Unnamed variable issue
2024/01/05 11:13 Tobias Hartmann Oracle (same) (same) JDK-8323012 C2 fails with fatal error: no reachable node should have no use
2024/01/05 10:39 William Kemper Amazon (same) (same) JDK-8323021 Shenandoah: Encountered reference count always attributed to first worker thread
2024/01/05 09:23 Denghui Dong Alibaba (same) (same) JDK-8322989 New test serviceability/HeapDump/FullGCHeapDumpLimitTest.java fails
2024/01/05 09:12 Stefan Karlsson Oracle (same) (same) JDK-8321812 Update GC tests to use execute[Limited]TestJava
2024/01/05 09:07 Stefan Karlsson Oracle (same) (same) JDK-8322920 Some ProcessTools.execute* functions are declared to throw Throwable
2024/01/05 08:12 johny.jose Oracle (same) (same) JDK-8322725 (tz) Update Timezone Data to 2023d
2024/01/05 04:39 Gui Cao Independent (same) (same) JDK-8322583 RISC-V: Enable fast class initialization checks
2024/01/05 00:00 Calvin Cheung Oracle (same) (same) JDK-8322322 Support archived full module graph when -Xbootclasspath/a is used
2024/01/04 17:22 Chris Plummer Oracle (same) (same) JDK-8322978 Remove debug agent debugMonitorTimedWait() function. It is no longer used.
2024/01/04 17:16 Naoto Sato Oracle (same) (same) JDK-8322647 Short name for the `Europe/Lisbon` time zone is incorrect
2024/01/04 17:16 Justin Lu Oracle (same) (same) JDK-8319626 Override toString() for ZipFile
2024/01/04 16:55 Joshua Cao Amazon (same) (same) JDK-8322976 Remove reference to transform_no_reclaim
2024/01/04 16:28 Daniel Daugherty Oracle (same) (same) JDK-8323011 ProblemList serviceability/HeapDump/FullGCHeapDumpLimitTest.java
2024/01/04 15:20 Alan Bateman Oracle (same) (same) JDK-8323002 test/jdk/java/lang/Thread/virtual/stress/GetStackTraceALotWhenPinned.java times out on macosx-x64
2024/01/04 13:11 Denghui Dong Alibaba (same) (same) JDK-8322781 C1: Debug build crash in GraphBuilder::vmap() when print stats
2024/01/04 12:46 Jim Laskey Oracle (same) (same) JDK-8322512 StringBuffer.repeat does not work correctly after toString() was called
2024/01/04 11:35 Albert Yang Oracle (same) (same) JDK-8323000 Parallel: Remove unused class declarations in psScavenge
2024/01/04 08:39 Aleksey Shipilev Amazon (same) (same) JDK-8237842 Separate definitions for default cache line and padding sizes
2024/01/04 08:32 Albert Yang Oracle (same) (same) JDK-8322888 Parallel: Remove unused variables in PSPromotionManager
2024/01/04 08:31 Albert Yang Oracle (same) (same) JDK-8322298 Obsolete unused AdaptiveSizePolicyCollectionCostMargin
2024/01/04 08:21 Matthias Baesken SAP (same) (same) JDK-8322945 Problemlist runtime/CompressedOops/CompressedClassPointers.java on AIX
2024/01/04 08:06 Matthias Baesken SAP (same) (same) JDK-8322782 Clean up usages of unnecessary fully qualified class name "java.util.Arrays"
2024/01/04 05:59 Alan Bateman Oracle (same) (same) JDK-8322818 Thread::getStackTrace can fail with InternalError if virtual thread is timed-parked when pinned
2024/01/04 05:04 Joe Wang Oracle (same) (same) JDK-8322214 Return value of XMLInputFactory.getProperty() changed from boolean to String in JDK 22 early access builds
2024/01/04 03:20 Denghui Dong Alibaba (same) (same) JDK-8321404 Limit the number of heap dumps triggered by HeapDumpBeforeFullGC/AfterFullGC
2024/01/04 01:36 Scott Gibbons Intel (same) (same) JDK-8321599 Data loss in AVX3 Base64 decoding
2024/01/03 22:30 David Holmes Oracle (same) (same) JDK-8319948 jcmd man page needs to be updated
2024/01/03 21:23 Brian Burkhalter Oracle (same) (same) JDK-8322877 java/io/BufferedInputStream/TransferTo.java failed with IndexOutOfBoundsException
2024/01/03 20:13 Kim Barrett Oracle (same) (same) JDK-8322879 Eliminate -Wparentheses warnings in x86-32 code
2024/01/03 20:10 Matias Saavedra Silva Oracle (same) (same) JDK-8320276 Improve class initialization barrier in TemplateTable::_new
2024/01/03 19:23 Mikael Vidstedt Oracle (same) (same) JDK-8322873 Duplicate -ljava -ljvm options for libinstrument
2024/01/03 17:17 Daniel Daugherty Oracle (same) (same) JDK-8322963 ProblemList java/io/BufferedInputStream/TransferTo.java
2024/01/03 15:09 ckozak Independent (same) (same) JDK-8322142 JFR: Periodic tasks aren't orphaned between recordings
2024/01/03 14:59 Alan Bateman Oracle (same) (same) JDK-8320707 Virtual thread test updates
2024/01/03 13:10 Denghui Dong Alibaba (same) (same) JDK-8322853 Should use ConditionalMutexLocker in NativeHeapTrimmerThread::print_state
2024/01/03 13:08 Denghui Dong Alibaba (same) (same) JDK-8322779 C1: Remove the unused counter 'totalInstructionNodes'
2024/01/03 09:15 Matthias Baesken SAP (same) (same) JDK-8322783 prioritize /etc/os-release over /etc/SuSE-release in hs_err/info output
2024/01/03 08:53 Stefan Karlsson Oracle (same) (same) JDK-8321713 Harmonize executeTestJvm with create[Limited]TestJavaProcessBuilder
2024/01/03 08:27 John Jiang Tencent (same) (same) JDK-8322766 Micro bench SSLHandshake should use default algorithms
2024/01/03 07:48 Stefan Karlsson Oracle (same) (same) JDK-8321718 ProcessTools.executeProcess calls waitFor before logging
2024/01/03 06:12 Albert Yang Oracle (same) (same) JDK-8322841 Parallel: Remove unused using-declaration in MutableNUMASpace
2024/01/03 04:17 Guoxiong Li Independent (same) (same) JDK-8322801 RISC-V: The riscv path of the debian sysroot had been changed
2024/01/02 23:05 Joe Darcy Oracle (same) (same) JDK-8322248 Fix inconsistent wording in ElementFilter.typesIn
2024/01/02 22:47 Kim Barrett Oracle (same) (same) JDK-8322805 Eliminate -Wparentheses warnings in x86 code
2024/01/02 22:32 Kim Barrett Oracle (same) (same) JDK-8322758 Eliminate -Wparentheses warnings in C2 code
2024/01/02 22:22 Patricio Chilano Mateo Oracle (same) (same) JDK-8320275 assert(_chunk->bitmap().at(index)) failed: Bit not set at index
2024/01/02 21:57 Kim Barrett Oracle (same) (same) JDK-8322807 Eliminate -Wparentheses warnings in gc code
2024/01/02 20:35 Brian Burkhalter Oracle (same) (same) JDK-8322868 java/io/BufferedInputStream/TransferToTrusted.java has bad copyright header
2024/01/02 20:31 Eirik Bjørsnøs Independent (same) (same) JDK-8322802 Add testing for ZipFile.getEntry respecting the 'Language encoding' flag
2024/01/02 20:05 Sergey Tsypanov Independent (same) (same) JDK-8320971 Use BufferedInputStream.buf directly when param of implTransferTo() is trusted
2024/01/02 17:08 William Kemper Amazon (same) (same) JDK-8322503 Shenandoah: Clarify gc state usage
2024/01/02 16:16 Renjith Kannath Pariyangad Oracle (same) (same) JDK-8320343 Generate GIF images for AbstractButton/5049549/bug5049549.java
2024/01/02 12:58 Adam Sotona Oracle (same) (same) JDK-8320360 ClassFile.parse: Some defect class files cause unexpected exceptions to be thrown
2024/01/02 12:39 Adam Sotona Oracle (same) (same) JDK-8321540 ClassSignature.parseFrom() throws StringIndexOutOfBoundsException for invalid signatures
2024/01/02 11:15 Jan Lahoda Oracle (same) (same) JDK-8322159 ThisEscapeAnalyzer crashes for erroneous code
2024/01/02 11:10 anupam.dev Oracle (same) (same) JDK-8317846 Typo in API documentation of classes IdentityHashMap
2024/01/02 10:34 Guoxiong Li Independent (same) (same) JDK-8322751 ZGC: Fix comments about marking roots
2024/01/02 10:13 Archie Cobbs Independent (same) (same) JDK-8322027 One XMLStreamException constructor fails to initialize cause
2024/01/02 08:45 lizbing07734 Independent (same) (same) JDK-8297573 Parallel: Rename do_oop_nv to do_oop_work in subclasses of OopClosure
2024/01/02 03:06 Kim Barrett Oracle (same) (same) JDK-8322765 Eliminate -Wparentheses warnings in runtime code
2023/12/31 17:26 Kim Barrett Oracle (same) (same) JDK-8322747 StringTable should be AllStatic
2023/12/29 21:49 Christoph Langer SAP (same) (same) JDK-8322772 Clean up code after JDK-8322417
2023/12/29 18:33 Olga Mikhaltcova Azul (same) (same) JDK-8318158 RISC-V: implement roundD/roundF intrinsics
2023/12/27 02:31 John Jiang Tencent (same) (same) JDK-8322734 A redundant return in method padWithLen
2023/12/23 22:53 Eamonn McManus Google (same) (same) JDK-8068958 Timestamp.from(Instant) should throw when conversion is not possible
2023/12/22 23:53 Jie Fu Tencent (same) (same) JDK-8322661 Build broken due to missing jvmtiExport.hpp after JDK-8320139
2023/12/22 21:08 Joshua Cao Amazon (same) (same) JDK-8322490 cleanup CastNode construction
2023/12/22 20:16 Rajat Mahajan Oracle (same) (same) JDK-8321151 JDK-8294427 breaks Windows L&F on all older Windows versions
2023/12/22 16:09 Eirik Bjørsnøs Independent (same) (same) JDK-8321802 (zipfs) Add validation of incorrect LOC signature in ZipFileSystem
2023/12/22 13:30 Matthias Baesken SAP (same) (same) JDK-8322163 runtime/Unsafe/InternalErrorTest.java fails on Alpine after JDK-8320886
2023/12/22 13:25 Stefan Karlsson Oracle (same) (same) JDK-8321683 Tests fail with AssertionError in RangeWithPageSize
2023/12/22 07:58 Albert Yang Oracle (same) (same) JDK-8322539 Parallel: Remove duplicated methods in PSAdaptiveSizePolicy
2023/12/21 19:22 raphael.m.mosaner Oracle (same) (same) JDK-8320139 [JVMCI] VmObjectAlloc is not generated by intrinsics methods which allocate objects
2023/12/21 18:51 Evgeny Astigeevich Amazon (same) (same) JDK-8319795 Static huge pages are not used for CodeCache
2023/12/21 15:20 lizbing07734 Independent (same) (same) JDK-8293623 Simplify G1ConcurrentRefineThreadControl
2023/12/21 11:40 Goetz Lindenmaier SAP (same) (same) JDK-8322418 Problem list gc/TestAllocHumongousFragment.java subtests for 8298781
2023/12/21 10:07 Serguei Spitsyn Oracle (same) (same) JDK-8322538 remove fatal from JVM_VirtualThread functions for !INCLUDE_JVMTI
2023/12/21 09:17 Thomas Schatzl Oracle (same) (same) JDK-8319548 Unexpected internal name for Filler array klass causes error in VisualVM
2023/12/21 01:28 Gui Cao Independent (same) (same) JDK-8321972 test runtime/Unsafe/InternalErrorTest.java timeout on linux-riscv64 platform
2023/12/20 22:03 Sean Coffey Oracle (same) (same) JDK-8322078 ZipSourceCache.testKeySourceMapping() test fails with The process cannot access the file because it is being used by another process
2023/12/20 17:32 Matthias Baesken SAP (same) (same) JDK-8321017 Record in JFR that IEEE rounding mode was corrupted by loading a library
2023/12/20 17:00 Markus Karg Independent (same) (same) JDK-8322141 SequenceInputStream.transferTo should not return as soon as Long.MAX_VALUE bytes have been transferred
2023/12/20 15:56 Albert Yang Oracle (same) (same) JDK-8322543 Parallel: Remove unused _major_pause_old_slope_counter
2023/12/20 15:45 Weijun Wang Oracle (same) (same) JDK-8187634 keystore.getCertificateAlias(cert) returns original alias, inconsistent with fix of JDK-6483657
2023/12/20 09:41 Albert Yang Oracle (same) (same) JDK-8322377 Parallel: Remove unused arg in adjust_promo_for_pause_time and adjust_eden_for_pause_time
2023/12/20 09:41 Albert Yang Oracle (same) (same) JDK-8322364 Parallel: Remove unused SizePolicyTrueValues enum members
2023/12/20 08:01 Goetz Lindenmaier SAP (same) (same) JDK-8322417 Console read line with zero out should zero out when throwing exception
2023/12/20 07:46 Peng Xie Tencent (same) (same) JDK-8322513 Build failure with minimal
2023/12/20 05:50 Ioi Lam Oracle (same) (same) JDK-8322321 Add man page doc for -XX:+VerifySharedSpaces
2023/12/20 03:58 Guoxiong Li Independent (same) (same) JDK-8321688 Build on linux with GCC 7.5.0 fails after 8319577
2023/12/19 18:27 Brian Burkhalter Oracle (same) (same) JDK-8322166 Files.isReadable/isWritable/isExecutable expensive when file does not exist
2023/12/19 17:26 Serguei Spitsyn Oracle (same) (same) JDK-8311218 fatal error: stuck in JvmtiVTMSTransitionDisabler::VTMS_transition_disable
2023/12/19 14:15 Ludovic Henry Rivos (same) (same) JDK-8315856 RISC-V: Use Zacas extension for cmpxchg
2023/12/19 13:54 Frederic Thevenet Red Hat (same) (same) JDK-8322309 Fix an inconsistancy in spacing style in spec.gmk.template
2023/12/19 13:49 Erik Österlund Oracle (same) (same) JDK-8321619 Generational ZGC: ZColorStoreGoodOopClosure is only valid for young objects
2023/12/19 10:39 Quan Anh Mai Independent (same) (same) JDK-8319451 PhaseIdealLoop::conditional_move is too conservative
2023/12/19 10:39 Guoxiong Li Independent (same) (same) JDK-8322255 Generational ZGC: ZPageSizeMedium should be set before MaxTenuringThreshold
2023/12/19 08:45 Hamlin Li Huawei (same) (same) JDK-8322195 RISC-V: Minor improvement of MD5 instrinsic
2023/12/19 08:39 Albert Yang Oracle (same) (same) JDK-8322300 Remove redundant arg in PSAdaptiveSizePolicy::adjust_promo_for_pause_time
2023/12/19 07:51 Jatin Bhateja Intel (same) (same) JDK-8321648 Integral gather optimized mask computation.
2023/12/19 07:45 Gui Cao Independent (same) (same) JDK-8322154 RISC-V: JDK-8315743 missed change in MacroAssembler::load_reserved
2023/12/19 00:09 William Kemper Amazon (same) (same) JDK-8321815 Shenandoah: gc state should be synchronized to java threads only once per safepoint
2023/12/18 21:14 Alex Menkov Oracle (same) (same) JDK-8322062 com/sun/jdi/JdwpAllowTest.java does not performs negative testing with prefix length
2023/12/18 18:10 Brian Burkhalter Oracle (same) (same) JDK-8259637 java.io.File.getCanonicalPath() returns different values for same path
2023/12/18 17:56 Ioi Lam Oracle (same) (same) JDK-8321940 Improve CDSHeapVerifier in handling of interned strings
2023/12/18 17:05 Matias Saavedra Silva Oracle (same) (same) JDK-8321933 TestCDSVMCrash.java spawns two processes
2023/12/18 16:52 Afshin Zafari Oracle (same) (same) JDK-8315462 [REDO] runtime/NMT/SummarySanityCheck.java failed with "Total committed (MMMMMM) did not match the summarized committed (NNNNNN)"
2023/12/18 15:20 Yi-Fan Tsai Amazon (same) (same) JDK-8314029 Add file name parameter to Compiler.perfmap
2023/12/18 15:19 Yi-Fan Tsai Amazon (same) (same) JDK-8316197 Make tracing of inline cache available in unified logging
2023/12/18 14:29 Albert Yang Oracle (same) (same) JDK-8322287 Parallel: Remove unused arg in adjust_eden_for_pause_time and adjust_eden_for_minor_pause_time
2023/12/18 13:30 Albert Yang Oracle (same) (same) JDK-8322097 Serial: Refactor CardTableRS::find_first_clean_card
2023/12/18 12:57 Albert Yang Oracle (same) (same) JDK-8322204 Parallel: Remove unused _collection_cost_margin_fraction
2023/12/18 12:57 Albert Yang Oracle (same) (same) JDK-8322089 Parallel: Remove PSAdaptiveSizePolicy::set_survivor_size
2023/12/18 12:11 Alexandr Scherbatiy BellSoft (same) (same) JDK-7001133 OutOfMemoryError by CustomMediaSizeName implementation
2023/12/18 11:05 lizbing07734 Independent (same) (same) JDK-8315040 Remove redundant check in WorkerPolicy::parallel_worker_threads
2023/12/18 10:31 Hamlin Li Huawei (same) (same) JDK-8322209 RISC-V: Enable some tests related to MD5 instrinsic
2023/12/18 09:45 Johan Sjölen Oracle (same) (same) JDK-8321975 Print when add_reserved_region fails even in product mode
2023/12/18 09:43 Ivan Walulya Oracle (same) (same) JDK-8280087 G1: Handle out-of-mark stack situations during reference processing more gracefully
2023/12/18 09:31 lizbing07734 Independent (same) (same) JDK-8322205 Parallel: Remove unused arg in PSCardTable::pre_scavenge
2023/12/18 08:44 Thomas Schatzl Oracle (same) (same) JDK-8317007 Add bulk removal of dead nmethods during class unloading
2023/12/16 01:40 stevenschlansker Independent (same) (same) JDK-8321892 Typo in log message logged by src/hotspot/share/nmt/virtualMemoryTracker.cpp
2023/12/16 01:03 Alisen Chung Oracle (same) (same) JDK-8322041 JDK 22 RDP1 L10n resource files update
2023/12/15 19:04 Calvin Cheung Oracle (same) (same) JDK-8321479 java -D-D crashes
2023/12/15 17:33 Naoto Sato Oracle (same) (same) JDK-8321958 @param/@return descriptions of ZoneRules#isDaylightSavings() are incorrect
2023/12/15 17:25 Tom Rodriguez Oracle (same) (same) JDK-8321288 [JVMCI] HotSpotJVMCIRuntime doesn't clean up WeakReferences in resolvedJavaTypes
2023/12/15 16:13 Roger Riggs Oracle (same) (same) JDK-8322018 Test java/lang/String/CompactString/MaxSizeUTF16String.java fails with -Xcomp
2023/12/15 12:18 Liam Miller-Cushon Google (same) (same) JDK-8322175 test/langtools/tools/javac/classreader/BadMethodParameter.java doesn't compile
2023/12/15 10:16 Liam Miller-Cushon Google (same) (same) JDK-8322040 Missing array bounds check in ClassReader.parameter
2023/12/15 07:42 Matthias Baesken SAP (same) (same) JDK-8322098 os::Linux::print_system_memory_info enhance the THP output with /sys/kernel/mm/transparent_hugepage/hpage_pmd_size
2023/12/15 07:23 Gui Cao Independent (same) (same) JDK-8320397 RISC-V: Avoid passing t0 as temp register to MacroAssembler:: cmpxchg_obj_header/cmpxchgptr
2023/12/15 00:35 Joshua Cao Amazon (same) (same) JDK-8321823 Remove redundant PhaseGVN transform_no_reclaim
2023/12/14 22:33 Zhengyu Gu Independent (same) (same) JDK-8322057 Memory leaks in creating jfr symbol array
2023/12/14 21:26 David Holmes Oracle (same) (same) JDK-8322065 Initial nroff manpage generation for JDK 23
2023/12/14 21:24 David Holmes Oracle (same) (same) JDK-8309981 Remove expired flags in JDK 23
2023/12/14 21:16 Justin Lu Oracle (same) (same) JDK-8321480 ISO 4217 Amendment 176 Update
2023/12/14 17:57 ben.perez Oracle (same) (same) JDK-8296787 Unify debug printing format of X.509 cert serial numbers
2023/12/14 14:39 Aleksei Voitylov BellSoft (same) (same) JDK-8321514 UTF16 string gets constructed incorrectly from codepoints if CompactStrings is not enabled
2023/12/14 14:37 Weijun Wang Oracle (same) (same) JDK-8202598 keytool -certreq output contains inconsistent line separators
2023/12/14 13:24 Darragh Clarke Oracle (same) (same) JDK-8319647 Few java/lang/System/LoggerFinder/modules tests ignore vm flags
2023/12/14 13:09 daniel.lunden Oracle (same) (same) JDK-8320682 [AArch64] C1 compilation fails with "Field too big for insn"
2023/12/14 12:30 Albert Yang Oracle (same) (same) JDK-8322034 Parallel: Remove unused methods in PSAdaptiveSizePolicy
2023/12/14 11:36 Adam Sotona Oracle (same) (same) JDK-8288989 Make tests not depend on the source code
2023/12/14 10:36 Jaikiran Pai Oracle (same) (same) JDK-8312150 Remove -Xnoagent option
2023/12/14 09:29 daniel.lunden Oracle (same) (same) JDK-8321820 TestLoadNIdeal fails on 32-bit because -XX:+UseCompressedOops is not recognized
2023/12/14 07:45 Joe Wang Oracle (same) (same) JDK-8320279 Link issues in java.xml module-info.java
2023/12/14 07:23 Tobias Hartmann Oracle (same) (same) JDK-8321974 Crash in ciKlass::is_subtype_of because TypeAryPtr::_klass is not initialized
2023/12/13 18:47 Alex Menkov Oracle (same) (same) JDK-8321565 [REDO] Heap dump does not contain virtual Thread stack references
2023/12/13 17:34 Jorn Vernee Oracle (same) (same) JDK-8321400 java/foreign/TestStubAllocFailure.java fails with code cache exhaustion
2023/12/13 12:43 Albert Yang Oracle (same) (same) JDK-8321973 Parallel: Remove unused methods in AdaptiveSizePolicy
2023/12/13 11:18 Albert Yang Oracle (same) (same) JDK-8321808 G1: Use unsigned type for non-negative G1 flags
2023/12/13 11:18 lizbing07734 Independent (same) (same) JDK-8293622 Cleanup use of G1ConcRefinementThreads
2023/12/13 11:04 Aleksei Voitylov BellSoft (same) (same) JDK-8321515 ARM32: Move method resolution information out of the cpCache properly
2023/12/13 09:10 Sergey Tsypanov Independent (same) (same) JDK-8321279 Implement hashCode() in Heap-X-Buffer.java.template
2023/12/12 23:00 David Holmes Oracle (same) (same) JDK-8321825 Remove runtime/CompressedOops/CompressedClassPointers.java from the ProblemList
2023/12/12 22:49 Matias Saavedra Silva Oracle (same) (same) JDK-8321474 TestAutoCreateSharedArchiveUpgrade.java should be updated with JDK 21
2023/12/12 21:31 Erik Joelsson Oracle (same) (same) JDK-8321557 Move SOURCE line verification for OracleJDK out of OpenJDK
2023/12/12 21:00 Joe Darcy Oracle (same) (same) JDK-8320200 Use Elements predicates for record constructors to improve print output
2023/12/12 20:55 Roger Riggs Oracle (same) (same) JDK-8321180 Condition for non-latin1 string size too large exception is off by one
2023/12/12 20:41 Aleksandre Iline Oracle (same) (same) JDK-8321621 Update JCov version to 3.0.16
2023/12/12 19:25 Justin Lu Oracle (same) (same) JDK-6230751 [Fmt-Ch] Recursive MessageFormats in ChoiceFormats ignore indicated subformats
2023/12/12 18:44 Joe Darcy Oracle (same) (same) JDK-8321827 Remove unnecessary suppress warnings annotations from the printing processor
2023/12/12 18:30 Sergey Bylokhov Amazon (same) (same) JDK-8270269 Desktop.browse method fails if earlier CoInitialize call as COINIT_MULTITHREADED
2023/12/12 15:26 Christian Stein Oracle (same) (same) JDK-8321739 Source launcher fails with "Not a directory" error
2023/12/12 14:36 Jamil Nimeh Oracle (same) (same) JDK-8321542 C2: Missing ChaCha20 stub for x86_32 leads to crashes
2023/12/12 11:27 Hannes Wallnoefer Oracle (same) (same) JDK-8321889 JavaDoc method references with wrong (nested) type
2023/12/12 10:35 Thomas Schatzl Oracle (same) (same) JDK-8321422 Test gc/g1/pinnedobjs/TestPinnedObjectTypes.java times out after completion
2023/12/12 10:02 Kevin Walls Oracle (same) (same) JDK-8321729 Remove 'orb' field in RMIConnector
2023/12/12 09:58 Kevin Walls Oracle (same) (same) JDK-8311306 Test com/sun/management/ThreadMXBean/ThreadCpuTimeArray.java failed: out of expected range
2023/12/12 09:45 Albert Yang Oracle (same) (same) JDK-8321814 G1: Remove unused G1RemSetScanState::_collection_set_iter_state
2023/12/12 08:36 Albert Yang Oracle (same) (same) JDK-8321287 Remove unused enum style in Prefetch
2023/12/12 07:55 Alan Bateman Oracle (same) (same) JDK-8321594 NativeThreadSet should use placeholder for virtual threads
2023/12/12 07:19 Guoxiong Li Independent (same) (same) JDK-8321631 Fix comments in access.hpp
2023/12/12 06:35 Yuri Gaevsky Independent (same) (same) JDK-8318217 RISC-V: C2 VectorizedHashCode
2023/12/11 19:05 Jorn Vernee Oracle (same) (same) JDK-8320886 Unsafe_SetMemory0 is not guarded
2023/12/11 15:45 Hamlin Li Huawei (same) (same) JDK-8318629 G1: Refine code a bit in G1RemSetTrackingPolicy::update_at_allocate
2023/12/11 14:17 Magnus Ihse Bursie Oracle (same) (same) JDK-8316657 Support whitebox testing in microbenchmarks
2023/12/11 12:20 Jan Lahoda Oracle (same) (same) JDK-8321582 yield .class not parsed correctly.
2023/12/11 10:08 Adam Sotona Oracle (same) (same) JDK-8321641 ClassFile ModuleAttribute.ModuleAttributeBuilder::moduleVersion spec contains a copy-paste error
2023/12/11 08:29 antbob Independent (same) (same) JDK-8321176 [Screencast] make a second attempt on screencast failure
2023/12/11 07:52 Per-Ake Minborg Oracle (same) (same) JDK-8321706 SegmentAllocator:allocateFrom(AddressLayout, MemorySegment) does not throw stated UnsupportedOperationException
2023/12/08 22:52 Srinivas Parasa Intel (same) (same) JDK-8319577 x86_64 AVX2 intrinsics for Arrays.sort methods (int, float arrays)
2023/12/08 19:33 Joe Darcy Oracle (same) (same) JDK-8320790 Update --release 22 symbol information for JDK 22 build 27
2023/12/08 19:19 Brian Burkhalter Oracle (same) (same) JDK-8321429 (fc) FileChannel.lock creates a FileKey containing two long index values, they could be stored as int values
2023/12/08 18:47 Naoto Sato Oracle (same) (same) JDK-8321206 Make Locale related system properties `StaticProperty`
2023/12/08 18:47 Philip Race Oracle (same) (same) JDK-8312307 Obsoleted code in hb-jdk-font.cc
2023/12/08 17:25 Ioi Lam Oracle (same) (same) JDK-8321539 Minimal build is broken by JDK-8320935
2023/12/08 17:02 Chris Plummer Oracle (same) (same) JDK-8321485 remove serviceability/attach/ConcAttachTest.java from problemlist on macosx
2023/12/08 16:37 Lance Andersen Oracle (same) (same) JDK-8316141 Improve CEN header validation checking
2023/12/08 15:46 Magnus Ihse Bursie Oracle (same) (same) JDK-8321597 Use .template consistently for files treated as templates by the build
2023/12/08 14:09 Frederic Thevenet Red Hat (same) (same) JDK-8321374 Add a configure option to explicitly set CompanyName property in VersionInfo resource for Windows exe/dll
2023/12/08 11:08 daniel.lunden Oracle (same) (same) JDK-8295166 IGV: dump graph at more locations
2023/12/08 11:04 daniel.lunden Oracle (same) (same) JDK-8310524 C2: record parser-generated LoadN nodes for IGVN
2023/12/08 10:21 Jaikiran Pai Oracle (same) (same) JDK-8316738 java/net/httpclient/HttpClientLocalAddrTest.java failed in timeout
2023/12/08 08:04 Alan Bateman Oracle (same) (same) JDK-8320786 Remove ThreadGroup.stop
2023/12/08 07:10 Alan Bateman Oracle (same) (same) JDK-8320532 Remove Thread/ThreadGroup suspend/resume
2023/12/08 01:24 Alex Menkov Oracle (same) (same) JDK-8321560 [BACKOUT] 8299426: Heap dump does not contain virtual Thread stack references
2023/12/07 23:33 Philip Race Oracle (same) (same) JDK-8286827 BogusColorSpace methods return wrong array
2023/12/07 23:25 Weijun Wang Oracle (same) (same) JDK-8320597 RSA signature verification fails on signed data that does not encode params correctly
2023/12/07 21:05 Philip Race Oracle (same) (same) JDK-8288712 Typo in javadoc in javax.imageio.ImageReader.java
2023/12/07 19:46 Naoto Sato Oracle (same) (same) JDK-8321409 Console read line with zero out should zero out underlying buffer in JLine (redux)
2023/12/07 19:32 Matias Saavedra Silva Oracle (same) (same) JDK-8302790 Set FileMapRegion::mapped_base() to null if mapping fails
2023/12/07 17:01 Joe Darcy Oracle (same) (same) JDK-8319416 Add source 23 and target 23 to javac
2023/12/07 17:01 Joe Darcy Oracle (same) (same) JDK-8319414 Add SourceVersion.RELEASE_23
2023/12/07 17:01 Joe Darcy Oracle (same) (same) JDK-8319413 Start of release updates for JDK 23

No changesets log

JDK-8326601 Update jck.jtx problemlist
JDK-8326448 Kitchensink: Remove NoSystemExitSecurityManager
JDK-8326373 Increase task timeout for tier8 apps testing.
JDK-8325944 Release Note: Relax alignment of array elements
JDK-8325903 Release Note: Added Certainly R1 and E1 Root Certificates
JDK-8325879 Release Note: Removal of Aligned Access Modes for `MethodHandles::byteArrayViewVarHandle`, `byteBufferViewVarHandle` and Related Methods
JDK-8325875 Release Note: JVM May Crash or Malfunction When Using ZGC and Non-Default `ObjectAlignmentInBytes`
JDK-8324992 Release Note: Loose Matching of Space Separators in Lenient Date/Time Parsing Mode
JDK-8324068 Improve references to tags in the Doc Comment Spec
JDK-8323673 Release Note: Removal of the JMX Management Applet (m-let) Feature
JDK-8323159 Consider adding some text re. memory zeroing in Arena::allocate
JDK-8320959 jdk/jfr/event/runtime/TestShutdownEvent.java crash with CONF=fastdebug -Xcomp
JDK-8320889 Release Note: ThreadGroup.stop is removed
JDK-8320708 Release Note: Thread.suspend/resume and ThreadGroup.suspend/resume are removed
JDK-8320057 [macos14] javax/swing/JToolTip/4846413/bug4846413.java: Tooltip has not been found!
JDK-8320056 [macos14] java/awt/Mouse/GetMousePositionTest/GetMousePositionWithPopup.java#id1 fail by NPE
JDK-8318825 runThese failed with "unable to create native thread: possibly out of memory or process/resource limits reached"
JDK-8311147 Occasional class file corruption
JDK-8310206 8.1.4: Mention direct superclass type of a record, for consistency with enum
JDK-8299426 Heap dump does not contain virtual Thread stack references
JDK-8294007 Annotations in front of Javadoc comment prevent comment from being recognized
JDK-8293885 Review running times of tier 1 library regression tests (umbrella)
JDK-8005622 Inherited Javadoc missing @throws

Committer push log

103394724+kurashige23, Independent

Bug Summary
JDK-8313710 jcmd: typo in the documentation of JFR.start and JFR.dump

Abhishek Kumar, Oracle

Bug Summary
JDK-8258979 The image didn't show correctly with GTK LAF

Angelos Bimpoudis, Oracle

Bug Summary
JDK-8325653 Erroneous exhaustivity analysis for primitive patterns
JDK-8303374 Implement JEP 455: Primitive Types in Patterns, instanceof, and switch (Preview)
JDK-8314275 Incorrect stepping in switch
JDK-8323502 javac crash with wrongly typed method block in Flow
JDK-8325257 jshell reports NoSuchFieldError with instanceof primitive type

Axel Boldt-Christmas, Oracle

Bug Summary
JDK-8319773 Avoid inflating monitors when installing hash codes for LM_LIGHTWEIGHT
JDK-8325471 CHeapBitMap(MEMFLAGS flags) constructor misleading use of super-constructor
JDK-8324881 ObjectSynchronizer::inflate(Thread* current...) is invoked for non-current thread
JDK-8319801 Recursive lightweight locking: aarch64 implementation
JDK-8319797 Recursive lightweight locking: Runtime implementation
JDK-8319799 Recursive lightweight locking: x86 implementation
JDK-8325870 Zap end padding bits for ArrayOops in non-release builds
JDK-8325074 ZGC fails assert(index == 0 || is_power_of_2(index)) failed: Incorrect load shift: 11

Alisen Chung, Oracle

Bug Summary
JDK-8316931 [macos14] Test "java/awt/TrayIcon/ShowAfterDisposeTest/ShowAfterDisposeTest.html" throws an exception on macOS 14(x64, aarch64)
JDK-8322041 JDK 22 RDP1 L10n resource files update
JDK-8324571 JDK 23 L10n resource files update
JDK-8321489 Update LCMS to 2.16

Archie Cobbs, Independent

Bug Summary
JDK-8323699 MessageFormat.toPattern() generates non-equivalent MessageFormat pattern
JDK-8322027 One XMLStreamException constructor fails to initialize cause

Alexey Ivanov, Oracle

Bug Summary
JDK-8323801 tag doesn't strikethrough the text
JDK-8325309 Amend "Listeners and Threads" in AWTThreadIssues.html
JDK-8326948 Force English locale for timeout formatting
JDK-8294148 Support JSplitPane for instructions and test UI
JDK-8325762 Use PassFailJFrame.Builder.splitUI() in PrintLatinCJKTest.java

Alan Bateman, Oracle

Bug Summary
JDK-8325028 (ch) Pipe channels should lazily set socket to non-blocking mode on first use by virtual thread
JDK-8325399 Add tests for virtual threads doing Selector operations
JDK-8323612 IOVecWrapper should be changed to be TerminatingThreadLocal
JDK-8323296 java/lang/Thread/virtual/stress/GetStackTraceALotWhenPinned.java#id1 timed out
JDK-8319757 java/nio/channels/DatagramChannel/InterruptibleOrNot.java failed: wrong exception thrown
JDK-8321594 NativeThreadSet should use placeholder for virtual threads
JDK-8322829 Refactor nioBlocker to avoid blocking while holding Thread's interrupt lock
JDK-8320532 Remove Thread/ThreadGroup suspend/resume
JDK-8320786 Remove ThreadGroup.stop
JDK-8322846 Running with -Djdk.tracePinnedThreads set can hang
JDK-8323002 test/jdk/java/lang/Thread/virtual/stress/GetStackTraceALotWhenPinned.java times out on macosx-x64
JDK-8322818 Thread::getStackTrace can fail with InternalError if virtual thread is timed-parked when pinned
JDK-8320707 Virtual thread test updates

Andrew Leonard, Red Hat

Bug Summary
JDK-8323671 DevKit build gcc libraries contain full paths to source location
JDK-8323667 Library debug files contain non-reproducible full gcc include paths
JDK-8326685 Linux builds not reproducible if two builds configured in different build folders

Alexandr Scherbatiy, BellSoft

Bug Summary
JDK-7001133 OutOfMemoryError by CustomMediaSizeName implementation

Alex Menkov, Oracle

Bug Summary
JDK-8321560 [BACKOUT] 8299426: Heap dump does not contain virtual Thread stack references
JDK-8321565 [REDO] Heap dump does not contain virtual Thread stack references
JDK-8322062 com/sun/jdi/JdwpAllowTest.java does not performs negative testing with prefix length
JDK-8317804 com/sun/jdi/JdwpAllowTest.java fails on Alpine 3.17 / 3.18
JDK-8326525 com/sun/tools/attach/BasicTests.java does not verify AgentLoadException case
JDK-8318563 GetClassFields should not use random access to field
JDK-8322237 Heap dump contains duplicate thread records for mounted virtual threads
JDK-8318566 Heap walking functions should not use FilteredFieldStream
JDK-8317636 Improve heap walking API tests to verify correctness of field indexes
JDK-8311076 RedefineClasses doesn't check for ConstantPool overflow
JDK-8325530 Vague error message when com.sun.tools.attach.VirtualMachine fails to load agent library

Amit Kumar, IBM

Bug Summary
JDK-8326201 [S390] Need to bailout cleanly if creation of stubs fails when code cache is out of space
JDK-8322649 Improve class initialization barrier in TemplateTable::_new for S390
JDK-8315762 Update subtype check profile collection on s390x following 8308869

antbob, Independent

Bug Summary
JDK-8321176 [Screencast] make a second attempt on screencast failure

anupam.dev, Oracle

Bug Summary
JDK-8317846 Typo in API documentation of classes IdentityHashMap

Anthony Scarpino, Oracle

Bug Summary
JDK-8322100 Fix GCMIncrementByte4 & GCMIncrementDirect4, and increase overlap testing
JDK-8326699 Problemlist CertMsgCheck.java
JDK-8311644 Server should not send bad_certificate alert when the client does not send any certificates

Artem Semenov, Independent

Bug Summary
JDK-8317771 [macos14] Expand/collapse a JTree using keyboard freezes the application in macOS 14 Sonoma

Alexey Semenyuk, Oracle

Bug Summary
JDK-8325203 System.exit(0) kills the launched 3rd party application
JDK-8322799 Test JPKG003-013: ServiceTest fails because the user cannot uninstall the "servicetest" package on OEL 9.2 x64 and OEL 9.2 64-bit Arm (aarch64)

Adam Sotona, Oracle

Bug Summary
JDK-8321641 ClassFile ModuleAttribute.ModuleAttributeBuilder::moduleVersion spec contains a copy-paste error
JDK-8320360 ClassFile.parse: Some defect class files cause unexpected exceptions to be thrown
JDK-8321540 ClassSignature.parseFrom() throws StringIndexOutOfBoundsException for invalid signatures
JDK-8288989 Make tests not depend on the source code

Aleksei Voitylov, BellSoft

Bug Summary
JDK-8321515 ARM32: Move method resolution information out of the cpCache properly
JDK-8321514 UTF16 string gets constructed incorrectly from codepoints if CompactStrings is not enabled

Albert Yang, Oracle

Bug Summary
JDK-8325503 Add GC specific prefix for CheckForUnmarked related classes
JDK-8326763 Consolidate print methods in ContiguousSpace
JDK-8323520 Drop unnecessary virtual specifier in Space
JDK-8325643 G1: Refactor G1FlushHumongousCandidateRemSets
JDK-8326209 G1: Remove G1ConcurrentMark::_total_cleanup_time
JDK-8324132 G1: Remove unimplemented G1MonitoringSupport::recalculate_eden_size
JDK-8326319 G1: Remove unused G1ConcurrentMark::_init_times
JDK-8325436 G1: Remove unused G1RegionMarkStats::is_clear
JDK-8321814 G1: Remove unused G1RemSetScanState::_collection_set_iter_state
JDK-8321808 G1: Use unsigned type for non-negative G1 flags
JDK-8324513 Inline ContiguousSpace::object_iterate_from
JDK-8326065 Merge Space into ContiguousSpace
JDK-8324301 Obsolete MaxGCMinorPauseMillis
JDK-8324771 Obsolete RAMFraction related flags
JDK-8325221 Obsolete TLABStats
JDK-8322298 Obsolete unused AdaptiveSizePolicyCollectionCostMargin
JDK-8325416 Parallel: Refactor CheckForUnmarkedOops
JDK-8323005 Parallel: Refactor PSPromotionManager::claim_or_forward_depth
JDK-8322539 Parallel: Remove duplicated methods in PSAdaptiveSizePolicy
JDK-8322537 Parallel: Remove experimental adjustment in PSAdaptiveSizePolicy
JDK-8322089 Parallel: Remove PSAdaptiveSizePolicy::set_survivor_size
JDK-8326975 Parallel: Remove redundant PSOldGen::is_allocated
JDK-8322204 Parallel: Remove unused _collection_cost_margin_fraction
JDK-8322543 Parallel: Remove unused _major_pause_old_slope_counter
JDK-8322287 Parallel: Remove unused arg in adjust_eden_for_pause_time and adjust_eden_for_minor_pause_time
JDK-8322377 Parallel: Remove unused arg in adjust_promo_for_pause_time and adjust_eden_for_pause_time
JDK-8323000 Parallel: Remove unused class declarations in psScavenge
JDK-8326170 Parallel: Remove unused enum CollectionType in ParallelScavengeHeap
JDK-8321973 Parallel: Remove unused methods in AdaptiveSizePolicy
JDK-8322034 Parallel: Remove unused methods in PSAdaptiveSizePolicy
JDK-8323518 Parallel: Remove unused methods in psParallelCompact.hpp
JDK-8322364 Parallel: Remove unused SizePolicyTrueValues enum members
JDK-8322841 Parallel: Remove unused using-declaration in MutableNUMASpace
JDK-8322888 Parallel: Remove unused variables in PSPromotionManager
JDK-8322828 Parallel: Rename ParallelCompactData::_region_start
JDK-8325553 Parallel: Use per-marker cache for marking stats during Full GC
JDK-8322300 Remove redundant arg in PSAdaptiveSizePolicy::adjust_promo_for_pause_time
JDK-8324543 Remove Space::object_iterate
JDK-8326575 Remove unused ContiguousSpace::set_top_for_allocations
JDK-8321287 Remove unused enum style in Prefetch
JDK-8323284 Remove unused FilteringClosure declaration
JDK-8323499 Remove unused methods in space.hpp
JDK-8325551 Remove unused obj_is_alive and block_start in Space
JDK-8325941 Remove unused Space::block_size
JDK-8323318 Remove unused Space::is_free_block
JDK-8325563 Remove unused Space::is_in
JDK-8325565 Remove unused SpaceClosure
JDK-8320864 Serial: Extract out Full GC related fields from ContiguousSpace
JDK-8323800 Serial: Fix include guard macro in generation.hpp
JDK-8324722 Serial: Inline block_is_obj of subclasses of Generation
JDK-8325259 Serial: Inline OldGenScanClosure during Young GC
JDK-8326414 Serial: Inline SerialHeap::create_rem_set
JDK-8325635 Serial: Inline verify_used_region_at_save_marks
JDK-8325860 Serial: Move Generation.java to serial folder
JDK-8324856 Serial: Move Generation::is_in to DefNewGeneration
JDK-8325748 Serial: Move Generation::promote to TenuredGeneration
JDK-8325053 Serial: Move Generation::save_used_region to TenuredGeneration
JDK-8323715 Serial: Move genMemoryPools to serial folder
JDK-8325882 Serial: Move is_maximal_no_gc to TenuredGeneration
JDK-8325767 Serial: Move transform_stack_chunk out of TenuredGeneration::promote
JDK-8323809 Serial: Refactor card table verification
JDK-8322097 Serial: Refactor CardTableRS::find_first_clean_card
JDK-8323993 Serial: Refactor gc_prologue and gc_epilogue
JDK-8324970 Serial: Refactor signature of maintain_old_to_young_invariant
JDK-8324636 Serial: Remove Generation::block_is_obj
JDK-8324147 Serial: Remove generation::compute_new_size
JDK-8324512 Serial: Remove Generation::Name
JDK-8323779 Serial: Remove Generation::promotion_attempt_is_safe
JDK-8325248 Serial: Remove Generation::space_iterate
JDK-8325134 Serial: Remove Generation::used_region
JDK-8325510 Serial: Remove redundant arg in non_clean_card_iterate
JDK-8326659 Serial: Remove redundant TenuredSpace::print_on
JDK-8326196 Serial: Remove SerialHeap::generation_iterate
JDK-8324207 Serial: Remove Space::set_saved_mark_word
JDK-8323738 Serial: Remove unreachable methods in Generation
JDK-8323780 Serial: Remove unused _full_collections_completed
JDK-8323726 Serial: Remove unused definitions in Generation
JDK-8323264 Serial: Remove unused GenerationBlockSizeClosure
JDK-8324210 Serial: Remove unused methods in Generation
JDK-8323722 Serial: Remove unused no_gc_in_progress
JDK-8324769 Serial: Remove unused TenuredGeneration::unsafe_max_alloc_nogc
JDK-8326171 Serial: Remove VerifyGCLevel
JDK-8324613 Serial: Rename GenerationPool to TenuredGenerationPool
JDK-8325633 Use stricter assertion in callers of Space::is_aligned

Afshin Zafari, Oracle

Bug Summary
JDK-8315462 [REDO] runtime/NMT/SummarySanityCheck.java failed with "Total committed (MMMMMM) did not match the summarized committed (NNNNNN)"
JDK-8324828 Avoid multiple search of reserved regions during splitting
JDK-8280056 gtest/LargePageGtests.java#use-large-pages failed "os.release_one_mapping_multi_commits_vm"
JDK-8316813 NMT: Using WhiteBox API, virtual memory tracking should also be stressed in JMH tests

Alexander Zvegintsev, Oracle

Bug Summary
JDK-8322750 Test "api/java_awt/interactive/SystemTrayTests.html" failed because A blue ball icon is added outside of the system tray

ben.perez, Oracle

Bug Summary
JDK-8265372 Simplify PKCS9Attribute
JDK-8296787 Unify debug printing format of X.509 cert serial numbers

Bhavana Kilambi, ARM

Bug Summary
JDK-8324724 Add Stub routines for FP16 conversions on aarch64
JDK-8325264 two compiler/intrinsics/float16 tests fail after JDK-8324724

Peng Xie, Tencent

Bug Summary
JDK-8322513 Build failure with minimal

Brian Burkhalter, Oracle

Bug Summary
JDK-8316340 (bf) Missing {@inheritDoc} for exception in MappedByteBuffer::compact
JDK-8326944 (ch) Minor typo in the ScatteringByteChannel.read(ByteBuffer[] dsts,int offset,int length) javadoc
JDK-8321429 (fc) FileChannel.lock creates a FileKey containing two long index values, they could be stored as int values
JDK-8323710 (fc) FileChannel.lock creates a FileKey with a poor hashCode after JDK-8321429 (win)
JDK-8325382 (fc) FileChannel.transferTo throws IOException when position equals size
JDK-7057369 (fs spec) FileStore getUsableSpace and getUnallocatedSpace could be clearer
JDK-8321561 (fs) Clarify non-atomic behavior of Files.move
JDK-8326897 (fs) The utility TestUtil.supportsLinks is wrongly used to check for hard link support
JDK-8325152 Clarify specification of java.io.RandomAccessFile.setLength
JDK-8322166 Files.isReadable/isWritable/isExecutable expensive when file does not exist
JDK-8325302 Files.move(REPLACE_EXISTING) throws NoSuchFileException on deleted target
JDK-8259637 java.io.File.getCanonicalPath() returns different values for same path
JDK-8322877 java/io/BufferedInputStream/TransferTo.java failed with IndexOutOfBoundsException
JDK-8322868 java/io/BufferedInputStream/TransferToTrusted.java has bad copyright header
JDK-8325990 Remove use of snippet @replace annotation in java.base
JDK-8324960 Unsafe.allocateMemory documentation incorrect regarding zero return value

Boris Ulasevich, BellSoft

Bug Summary
JDK-8322858 compiler/c2/aarch64/TestFarJump.java fails on AArch64 due to unexpected PrintAssembly output

Calvin Cheung, Oracle

Bug Summary
JDK-8323556 CDS archive space addresses should be randomized with ArchiveRelocationMode=1
JDK-8322657 CDS filemap fastdebug assert while loading Graal CE Polyglot in isolated classloader
JDK-8321479 java -D-D crashes
JDK-8324041 ModuleOption.java failed with update release versioning scheme
JDK-8323950 Null CLD while loading shared lambda proxy class with javaagent active
JDK-8323032 OptimizedModuleHandlingTest failed in dynamic CDS archive mode
JDK-8320002 Remove obsolete CDS check in Reflection::verify_class_access()
JDK-8325038 runtime/cds/appcds/ProhibitedPackage.java can fail with UseLargePages
JDK-8322322 Support archived full module graph when -Xbootclasspath/a is used

Christian Hagedorn, Oracle

Bug Summary
JDK-8310711 [IR Framework] Remove safepoint while printing handling
JDK-8323154 C2: assert(cmp != nullptr && cmp->Opcode() == Op_Cmp(bt)) failed: no exit test
JDK-8323101 C2: assert(n->in(0) == nullptr) failed: divisions with zero check should already have bailed out earlier in split-if
JDK-8324236 compiler/ciReplay/TestInliningProtectionDomain.java failed with RuntimeException: should only dump inline information for ... expected true, was false
JDK-8325606 compiler/predicates/TestPredicatesBasic.java does not compile
JDK-8325746 Refactor Loop Unswitching code

Chris Hegarty, Independent

Bug Summary
JDK-8323659 LinkedTransferQueue add and put methods call overridable offer

Chris Plummer, Oracle

Bug Summary
JDK-8324066 "clhsdb jstack" should not by default scan for j.u.c locks because it can be very slow
JDK-8323546 Cleanup jcmd docs for Compiler.perfmap and VM.cds filename parameter
JDK-8322980 Debug agent's dumpThread() API should update thread's name before printing it
JDK-8322981 Fix 2 locations in JDI that throw IOException without using the "Caused by" exception
JDK-8323213 Fix some javadoc broken links in ObjectReference, and other misc javadoc cleanups
JDK-8322978 Remove debug agent debugMonitorTimedWait() function. It is no longer used.
JDK-8321485 remove serviceability/attach/ConcAttachTest.java from problemlist on macosx
JDK-8323680 SA PointerFinder code can do a better job of leveraging existing code to determine if an address is in the TLAB
JDK-8323681 SA PointerFinder code should support G1

ckozak, Independent

Bug Summary
JDK-8322142 JFR: Periodic tasks aren't orphaned between recordings

Christoph Langer, SAP

Bug Summary
JDK-8322772 Clean up code after JDK-8322417
JDK-8325444 GHA: JDK-8325194 causes a regression
JDK-8323664 java/awt/font/JNICheck/FreeTypeScalerJNICheck.java still fails with JNI warning on some Windows configurations
JDK-8326000 Remove obsolete comments for class sun.security.ssl.SunJSSE

Sean Coffey, Oracle

Bug Summary
JDK-8325096 Test java/security/cert/CertPathBuilder/akiExt/AKISerialNumber.java is failing
JDK-8322078 ZipSourceCache.testKeySourceMapping() test fails with The process cannot access the file because it is being used by another process

Coleen Phillimore, Oracle

Bug Summary
JDK-8323685 PrintSystemDictionaryAtExit has mutex rank assert
JDK-8324679 Replace NULL with nullptr in HotSpot .ad files
JDK-8324678 Replace NULL with nullptr in HotSpot gtests
JDK-8324681 Replace NULL with nullptr in HotSpot jtreg test native code files

Cesar Soares, Microsoft

Bug Summary
JDK-8322572 AllocationMergesTests.java fails with "IRViolationException: There were one or multiple IR rule failures."
JDK-8322854 Incorrect rematerialization of scalar replaced objects in C2
JDK-8323190 Segfault during deoptimization of C2-compiled code

Christian Stein, Oracle

Bug Summary
JDK-8318812 LauncherHelper.checkAndLoadMain closes jar file that's about to be re-opened
JDK-8321739 Source launcher fails with "Not a directory" error
JDK-8323815 Source launcher should find classes with $ in names

Liam Miller-Cushon, Google

Bug Summary
JDK-8322040 Missing array bounds check in ClassReader.parameter
JDK-8322175 test/langtools/tools/javac/classreader/BadMethodParameter.java doesn't compile

daniel.lunden, Oracle

Bug Summary
JDK-8320682 [AArch64] C1 compilation fails with "Field too big for insn"
JDK-8310524 C2: record parser-generated LoadN nodes for IGVN
JDK-8295166 IGV: dump graph at more locations
JDK-8321820 TestLoadNIdeal fails on 32-bit because -XX:+UseCompressedOops is not recognized

Joe Darcy, Oracle

Bug Summary
JDK-8322979 Add informative discussion to Modifier
JDK-8325268 Add policy statement to langtools makefiles concerning warnings
JDK-8319416 Add source 23 and target 23 to javac
JDK-8319414 Add SourceVersion.RELEASE_23
JDK-8322218 Better escaping of single and double quotes in annotation toString() results
JDK-8325078 Better escaping of single and double quotes in javac annotation toString() results
JDK-8302019 Clarify Elements.overrides
JDK-8175386 Clarify exception behavior of Types utility methods
JDK-8325148 Enable restricted javac warning in java.base
JDK-8325189 Enable this-escape javac warning in java.base
JDK-8325266 Enable this-escape javac warning in jdk.javadoc
JDK-8323839 Expand use of Messager convenience methods in langtools regression tests
JDK-8322248 Fix inconsistent wording in ElementFilter.typesIn
JDK-8322878 Including sealing information Class.toGenericString()
JDK-8321827 Remove unnecessary suppress warnings annotations from the printing processor
JDK-8325687 SimpleJavaFileObject specification would benefit from implSpec
JDK-8319413 Start of release updates for JDK 23
JDK-8042981 Strip type annotations in Types' utility methods
JDK-8323684 TypeMirror.{getAnnotationsByType, getAnnotation} return uninformative results
JDK-8320790 Update --release 22 symbol information for JDK 22 build 27
JDK-8320200 Use Elements predicates for record constructors to improve print output
JDK-8326530 Widen allowable error bound of Math.tan

David Leopoldseder, Oracle

Bug Summary
JDK-8322636 [JVMCI] HotSpotSpeculationLog can be inconsistent across a single compile

Dmitry Cherepanov, Azul

Bug Summary
JDK-8325395 Missing copyright header in StackFilter.java

Darragh Clarke, Oracle

Bug Summary
JDK-8319647 Few java/lang/System/LoggerFinder/modules tests ignore vm flags
JDK-8314164 java/net/HttpURLConnection/HttpURLConnectionExpectContinueTest.java fails intermittently in timeout
JDK-8319651 Several network tests ignore vm flags when start java process

Daniel Daugherty, Oracle

Bug Summary
JDK-8324074 increase timeout for jvmci test TestResolvedJavaMethod.java
JDK-8321938 java/foreign/critical/TestCriticalUpcall.java does not need a core file
JDK-8324082 more monitoring test timeout adjustments
JDK-8323073 ProblemList gc/g1/TestSkipRebuildRemsetPhase.java on linux-aarch64
JDK-8325569 ProblemList gc/parallel/TestAlwaysPreTouchBehavior.java on linux
JDK-8322963 ProblemList java/io/BufferedInputStream/TransferTo.java
JDK-8326062 ProblemList jcstress tests that are failing due to JDK-8325984
JDK-8323075 ProblemList runtime/cds/appcds/jigsaw/modulepath/OptimizeModuleHandlingTest.java
JDK-8323011 ProblemList serviceability/HeapDump/FullGCHeapDumpLimitTest.java
JDK-8326117 ProblemList serviceability/jvmti/vthread/SuspendWithInterruptLock/SuspendWithInterruptLock.java#default in Xcomp mode
JDK-8326120 ProblemList sun/java2d/X11SurfaceData/SharedMemoryPixmapsTest/SharedMemoryPixmapsTest.sh on macosx-aarch64
JDK-8325270 ProblemList two compiler/intrinsics/float16 tests that fail due to JDK-8324724
JDK-8324785 ProblemList two tests on linux due to JDK-8315923
JDK-8324786 validate-source fails after JDK-8042981
JDK-8324161 validate-source fails after JDK-8275338

Denghui Dong, Alibaba

Bug Summary
JDK-8324630 C1: Canonicalizer::do_LookupSwitch doesn't break the loop when the successor is found
JDK-8322781 C1: Debug build crash in GraphBuilder::vmap() when print stats
JDK-8322694 C1: Handle Constant and IfOp in NullCheckEliminator
JDK-8325144 C1: Optimize CriticalEdgeFinder
JDK-8322779 C1: Remove the unused counter 'totalInstructionNodes'
JDK-8324213 C1: There is no need for Canonicalizer to handle IfOp
JDK-8322735 C2: minor improvements of bubble sort used in SuperWord::packset_sort
JDK-8326127 JFR: Add SafepointCleanupTask to hardToTestEvents of TestLookForUntestedEvents
JDK-8326111 JFR: Cleanup for JFR_ONLY
JDK-8324974 JFR: EventCompilerPhase should be created as UNTIMED
JDK-8323188 JFR: Needless RESOURCE_ARRAY when sending EventOSInformation
JDK-8321404 Limit the number of heap dumps triggered by HeapDumpBeforeFullGC/AfterFullGC
JDK-8322989 New test serviceability/HeapDump/FullGCHeapDumpLimitTest.java fails
JDK-8327056 Remove unused static char array in JvmtiAgentList::lookup
JDK-8322853 Should use ConditionalMutexLocker in NativeHeapTrimmerThread::print_state

Damon Fenacci, Oracle

Bug Summary
JDK-8325313 Header format error in TestIntrinsicBailOut after JDK-8317299
JDK-8317299 safepoint scalarization doesn't keep track of the depth of the JVM state

David Holmes, Oracle

Bug Summary
JDK-8324578 [BACKOUT] [IMPROVE] OPEN_MAX is no longer the max limit on macOS >= 10.6 for RLIMIT_NOFILE
JDK-8326371 [BACKOUT] Clean up NativeCompilation.gmk and its newly created parts
JDK-8323438 Enhance assertions for Windows sync API failures
JDK-8326222 Fix copyright year in src/hotspot/share/gc/shenandoah/shenandoahHeap.cpp
JDK-8322065 Initial nroff manpage generation for JDK 23
JDK-8319948 jcmd man page needs to be updated
JDK-8323241 jcmd manpage should use lists for argument lists
JDK-8323243 JNI invocation of an abstract instance method corrupts the stack
JDK-8309981 Remove expired flags in JDK 23
JDK-8321825 Remove runtime/CompressedOops/CompressedClassPointers.java from the ProblemList
JDK-8318302 ThreadCountLimit.java failed with "Native memory allocation (mprotect) failed to protect 16384 bytes for memory to guard stack pages"
JDK-8326126 Update the java manpage with the changes from JDK-8322478
JDK-8307788 vmTestbase/gc/gctests/LargeObjects/large003/TestDescription.java timed out

Daniel Jelinski, Oracle

Bug Summary
JDK-8223696 java/net/httpclient/MaxStreams.java failed with didn't finish within the time-out
JDK-8324585 JVM native memory leak in PCKS11-NSS security provider
JDK-8325247 Memory leak in SessionKeyRef class def when using PKCS11 security provider
JDK-8323089 networkaddress.cache.ttl is not a system property
JDK-8325162 Remove duplicate GCMParameters class

dlunden, Unknown

Bug Summary
JDK-8322996 BoxLockNode creation fails with assert(reg < CHUNK_SIZE) failed: sanity
JDK-8291809 Convert compiler/c2/cr7200264/TestSSE2IntVect.java to IR verification test
JDK-8317349 Randomize order of macro node expansion in C2

Dan Lutker, Amazon

Bug Summary
JDK-8326717 Disable stringop-overflow in shenandoahLock.cpp

Douglas Simon, Oracle

Bug Summary
JDK-8323616 [JVMCI] TestInvalidJVMCIOption.java fails intermittently with NPE
JDK-8325137 com/sun/management/ThreadMXBean/ThreadCpuTimeArray.java can fail in Xcomp with out of expected range
JDK-8325750 Fix spelling of ForceTranslateFailure help message
JDK-8326959 Improve JVMCI option help
JDK-8316992 Potential null pointer from get_current_thread JVMCI helper function.
JDK-8324717 Remove HotSpotJVMCICompilerFactory

Evgeny Astigeevich, Amazon

Bug Summary
JDK-8324874 AArch64: crypto pmull based CRC32/CRC32C intrinsics clobber V8-V15 registers
JDK-8319795 Static huge pages are not used for CodeCache

Erik Gahlin, Oracle

Bug Summary
JDK-8323425 JFR: Auto-generated filename doesn't work with time-limited recording
JDK-8325994 JFR: Examples in JFR.start help use incorrect separator
JDK-8322675 JFR: Fail-fast mode when constants cannot be resolved
JDK-8324832 JFR: Improve sorting of 'jfr summary'
JDK-8326838 JFR: Native mirror events
JDK-8325809 JFR: Remove unnecessary annotation
JDK-8324229 JFR: Temporarily disable assertion for missing object reference

Eirik Bjørsnøs, Independent

Bug Summary
JDK-8321802 (zipfs) Add validation of incorrect LOC signature in ZipFileSystem
JDK-8325201 (zipfs) Disable TestPosix.setPermissionsShouldConvertToUnix which fails on Windows
JDK-8322565 (zipfs) Files.setPosixPermissions should preserve 'external file attributes' bits
JDK-8301183 (zipfs) jdk/jdk/nio/zipfs/TestLocOffsetFromZip64EF.java failing with ZipException:R0 on OL9
JDK-8325199 (zipfs) jdk/nio/zipfs/TestPosix.java failed 6 sub-tests
JDK-8303972 (zipfs) Make test/jdk/jdk/nio/zipfs/TestLocOffsetFromZip64EF.java independent of the zip command line
JDK-8324635 (zipfs) Regression in Files.setPosixFilePermissions called on existing MSDOS entries
JDK-8322830 Add test case for ZipFile opening a ZIP with no entries
JDK-8324998 Add test cases for String.regionMatches comparing Turkic dotted/dotless I with uppercase latin I
JDK-8322802 Add testing for ZipFile.getEntry respecting the 'Language encoding' flag
JDK-8303866 Allow ZipInputStream.readEnd to parse small Zip64 ZIP files
JDK-8326100 DeflaterDictionaryTests should use Deflater.getBytesWritten instead of Deflater.getTotalOut
JDK-8326099 GZIPOutputStream should use Deflater.getBytesRead() instead of Deflater.getTotalIn()
JDK-8321616 Retire binary test vectors in test/jdk/java/util/zip/ZipFile
JDK-8321396 Retire test/jdk/java/util/zip/NoExtensionSignature.java
JDK-8320712 Rewrite BadFactoryTest in pure Java
JDK-8303891 Speed up Zip64SizeTest using a small ZIP64 file
JDK-8259866 two java.util tests failed with "IOException: There is not enough space on the disk"
JDK-8313739 ZipOutputStream.close() should always close the wrapped stream

Elif Aslan, Amazon

Bug Summary
JDK-8318605 Enable parallelism in vmTestbase/nsk/stress/stack tests

Eamonn McManus, Google

Bug Summary
JDK-8068958 Timestamp.from(Instant) should throw when conversion is not possible

Erik Österlund, Oracle

Bug Summary
JDK-8324933 ConcurrentHashTable::statistics_calculate synchronization is expensive
JDK-8321619 Generational ZGC: ZColorStoreGoodOopClosure is only valid for young objects
JDK-8322630 Remove ICStubs and related safepoints

Emanuel Peter, Oracle

Bug Summary
JDK-8320175 [BACKOUT] 8316533: C2 compilation fails with assert(verify(phase)) failed: missing Value() optimization
JDK-8324641 [IR Framework] Add Setup method to provide custom arguments and set fields
JDK-8325589 C2 SuperWord refactoring: create VLoopAnalyzer with Submodules
JDK-8310190 C2 SuperWord: AlignVector is broken, generates misaligned packs
JDK-8324794 C2 SuperWord: do not ignore reductions in SuperWord::unrolling_analysis
JDK-8325159 C2 SuperWord: measure time for CITime
JDK-8325064 C2 SuperWord: refactor construct_bb
JDK-8325541 C2 SuperWord: refactor filter / split
JDK-8324890 C2 SuperWord: refactor out VLoop, make unrolling_analysis static, remove init/reset mechanism
JDK-8324775 C2 SuperWord: refactor visited sets
JDK-8317572 C2 SuperWord: refactor/improve TraceSuperWord, replace VectorizeDebugOption with TraceAutoVectorization
JDK-8323577 C2 SuperWord: remove AlignVector restrictions on IR tests added in JDK-8305055
JDK-8324765 C2 SuperWord: remove dead code: SuperWord::insert_extracts
JDK-8324752 C2 Superword: remove SuperWordRTDepCheck
JDK-8325672 C2: allocate PhaseIdealLoop::_loop_or_ctrl from C->comp_arena()
JDK-8324129 C2: Remove some ttyLocker usages in preparation for JDK-8306767
JDK-8324750 C2: rename Matcher methods using "superword" -> "autovectorization"
JDK-8306767 Concurrent repacking of extra data in MethodData is potentially unsafe
JDK-8323641 Test compiler/loopopts/superword/TestAlignVectorFuzzer.java timed out

Erik Joelsson, Oracle

Bug Summary
JDK-8321557 Move SOURCE line verification for OracleJDK out of OpenJDK

Fredrik Bredberg, Oracle

Bug Summary
JDK-8322535 Change default AArch64 SpinPause instruction
JDK-8320317 ObjectMonitor NotRunnable is not really an optimization
JDK-8325153 SEGV in stackChunkOopDesc::derelativize_address(int)
JDK-8321371 SpinPause() not implemented for bsd_aarch64/macOS

Frederic Thevenet, Red Hat

Bug Summary
JDK-8321374 Add a configure option to explicitly set CompanyName property in VersionInfo resource for Windows exe/dll
JDK-8322309 Fix an inconsistancy in spacing style in spec.gmk.template

Gui Cao, Independent

Bug Summary
JDK-8324125 Improve class initialization barrier in TemplateTable::_new for RISC-V
JDK-8320397 RISC-V: Avoid passing t0 as temp register to MacroAssembler:: cmpxchg_obj_header/cmpxchgptr
JDK-8322583 RISC-V: Enable fast class initialization checks
JDK-8322154 RISC-V: JDK-8315743 missed change in MacroAssembler::load_reserved
JDK-8323694 RISC-V: Unnecessary ResourceMark in NativeCall::set_destination_mt_safe
JDK-8321972 test runtime/Unsafe/InternalErrorTest.java timeout on linux-riscv64 platform

George Adams, Microsoft

Bug Summary
JDK-8325194 GHA: Add macOS M1 testing

Guoxiong Li, Independent

Bug Summary
JDK-8321688 Build on linux with GCC 7.5.0 fails after 8319577
JDK-8321631 Fix comments in access.hpp
JDK-8322278 Generational ZGC: Adjust the comment of ZHeuristics::use_per_cpu_shared_small_pages
JDK-8314629 Generational ZGC: Clearing All SoftReferences log line lacks GCId
JDK-8322279 Generational ZGC: Use ZFragmentationLimit and ZYoungCompactionLimit as percentage instead of multiples
JDK-8322255 Generational ZGC: ZPageSizeMedium should be set before MaxTenuringThreshold
JDK-8322801 RISC-V: The riscv path of the debian sysroot had been changed
JDK-8322751 ZGC: Fix comments about marking roots

Goetz Lindenmaier, SAP

Bug Summary
JDK-8322417 Console read line with zero out should zero out when throwing exception
JDK-8322418 Problem list gc/TestAllocHumongousFragment.java subtests for 8298781

Gerard Ziemski, Oracle

Bug Summary
JDK-8300088 [IMPROVE] OPEN_MAX is no longer the max limit on macOS >= 10.6 for RLIMIT_NOFILE
JDK-8321931 memory_swap_current_in_bytes reports 0 as "unlimited"
JDK-8313083 Print 'rss' and 'cache' as part of the container information

Hannes Wallnoefer, Oracle

Bug Summary
JDK-8325325 Breadcrumb navigation shows preview link for modules and packages
JDK-8326694 Defer setting of autocapitalize attribute
JDK-8320458 Improve structural navigation in API documentation
JDK-8164094 javadoc allows to create a @link to a non-existent method
JDK-8321889 JavaDoc method references with wrong (nested) type
JDK-8325650 Table of contents scroll timeout not long enough
JDK-8326089 Text incorrectly placed in breadcrumbs list in generated docs

Harshitha Onkar, Oracle

Bug Summary
JDK-8312518 [macos13] setFullScreenWindow() shows black screen on macOS 13 & above
JDK-8320113 [macos14] : ShapeNotSetSometimes.java fails intermittently on macOS 14
JDK-8324733 [macos14] Problem list tests which fail due to macOS bug described in JDK-8322653
JDK-8324238 [macOS] java/awt/Frame/ShapeNotSetSometimes/ShapeNotSetSometimes.java fails with the shape has not been applied msg
JDK-8323617 Add missing null checks to GetMousePositionWithPopup.java test

Ilya Gavrilin, Independent

Bug Summary
JDK-8322790 RISC-V: Tune costs for shuffles with no conversion

Magnus Ihse Bursie, Oracle

Bug Summary
JDK-8326375 [REDO] Clean up NativeCompilation.gmk and its newly created parts
JDK-8325972 Add -x to bash for building with LOG=debug
JDK-8325558 Add jcheck whitespace checking for properties files
JDK-8325626 Allow selection of non-matching configurations using CONF=!string
JDK-8321373 Build should use LC_ALL=C.UTF-8
JDK-8323637 Capture hotspot replay files in GHA
JDK-8326509 Clean up JNIEXPORT in Hotspot after JDK-8017234
JDK-8325963 Clean up NativeCompilation.gmk and its newly created parts
JDK-8326368 compare.sh -2bins prints ugly errors on Windows
JDK-8326585 COMPARE_BUILD=PATCH fails if patch -R fails
JDK-8326412 debuginfo files should not have executable bit set
JDK-8324539 Do not use LFS64 symbols in JDK libs
JDK-8298046 Fix hidden but significant trailing whitespace in properties files for serviceability code
JDK-8017234 Hotspot should stop using mapfiles
JDK-8325950 Make sure all files in the JDK pass jcheck
JDK-8326953 Race in creation of win-exports.def with static-libs
JDK-8323675 Race in jdk.javadoc-gendata
JDK-8326406 Remove mapfile support from makefiles
JDK-8326583 Remove over-generalized DefineNativeToolchain solution
JDK-8324537 Remove superfluous _FILE_OFFSET_BITS=64
JDK-8325342 Remove unneeded exceptions in compare.sh
JDK-8326587 Separate out Microsoft toolchain linking
JDK-8252136 Several methods in hotspot are missing "static"
JDK-8325109 Sort method modifiers in canonical order
JDK-8325877 Split up NativeCompilation.gmk
JDK-8316657 Support whitebox testing in microbenchmarks
JDK-8321597 Use .template consistently for files treated as templates by the build
JDK-8324834 Use _LARGE_FILES on AIX

Ioi Lam, Oracle

Bug Summary
JDK-8322321 Add man page doc for -XX:+VerifySharedSpaces
JDK-8321940 Improve CDSHeapVerifier in handling of interned strings
JDK-8321539 Minimal build is broken by JDK-8320935

Ivan Walulya, Oracle

Bug Summary
JDK-8280087 G1: Handle out-of-mark stack situations during reference processing more gracefully
JDK-8325202 gc/g1/TestMarkStackOverflow.java intermittently crash: G1CMMarkStack::ChunkAllocator::allocate_new_chunk

Johannes Bechberger, SAP

Bug Summary
JDK-8325731 Installation instructions for Debian/Ubuntu don't mention autoconf

Jatin Bhateja, Intel

Bug Summary
JDK-8321648 Integral gather optimized mask computation.
JDK-8322768 Optimize non-subword vector compress and expand APIs for AVX2 target.

Jiangli Zhou, Google

Bug Summary
JDK-8326714 Make file-local functions static in src/java.base/unix/native/libjava/childproc.c
JDK-8326433 Make file-local functions static in src/jdk.jdwp.agent/unix/native/libjdwp/exec_md.c

Jie Fu, Tencent

Bug Summary
JDK-8322661 Build broken due to missing jvmtiExport.hpp after JDK-8320139
JDK-8324647 Invalid test group of lib-test after JDK-8323515

Jonathan Gibbons, Oracle

Bug Summary
JDK-8324231 bad command-line option in make/Docs.gmk
JDK-8299627 Fix/improve handling of "missing" element-list file
JDK-8323016 Improve reporting for bad options
JDK-8322865 JavaDoc fails on aggregator modules
JDK-8322874 Redirection loop in index.html
JDK-8325529 Remove unused imports from `ModuleGenerator` test file
JDK-8323628 Update license on "pass-through" files

John Jiang, Tencent

Bug Summary
JDK-8322734 A redundant return in method padWithLen
JDK-8320449 ECDHKeyAgreement should validate parameters before using them
JDK-8325022 Incorrect error message on client authentication
JDK-8322766 Micro bench SSLHandshake should use default algorithms

Joachim Kern, SAP

Bug Summary
JDK-8320890 [AIX] Find a better way to mimic dl handle equality
JDK-8319382 com/sun/jdi/JdwpAllowTest.java shows failures on AIX if prefixLen of mask is larger than 32 in IPv6 case

Jan Kratochvil, Azul

Bug Summary
JDK-8323700 Add fontconfig requirement to building.md for Alpine Linux
JDK-8317697 refactor-encapsulate x86 VM_Version::CpuidInfo

Jan Lahoda, Oracle

Bug Summary
JDK-8323657 Compilation of snippet results in VerifyError at runtime with --release 9 (and above)
JDK-8325440 Confusing error reported for octal literals with wrong digits
JDK-8325215 Incorrect not exhaustive switch error
JDK-8326129 Java Record Pattern Match leads to infinite loop
JDK-8322003 JShell - Incorrect type inference in lists of records implementing interfaces
JDK-8322532 JShell : Unnamed variable issue
JDK-8323057 Recoverable errors may be reported before unrecoverable errors when annotation processing is skipped
JDK-8322159 ThisEscapeAnalyzer crashes for erroneous code
JDK-8321582 yield .class not parsed correctly.

Jim Laskey, Oracle

Bug Summary
JDK-8322512 StringBuffer.repeat does not work correctly after toString() was called

Justin Lu, Oracle

Bug Summary
JDK-6230751 [Fmt-Ch] Recursive MessageFormats in ChoiceFormats ignore indicated subformats
JDK-6503196 API doc for DecimalFormat::getMaximumIntegerDigits is unclear
JDK-6285888 ChoiceFormat can support unescaped relational symbols in the Format segment
JDK-8325898 ChoiceFormat returns erroneous result when formatting bad pattern
JDK-8325908 Finish removal of IntlTest and CollatorTest
JDK-8321480 ISO 4217 Amendment 176 Update
JDK-8318761 MessageFormat pattern support for CompactNumberFormat, ListFormat, and DateTimeFormatter
JDK-8321545 Override toString() for Format subclasses
JDK-8319626 Override toString() for ZipFile
JDK-8322235 Split up and improve LocaleProvidersRun

Jamil Nimeh, Oracle

Bug Summary
JDK-8321542 C2: Missing ChaCha20 stub for x86_32 leads to crashes

Joe Wang, Oracle

Bug Summary
JDK-8320279 Link issues in java.xml module-info.java
JDK-8323571 Regression in source resolution process
JDK-8322214 Return value of XMLInputFactory.getProperty() changed from boolean to String in JDK 22 early access builds

johny.jose, Oracle

Bug Summary
JDK-8322725 (tz) Update Timezone Data to 2023d
JDK-8325150 (tz) Update Timezone Data to 2024a

Joshua Cao, Amazon

Bug Summary
JDK-8323820 [MacOS] build failure: non-void function does not return a value
JDK-8322490 cleanup CastNode construction
JDK-8322149 ConcurrentHashMap smarter presizing for copy constructor and putAll
JDK-8325610 CTW: Add StressIncrementalInlining to stress options
JDK-8325542 CTW: Runner can produce negative StressSeed
JDK-8323095 Expand TraceOptoParse block output abbreviations
JDK-8324667 fold Parse::seems_stable_comparison()
JDK-8324790 ifnode::fold_compares_helper cleanup
JDK-8325451 Missed elimination of assertion predicates
JDK-8321823 Remove redundant PhaseGVN transform_no_reclaim
JDK-8322976 Remove reference to transform_no_reclaim

Jaikiran Pai, Oracle

Bug Summary
JDK-8326152 Bad copyright header in test/jdk/java/util/zip/DeflaterDictionaryTests.java
JDK-8316738 java/net/httpclient/HttpClientLocalAddrTest.java failed in timeout
JDK-8278527 java/util/concurrent/tck/JSR166TestCase.java fails nanoTime test
JDK-8324668 JDWP process management needs more efficient file descriptor handling
JDK-8312150 Remove -Xnoagent option
JDK-8323645 Remove unused internal sun.net.www.protocol.jar.URLJarFileCallBack interface
JDK-8325304 Several classes in java.util.jar and java.util.zip don't specify the behaviour for null arguments
JDK-8326233 Utils#copySSLParameters loses needClientAuth Setting

Johan Sjölen, Oracle

Bug Summary
JDK-8325133 Missing MEMFLAGS parameter in parts of os API
JDK-8321975 Print when add_reserved_region fails even in product mode
JDK-8314186 runtime/8176717/TestInheritFD.java failed with "Log file was leaked"

Jiří Vaněk, Red Hat

Bug Summary
JDK-8323170 j2dbench is using outdated javac source/target to be able to build by itself

Jorn Vernee, Oracle

Bug Summary
JDK-8320310 CompiledMethod::has_monitors flag can be incorrect
JDK-8323651 compiler/c2/irTests/TestPrunedExHandler.java fails with -XX:+DeoptimizeALot
JDK-8322637 java/foreign/critical/TestCriticalUpcall.java timed out
JDK-8321400 java/foreign/TestStubAllocFailure.java fails with code cache exhaustion
JDK-8322324 java/foreign/TestStubAllocFailure.java times out while waiting for forked process
JDK-8318966 Some methods make promises about Java array element alignment that are too strong
JDK-8320886 Unsafe_SetMemory0 is not guarded

Julian Waters, Independent

Bug Summary
JDK-8324800 gcc windows build broken after 8322757
JDK-8325049 stubGenerator_ppc.cpp should use alignas
JDK-8324838 test_nmt_locationprinting.cpp broken in the gcc windows build

Kim Barrett, Oracle

Bug Summary
JDK-8324242 Avoid null check for OopHandle::ptr_raw()
JDK-8322806 Eliminate -Wparentheses warnings in aarch64 code
JDK-8322880 Eliminate -Wparentheses warnings in arm32 code
JDK-8322758 Eliminate -Wparentheses warnings in C2 code
JDK-8322759 Eliminate -Wparentheses warnings in compiler code
JDK-8322807 Eliminate -Wparentheses warnings in gc code
JDK-8323110 Eliminate -Wparentheses warnings in ppc code
JDK-8322765 Eliminate -Wparentheses warnings in runtime code
JDK-8322815 Eliminate -Wparentheses warnings in shenandoah code
JDK-8322805 Eliminate -Wparentheses warnings in x86 code
JDK-8322879 Eliminate -Wparentheses warnings in x86-32 code
JDK-8322757 Enable -Wparentheses warnings
JDK-8324286 Fix backsliding on use of nullptr instead of NULL
JDK-8324492 Remove Atomic support for OopHandle
JDK-8324240 Remove unused GrowableArrayView::EMPTY
JDK-8325042 Remove unused JVMDITools test files
JDK-8326524 Rename agent_common.h
JDK-8324880 Rename get_stack_trace.h
JDK-8325055 Rename Injector.h
JDK-8325910 Rename jnihelper.h
JDK-8326090 Rename jvmti_aod.h
JDK-8325180 Rename jvmti_FollowRefObjects.h
JDK-8325458 Rename mlvmJvmtiUtils.h
JDK-8325347 Rename native_thread.h
JDK-8325367 Rename nsk_list.h
JDK-8325456 Rename nsk_mutex.h
JDK-8325682 Rename nsk_strace.h
JDK-8322817 RISC-V: Eliminate -Wparentheses warnings in riscv code
JDK-8322816 RISC-V: Incorrect guarantee in patch_vtype
JDK-8322747 StringTable should be AllStatic
JDK-8324799 Use correct extension for C++ test headers
JDK-8323115 x86-32: Incorrect predicates for cmov instruct transforms with UseSSE

Kevin Walls, Oracle

Bug Summary
JDK-8324845 management.properties text "interface name" is misleading
JDK-8321729 Remove 'orb' field in RMIConnector
JDK-8318707 Remove the Java Management Extension (JMX) Management Applet (m-let) feature
JDK-8311306 Test com/sun/management/ThreadMXBean/ThreadCpuTimeArray.java failed: out of expected range

Alexander Zuev, Oracle

Bug Summary
JDK-8322239 [macos] a11y : java.lang.NullPointerException is thrown when focus is moved on the JTabbedPane
JDK-8320692 Null icon returned for .exe without custom icon

korov9, Independent

Bug Summary
JDK-8310351 Typo in ImmutableCollections

Koichi Sakata, NTT DATA

Bug Summary
JDK-8322927 Unused code in LIR_Assembler::verify_oop_map

kuaiwei.kw, Alibaba

Bug Summary
JDK-8326135 Enhance adlc to report unused operands
JDK-8324186 use "dmb.ishst+dmb.ishld" for release barrier

Vladimir Kozlov, Oracle

Bug Summary
JDK-8324174 assert(m->is_entered(current)) failed: invariant
JDK-8324969 C2: prevent elimination of unbalanced coarsened locking regions
JDK-8322743 C2: prevent lock region elimination in OSR compilation
JDK-8324050 Issue store-store barrier after re-materializing objects during deoptimization
JDK-8324865 windows-x64-slowdebug still does not build after JDK-8324840

Kangcheng Xu, Independent

Bug Summary
JDK-8320237 C2: late inlining of method handle invoke causes duplicate lines in PrintInlining output

Lance Andersen, Oracle

Bug Summary
JDK-8316141 Improve CEN header validation checking
JDK-8321156 Improve the handling of invalid UTF-8 byte sequences for ZipInputStream::getNextEntry and ZipFile::getComment
JDK-8326687 Inconsistent use of "ZIP", "Zip" and "zip" in java.util.zip/jar zipfs javadoc
JDK-8326351 Update the Zlib version in open/src/java.base/share/legal/zlib.md to 1.3.1
JDK-8324632 Update Zlib Data Compression Library to Version 1.3.1

Laurent Bourgès, Independent

Bug Summary
JDK-8323695 RenderPerf (2D) enhancements (23.12)

Chen Liang, Independent

Bug Summary
JDK-8323698 Class use page does not include extends/implements type arguments
JDK-8319463 ClassSignature should have superclass and superinterfaces as ClassTypeSig
JDK-8294977 Convert test/jdk/java tests from ASM library to Classfile API

limingliu, Ampere

Bug Summary
JDK-8315923 pretouch_memory by atomic-add-0 fragments huge pages unexpectedly

lizbing07734, Independent

Bug Summary
JDK-8293622 Cleanup use of G1ConcRefinementThreads
JDK-8322890 Directly return in OldPLABSizeConstraintFunc
JDK-8233443 G1 DetailedUsage class names overly generic for global namespace
JDK-8234502 Merge GenCollectedHeap and SerialHeap
JDK-8325081 Move '_soft_ref_policy' to 'CollectedHeap'
JDK-8322205 Parallel: Remove unused arg in PSCardTable::pre_scavenge
JDK-8297573 Parallel: Rename do_oop_nv to do_oop_work in subclasses of OopClosure
JDK-8315040 Remove redundant check in WorkerPolicy::parallel_worker_threads
JDK-8325082 Rename headers named 'heapRegion*' of G1
JDK-8323660 Serial: Fix header ordering and indentation
JDK-8293623 Simplify G1ConcurrentRefineThreadControl
JDK-8323693 Update some copyright announcements in the new files created in 8234502

Leo Korinth, Oracle

Bug Summary
JDK-8325763 Revert properties: vm.opt.x.*

Leonid Mesnik, Oracle

Bug Summary
JDK-8316460 4 javax/management tests ignore VM flags
JDK-8316451 6 java/lang/instrument/PremainClass tests ignore VM flags
JDK-8326006 Allow TEST_VM_FLAGLESS to set flagless mode
JDK-8324861 Exceptions::wrap_dynamic_exception() doesn't have ResourceMark
JDK-8319578 Few java/lang/instrument ignore test.java.opts and accept test.vm.opts only
JDK-8325906 Problemlist vmTestbase/vm/mlvm/meth/stress/compiler/deoptimize/Test.java#id1 until JDK-8320865 is fixed
JDK-8324582 Replace -Djava.util.concurrent.ForkJoinPool.common.parallelism to -Djdk.virtualThreadScheduler.maxPoolSize in jvmti vthread tests
JDK-8299023 TestPLABResize.java and TestPLABPromotion.java are failing intermittently

Ludovic Henry, Rivos

Bug Summary
JDK-8319716 RISC-V: Add SHA-2
JDK-8315856 RISC-V: Use Zacas extension for cmpxchg

Markus Karg, Independent

Bug Summary
JDK-8322141 SequenceInputStream.transferTo should not return as soon as Long.MAX_VALUE bytes have been transferred

martin.desruisseaux, @geomatys.com

Bug Summary
JDK-8323108 BufferedImage.setData(Raster) should not cast float and double values to integers

Matias Saavedra Silva, Oracle

Bug Summary
JDK-8320276 Improve class initialization barrier in TemplateTable::_new
JDK-8324584 Optimize Symbol and char* handling in ClassLoader
JDK-8302790 Set FileMapRegion::mapped_base() to null if mapping fails
JDK-8321474 TestAutoCreateSharedArchiveUpgrade.java should be updated with JDK 21
JDK-8321933 TestCDSVMCrash.java spawns two processes

Matthias Baesken, SAP

Bug Summary
JDK-8324753 [AIX] adjust os_posix after JDK-8318696
JDK-8324637 [aix] Implement support for reporting swap space in jdk.management
JDK-8325470 [AIX] use fclose after fopen in read_psinfo
JDK-8323330 [BACKOUT] JDK-8276809: java/awt/font/JNICheck/FreeTypeScalerJNICheck.java shows JNI warning on Windows
JDK-8326389 [test] improve assertEquals failure output
JDK-8322366 Add IEEE rounding mode corruption check to JNI checks
JDK-8325116 Amend jdk.ContainerConfiguration by swap related value
JDK-8322782 Clean up usages of unnecessary fully qualified class name "java.util.Arrays"
JDK-8325876 crashes in docker container tests on Linuxppc64le Power8 machines
JDK-8325432 enhance assert message "relocation addr must be in this section"
JDK-8323008 filter out harmful -std* flags added by autoconf from CXX
JDK-8323331 fix typo hpage_pdm_size
JDK-8276809 java/awt/font/JNICheck/FreeTypeScalerJNICheck.java shows JNI warning on Windows
JDK-8222719 libperfstat on AIX - cleanup old API versions
JDK-8322098 os::Linux::print_system_memory_info enhance the THP output with /sys/kernel/mm/transparent_hugepage/hpage_pmd_size
JDK-8322783 prioritize /etc/os-release over /etc/SuSE-release in hs_err/info output
JDK-8322945 Problemlist runtime/CompressedOops/CompressedClassPointers.java on AIX
JDK-8321017 Record in JFR that IEEE rounding mode was corrupted by loading a library
JDK-8324287 Record total and free swap space in JFR
JDK-8323964 runtime/Thread/ThreadCountLimit.java fails intermittently on AIX
JDK-8322163 runtime/Unsafe/InternalErrorTest.java fails on Alpine after JDK-8320886
JDK-8325862 set -XX:+ErrorFileToStderr when executing java in containers for some container related jtreg tests
JDK-8326140 src/jdk.accessibility/windows/native/libjavaaccessbridge/AccessBridgeJavaEntryPoints.cpp ReleaseStringChars might be missing in early returns
JDK-8325743 test/jdk/java/nio/channels/unixdomain/SocketOptions.java enhance user name output in error case
JDK-8324598 use mem_unit when working with sysinfo memory and swap related information

Martin Balao, Red Hat

Bug Summary
JDK-8325254 CKA_TOKEN private and secret keys are not necessarily sensitive

Mandy Chung, Oracle

Bug Summary
JDK-8159927 Add a test to verify JMOD files created in the images do not have debug symbols
JDK-8325262 jdeps can drop printing stack trace when FindException is thrown due to modules not found
JDK-8321703 jdeps generates illegal dot file containing nodesep=0,500000
JDK-8322809 SystemModulesMap::classNames and moduleNames arrays do not match the order

Martin Doerr, SAP

Bug Summary
JDK-8326378 [PPC64] CodeEntryAlignment too large
JDK-8325326 [PPC64] Don't relocate in case of allocation failure
JDK-8326101 [PPC64] Need to bailout cleanly if creation of stubs fails when code cache is out of space
JDK-8325213 Flags introduced by configure script are not passed to ADLC build

Matthew Donovan, Oracle

Bug Summary
JDK-8319673 Few security tests ignore VM flags
JDK-8321925 sun/security/mscapi/KeytoolChangeAlias.java fails with "Alias <246810> does not exist"
JDK-8319128 sun/security/pkcs11 tests fail on OL 7.9 aarch64

Markus Grönlund, Oracle

Bug Summary
JDK-8322489 22-b27: Up to 7% regression in all Footprint3-*-G1/ZGC
JDK-8326219 applications/kitchensink/Kitchensink8H.java timed out
JDK-8323540 assert((!((((method)->is_trace_flag_set(((1 << 4) << 8))))))) failed: invariant
JDK-8323883 JFR AssertionError: Missing object ID 15101
JDK-8326334 JFR failed assert(used(klass)) failed: invariant
JDK-8323631 JfrTypeSet::write_klass can enqueue a CLD klass that is unloading
JDK-8316241 Test jdk/jdk/jfr/jvm/TestChunkIntegrity.java failed
JDK-8326106 Write and clear stack trace table outside of safepoint

Mikael Vidstedt, Oracle

Bug Summary
JDK-8274300 Address dsymutil warning by excluding platform specific files
JDK-8325800 Drop unused cups declaration from Oracle build configuration
JDK-8322873 Duplicate -ljava -ljvm options for libinstrument
JDK-8325570 Update to Graphviz 9.0.0

Hamlin Li, Huawei

Bug Summary
JDK-8318629 G1: Refine code a bit in G1RemSetTrackingPolicy::update_at_allocate
JDK-8324304 RISC-V: add hw probe flags
JDK-8323748 RISC-V: Add Zfh probe code
JDK-8318228 RISC-V: C2 ConvF2HF
JDK-8318227 RISC-V: C2 ConvHF2F
JDK-8322209 RISC-V: Enable some tests related to MD5 instrinsic
JDK-8322179 RISC-V: Implement SHA-1 intrinsic
JDK-8322195 RISC-V: Minor improvement of MD5 instrinsic
JDK-8326824 Test: remove redundant test in compiler/vectorapi/reshape/utils/TestCastMethods.java
JDK-8325037 x86: enable and fix hotspot/jtreg/compiler/vectorization/TestRoundVectFloat.java

Mark Powers, Oracle

Bug Summary
JDK-8318105 [jmh] the test java.security.HSS failed with 2 active threads

Naoto Sato, Oracle

Bug Summary
JDK-8321958 @param/@return descriptions of ZoneRules#isDaylightSavings() are incorrect
JDK-8320919 Clarify Locale related system properties
JDK-8321409 Console read line with zero out should zero out underlying buffer in JLine (redux)
JDK-8324065 Daylight saving information for `Africa/Casablanca` are incorrect
JDK-8326158 Javadoc for java.time.DayOfWeek#minus(long)
JDK-8324665 Loose matching of space separators in the lenient date/time parsing mode
JDK-8321206 Make Locale related system properties `StaticProperty`
JDK-8322647 Short name for the `Europe/Lisbon` time zone is incorrect
JDK-8320788 The system properties page is missing some properties

Tom Rodriguez, Oracle

Bug Summary
JDK-8321288 [JVMCI] HotSpotJVMCIRuntime doesn't clean up WeakReferences in resolvedJavaTypes
JDK-8324983 Race in CompileBroker::possibly_add_compiler_threads

Oli Gillespie, Amazon

Bug Summary
JDK-8324646 Avoid Class.forName in SecureRandom constructor
JDK-8324648 Avoid NoSuchMethodError when instantiating NativePRNG

Olga Mikhaltcova, Azul

Bug Summary
JDK-8318158 RISC-V: implement roundD/roundF intrinsics

Patricio Chilano Mateo, Oracle

Bug Summary
JDK-8320275 assert(_chunk->bitmap().at(index)) failed: Bit not set at index
JDK-8320302 compiler/arguments/TestC1Globals.java hits SIGSEGV in ContinuationEntry::set_enter_code
JDK-8323595 is_aligned(p, alignof(OopT))) assertion fails in Jetty without compressed OOPs
JDK-8322962 Upcall stub might go undetected when freezing frames

Per-Ake Minborg, Oracle

Bug Summary
JDK-8323746 Add PathElement hashCode and equals
JDK-8323601 Improve LayoutPath.PathElement::toString
JDK-8326112 Javadoc snippet for Linker.Option.captureCallState is wrong
JDK-8323621 JDK build should exclude snippet class in java.lang.foreign
JDK-8323745 Missing comma in copyright header in TestScope
JDK-8321706 SegmentAllocator:allocateFrom(AddressLayout, MemorySegment) does not throw stated UnsupportedOperationException
JDK-8321786 SegmentAllocator:allocateFrom(ValueLayout, MemorySegment,ValueLayout,long,long) spec mismatch in exception scenario
JDK-8325001 Typo in the javadocs for the Arena::ofShared method

Pavel Rappo, Oracle

Bug Summary
JDK-8310277 jdk/javadoc/doclet/testMethodCommentAlgorithm/TestMethodCommentsAlgorithm.java fails with IllegalStateException
JDK-8310813 Simplify and modernize equals, hashCode, and compareTo for BigInteger
JDK-8322936 Update blessed-modifier-order.sh for default, sealed, and non-sealed
JDK-8324053 Use the blessed modifier order for sealed in java.base

Philip Race, Oracle

Bug Summary
JDK-8286827 BogusColorSpace methods return wrong array
JDK-8312307 Obsoleted code in hb-jdk-font.cc
JDK-8288712 Typo in javadoc in javax.imageio.ImageReader.java

Prasanta Sadhukhan, Oracle

Bug Summary
JDK-8322754 click JComboBox when dialog about to close causes IllegalComponentStateException
JDK-8318112 CSS percentage values are capped at 100%
JDK-6510914 JScrollBar.getMinimumSize() breaks the contract of JComponent.setMinimumSize()
JDK-6507038 Memory Leak in JTree / BasicTreeUI
JDK-8327040 Problemlist ActionListenerCalledTwiceTest.java test failing in macos14

Paul Sandoz, Oracle

Bug Summary
JDK-8324858 [vectorapi] Bounds checking issues when accessing memory segments

psoujany, IBM

Bug Summary
JDK-8311893 Interactive component with ARIA role 'tabpanel' does not have a programmatically associated name

Quan Anh Mai, Independent

Bug Summary
JDK-8319451 PhaseIdealLoop::conditional_move is too conservative

Patrick Zhang, Ampere

Bug Summary
JDK-8324824 AArch64: Detect Ampere-1B core and update default options for Ampere CPUs

raphael.m.mosaner, Oracle

Bug Summary
JDK-8320139 [JVMCI] VmObjectAlloc is not generated by intrinsics methods which allocate objects

Roberto Castaneda Lozano, Oracle

Bug Summary
JDK-8322692 ZGC: avoid over-unrolling due to hidden barrier size

Claes Redestad, Oracle

Bug Summary
JDK-8325340 Add ASCII fast-path to Data-/ObjectInputStream.readUTF
JDK-8325169 Reduce String::indexOf overheads
JDK-8323529 Relativize test image dependencies in microbenchmarks
JDK-8326653 Remove jdk.internal.reflect.UTF8
JDK-8326370 Remove redundant and misplaced micros from StringBuffers
JDK-8321468 Remove StringUTF16::equals
JDK-8323794 Remove unused jimage compressor plugin configuration
JDK-8325730 StringBuilder.toString allocation for the empty String
JDK-8323995 Suppress notes generated on incremental microbenchmark builds

Robbin Ehn, Rivos

Bug Summary
JDK-8320069 RISC-V: Add Zcb instructions
JDK-8326235 RISC-V: Size CodeCache for short calls encoding
JDK-8321282 RISC-V: SpinPause() not implemented
JDK-8321075 RISC-V: UseSystemMemoryBarrier lacking proper OS support

Raffaello Giulietti, Oracle

Bug Summary
JDK-8275338 Add JFR events for notable serialization situations
JDK-8324220 jdk/jfr/event/io/TestSerializationMisdeclarationEvent.java had 22 failures

Rajan Halade, Oracle

Bug Summary
JDK-8321408 Add Certainly roots R1 and E1

Renjith Kannath Pariyangad, Oracle

Bug Summary
JDK-8316497 ColorConvertOp - typo for non-ICC conversions needs one-line fix
JDK-8320343 Generate GIF images for AbstractButton/5049549/bug5049549.java
JDK-8321192 j.a.PrintJob/ImageTest/ImageTest.java: Fail or skip the test if there's no printer
JDK-8320673 PageFormat/CustomPaper.java has no Pass/Fail buttons; multiple instructions

Roman Kennke, Amazon

Bug Summary
JDK-8322383 G1: Only preserve marks on objects that are actually moved
JDK-8139457 Relax alignment of array elements
JDK-8324734 Relax too-strict assert(VM_Version::supports_evex()) in Assembler::locate_operand()

Rajat Mahajan, Oracle

Bug Summary
JDK-8322545 Declare newInsets as static in ThemeReader.cpp
JDK-8321151 JDK-8294427 breaks Windows L&F on all older Windows versions
JDK-8301994 Remove unused code from awt_List.cpp
JDK-8320328 Restore interrupted flag in ImageIcon.loadImage
JDK-8320342 Use PassFailJFrame for TruncatedPopupMenuTest.java

Roland Westrelin, Red Hat

Bug Summary
JDK-8319793 C2 compilation fails with "Bad graph detected in build_loop_late" after JDK-8279888
JDK-8323274 C2: array load may float above range check
JDK-8325372 Shenandoah: SIGSEGV crash in unnecessary_acquire due to LoadStore split through phi

Richard Reingruber, SAP

Bug Summary
JDK-8322294 Cleanup NativePostCallNop
JDK-8290965 PPC64: Implement post-call NOPs
JDK-8323782 Race: Thread::interrupt vs. AbstractInterruptibleChannel.begin

Roger Riggs, Oracle

Bug Summary
JDK-8321180 Condition for non-latin1 string size too large exception is off by one
JDK-8324657 Intermittent OOME on exception message create
JDK-8325590 Regression in round-tripping UTF-16 strings after JDK-8311906
JDK-8322018 Test java/lang/String/CompactString/MaxSizeUTF16String.java fails with -Xcomp

Robert Toyonaga, Red Hat

Bug Summary
JDK-8326529 JFR: Test for CompilerCompile events fails due to time out

sam, @gentoo.org

Bug Summary
JDK-8324243 Compilation failures in java.desktop module with gcc 14
JDK-8318696 Do not use LFS64 symbols on Linux

sebastian.lovdahl, @hibox.tv

Bug Summary
JDK-8226919 attach in linux hangs due to permission denied accessing /proc/pid/root

Sergey Bylokhov, Amazon

Bug Summary
JDK-8270269 Desktop.browse method fails if earlier CoInitialize call as COINIT_MULTITHREADED
JDK-8324347 Enable "maybe-uninitialized" warning for FreeType 2.13.1
JDK-8318603 Parallelize sun/java2d/marlin/ClipShapeTest.java
JDK-8323562 SaslInputStream.read() may return wrong value
JDK-4760025 sRGB conversions to and from CIE XYZ incorrect
JDK-8323554 The typos in Javadoc: "@return if "
JDK-8323210 Update the usage of cmsFLAGS_COPY_ALPHA

Scott Gibbons, Intel

Bug Summary
JDK-8321599 Data loss in AVX3 Base64 decoding

Aleksey Shipilev, Amazon

Bug Summary
JDK-8323584 AArch64: Unnecessary ResourceMark in NativeCall::set_destination_mt_safe
JDK-8323519 Add applications/ctw/modules to Hotspot tiered testing
JDK-8324514 ClassLoaderData::print_on should print address of class loader
JDK-8323515 Create test alias "all" for all test roots
JDK-8324937 GHA: Avoid multiple test suites per job
JDK-8324659 GHA: Generic jtreg errors are not reported
JDK-8324723 GHA: Upgrade some actions to avoid deprecated Node 16
JDK-8322282 Incorrect LoaderConstraintTable::add_entry after JDK-8298468
JDK-8323717 Introduce test keyword for tests that need external dependencies
JDK-8321137 Reconsider ICStub alignment
JDK-8237842 Separate definitions for default cache line and padding sizes
JDK-8322954 Shenandoah: Convert evac-update closures asserts to rich asserts
JDK-8325587 Shenandoah: ShenandoahLock should allow blocking in VM
JDK-8323065 Unneccesary CodeBlob lookup in CompiledIC::internal_set_ic_destination
JDK-8323503 x86: Shorter movptr(reg, imm) for 32-bit unsigned immediates

Shaojin Wen, Alibaba

Bug Summary
JDK-8316704 Regex-free parsing of Formatter and FormatProcessor specifiers

Aleksandre Iline, Oracle

Bug Summary
JDK-8321621 Update JCov version to 3.0.16

Volker Simonis, Amazon

Bug Summary
JDK-8324241 Always record evol_method deps to avoid excessive method flushing

Stefan Johansson, Oracle

Bug Summary
JDK-8325403 Add SystemGC JMH benchmarks

songpv, @imt-soft.com

Bug Summary
JDK-8317287 [macos14] InterJVMGetDropSuccessTest.java: Child VM: abnormal termination

Srinivas Parasa, Intel

Bug Summary
JDK-8319577 x86_64 AVX2 intrinsics for Arrays.sort methods (int, float arrays)

sroy, Unknown

Bug Summary
JDK-8320005 Allow loading of shared objects with .a extension on AIX

Serguei Spitsyn, Oracle

Bug Summary
JDK-8311218 fatal error: stuck in JvmtiVTMSTransitionDisabler::VTMS_transition_disable
JDK-8321685 Missing ResourceMark in code called from JvmtiEnvBase::get_vthread_jvf
JDK-8322538 remove fatal from JVM_VirtualThread functions for !INCLUDE_JVMTI
JDK-8324680 Replace NULL with nullptr in JVMTI generated code
JDK-8322744 VirtualThread.notifyJvmtiDisableSuspend should be static

Stefan Karlsson, Oracle

Bug Summary
JDK-8323297 Fix incorrect placement of precompiled.hpp include lines
JDK-8322957 Generational ZGC: Relocation selection must join the STS
JDK-8321713 Harmonize executeTestJvm with create[Limited]TestJavaProcessBuilder
JDK-8325616 JFR ZGC Allocation Stall events should record stack traces
JDK-8323716 Only print ZGC Phase Switch events in hs_err files when running with ZGC
JDK-8321718 ProcessTools.executeProcess calls waitFor before logging
JDK-8325752 Remove badMetaWordVal
JDK-8325742 Remove MetaWord usage from MemRegion
JDK-8323508 Remove TestGCLockerWithShenandoah.java line from TEST.groups
JDK-8325437 Safepoint polling in monitor deflation can cause massive logs
JDK-8322920 Some ProcessTools.execute* functions are declared to throw Throwable
JDK-8321683 Tests fail with AssertionError in RangeWithPageSize
JDK-8323730 Tweak TestZAllocationStallEvent.java to allocate smaller objects
JDK-8321812 Update GC tests to use execute[Limited]TestJava

stevenschlansker, Independent

Bug Summary
JDK-8321892 Typo in log message logged by src/hotspot/share/nmt/virtualMemoryTracker.cpp

Sergey Tsypanov, Independent

Bug Summary
JDK-8321279 Implement hashCode() in Heap-X-Buffer.java.template
JDK-8320971 Use BufferedInputStream.buf directly when param of implTransferTo() is trusted

Thomas Stuefe, Red Hat

Bug Summary
JDK-8326376 java -version failed with CONF=fastdebug -XX:InitialCodeCacheSize=1024K -XX:ReservedCodeCacheSize=1200k
JDK-8325496 Make TrimNativeHeapInterval a product switch
JDK-8326067 Remove os::remap_memory and simplify os::map_memory
JDK-8325306 Rename static huge pages to explicit huge pages
JDK-8318444 Write details about compilation bailouts into crash reports

Sundararajan Athijegannathan, Oracle

Bug Summary
JDK-8310995 missing @since tags in 36 jdk.dynalink classes

Sun Yaqi, Loongson

Bug Summary
JDK-8322881 java/nio/file/Files/CopyMoveVariations.java fails with AccessDeniedException due to permissions of files in /tmp

Sandhya Viswanathan, Intel

Bug Summary
JDK-8321712 C2: "failed: Multiple uses of register" in C2_MacroAssembler::vminmax_fp

syan, Unknown

Bug Summary
JDK-8325024 java/security/cert/CertPathValidator/OCSP/OCSPTimeout.java incorrect comment information
JDK-8326726 Problem list Exhaustiveness.java due to 8326616
JDK-8326636 Problem list StartupOutput.java due to 8326615
JDK-8326461 tools/jlink/CheckExecutable.java fails as .debuginfo files are not executable

Sonia Zaldana Calles, Red Hat

Bug Summary
JDK-8324126 Error message for mistyping -XX:+Unlock...Options is not helpful
JDK-8323994 gtest runner repeats test name for every single gtest assertion

Tobias Hartmann, Oracle

Bug Summary
JDK-8310844 [AArch64] C1 compilation fails because monitor offset in OSR buffer is too large for immediate
JDK-8322985 [BACKOUT] 8318562: Computational test more than 2x slower when AVX instructions are used
JDK-8325449 [BACKOUT] use "dmb.ishst+dmb.ishld" for release barrier
JDK-8323012 C2 fails with fatal error: no reachable node should have no use
JDK-8321974 Crash in ciKlass::is_subtype_of because TypeAryPtr::_klass is not initialized
JDK-8326638 Crash in PhaseIdealLoop::remix_address_expressions due to unexpected Region instead of Loop

thihup, Independent

Bug Summary
JDK-8325505 Fix Javadoc ResourceBundle::getString

Tobias Holenstein, Oracle

Bug Summary
JDK-8210858 AArch64: remove Math.log intrinsic
JDK-8316756 C2 EA fails with "missing memory path" when encountering unsafe_arraycopy stub call
JDK-8325441 IGV: update pom.xml such that IntelliJ can import as maven project
JDK-8321984 IGV: Upgrade to Netbeans Platform 20
JDK-8277869 Maven POMs are using HTTP links where HTTPS is available

Tim Prinzing, Oracle

Bug Summary
JDK-8319571 Update jni/nullCaller/NullCallerTest.java to accept flags or mark as flagless

Tejesh R, Oracle

Bug Summary
JDK-8323670 A few client tests intermittently throw ConcurrentModificationException
JDK-8187759 Background not refreshed when painting over a transparent JFrame
JDK-8295804 javax/swing/JFileChooser/JFileChooserSetLocationTest.java failed with "setLocation() is not working properly"
JDK-8264102 JTable Keyboards Navigation differs with Test Instructions.
JDK-8259550 The content of the print out displayed incomplete with the NimbusLAF

Thomas Schatzl, Oracle

Bug Summary
JDK-8322484 22-b26 Regression in J2dBench-bimg_misc-G1 (and more) on Windows-x64 and macOS-x64
JDK-8317007 Add bulk removal of dead nmethods during class unloading
JDK-8325857 G1 Full GC flushes mark stats cache too early
JDK-8323610 G1: HeapRegion pin count should be size_t to avoid overflows
JDK-8326781 G1ConcurrentMark::top_at_rebuild_start() should take a HeapRegion* not an uint
JDK-8323066 gc/g1/TestSkipRebuildRemsetPhase.java fails with 'Skipping Remembered Set Rebuild.' missing
JDK-8326590 Improve description of MarkStackSize[Max] flags
JDK-8322330 JavadocHelperTest.java OOMEs with Parallel GC and ZGC
JDK-8322987 Remove gc/stress/gclocker/TestGCLocker* since they always fail with OOME
JDK-8321512 runtime/CommandLine/OptionsValidation/TestOptionsWithRanges.java fails on 32-bit platforms
JDK-8321422 Test gc/g1/pinnedobjs/TestPinnedObjectTypes.java times out after completion
JDK-8323635 Test gc/g1/TestHumongousAllocConcurrentStart.java fails with -XX:TieredStopAtLevel=3
JDK-8319548 Unexpected internal name for Filler array klass causes error in VisualVM
JDK-8323731 Unproblemlist gc/stress/TestStressG1Humongous.java
JDK-8324840 windows-x64-slowdebug does not build anymore after JDK-8317572

Varada M, IBM

Bug Summary
JDK-8301466 [AIX] Revisit CommittedVirtualMemoryTest
JDK-8322648 Improve class initialization barrier in TemplateTable::_new for PPC
JDK-8323276 StressDirListings.java fails on AIX

Viktor Klang, Oracle

Bug Summary
JDK-8325754 Dead AbstractQueuedSynchronizer$ConditionNodes survive minor garbage collections
JDK-8309218 java/util/concurrent/locks/Lock/OOMEInAQS.java still times out with ZGC, Generational ZGC, and SerialGC
JDK-8314515 java/util/concurrent/SynchronousQueue/Fairness.java failed with "Error: fair=false i=8 j=0"

Vladimir Petko, Canonical

Bug Summary
JDK-8242564 javadoc crashes:: class cast exception com.sun.tools.javac.code.Symtab$6

Vicente Arturo Romero Zaldivar, Oracle

Bug Summary
JDK-8322477 order of subclasses in the permits clause can differ between compilations
JDK-8323835 Updating ASM to 9.6 for JDK 23

vtsty.dev, Independent

Bug Summary
JDK-8307246 Printing: banded raster path doesn't account for device offset values

Weibing Xiao, Oracle

Bug Summary
JDK-8318971 Better Error Handling for Jar Tool When Processing Non-existent Files

Weijun Wang, Oracle

Bug Summary
JDK-8325506 Ensure randomness is only read from provided SecureRandom object
JDK-8322971 KEM.getInstance() should check if a 3rd-party security provider is signed
JDK-8187634 keystore.getCertificateAlias(cert) returns original alias, inconsistent with fix of JDK-6483657
JDK-8202598 keytool -certreq output contains inconsistent line separators
JDK-8311003 missing @since info in jdk.security.jgss
JDK-8320597 RSA signature verification fails on signed data that does not encode params correctly
JDK-8325680 Uninitialised memory in deleteGSSCB of GSSLibStub.c:179

William Kemper, Amazon

Bug Summary
JDK-8322503 Shenandoah: Clarify gc state usage
JDK-8323021 Shenandoah: Encountered reference count always attributed to first worker thread
JDK-8323629 Shenandoah: Fix missing include and declaration
JDK-8321815 Shenandoah: gc state should be synchronized to java threads only once per safepoint
JDK-8323086 Shenandoah: Heap could be corrupted by oom during evacuation
JDK-8324334 Shenandoah: Improve end of process report
JDK-8324981 Shenandoah: Move commit and soft max heap changed methods into heap
JDK-8325516 Shenandoah: Move heap change tracking into ShenandoahHeap
JDK-8324553 Shenandoah: Move periodic tasks closer to their collaborators
JDK-8325517 Shenandoah: Reduce unnecessary includes from shenandoahControlThread.cpp
JDK-8325807 Shenandoah: Refactor full gc in preparation for generational mode changes
JDK-8323627 Shenandoah: Refactor init logger
JDK-8325574 Shenandoah: Simplify and enhance reporting of requested GCs
JDK-8323428 Shenandoah: Unused memory in regions compacted during a full GC should be mangled

Wang Zhuo, Alibaba

Bug Summary
JDK-8324123 aarch64: fix prfm literal encoding in assembler
JDK-8324817 Parallel GC does not pre-touch all heap pages when AlwaysPreTouch enabled and large page disabled

xingqizheng.xqz, Alibaba

Bug Summary
JDK-8324280 RISC-V: Incorrect implementation in VM_Version::parse_satp_mode

Xin Liu, Amazon

Bug Summary
JDK-8320128 Clean up Parse constructor for OSR
JDK-8322982 CTW fails to build after 8308753

yansendao.ysd, Alibaba

Bug Summary
JDK-8323640 [TESTBUG]testMemoryFailCount in jdk/internal/platform/docker/TestDockerMemoryMetrics.java always fail because OOM killed

Yi-Fan Tsai, Amazon

Bug Summary
JDK-8314029 Add file name parameter to Compiler.perfmap
JDK-8316197 Make tracing of inline cache available in unified logging

yifeng.jyf, Alibaba

Bug Summary
JDK-8325464 GCCause.java out of sync with gcCause.hpp

Y. Ramakrishna, Amazon

Bug Summary
JDK-8314329 AgeTable: add is_clear() & allocation spec, and relax assert to allow use of 0-index slot

Yude Lin, Alibaba

Bug Summary
JDK-8323122 AArch64: Increase itable stub size estimate

Yuri Gaevsky, Independent

Bug Summary
JDK-8318217 RISC-V: C2 VectorizedHashCode

Yi Yang, Alibaba

Bug Summary
JDK-8323795 jcmd Compiler.codecache should print total size of code cache

Zhengyu Gu, Independent

Bug Summary
JDK-8326722 Cleanup unnecessary forward declaration in collectedHeap.hpp
JDK-8322057 Memory leaks in creating jfr symbol array
JDK-8326892 Remove unused PSAdaptiveSizePolicyResizeVirtualSpaceAlot develop flag

zhiqiang.zang, Independent

Bug Summary
JDK-8322589 Add Ideal transformation: (~a) & (~b) => ~(a | b)
JDK-8322077 Add Ideal transformation: (~a) | (~b) => ~(a & b)

zjx001202, Independent

Bug Summary
JDK-8321620 Optimize JImage decompressors

Zdenek Zambersky, Red Hat

Bug Summary
JDK-8325983 Build failure after JDK-8324580
JDK-8324580 SIGFPE on THP initialization on kernels < 4.10