PUSHES REPORT: 25.0.1

This report shows who pushed the backports to the given release. This usually shows who did the backporting, testing, and review work.

Report generated: Thu Aug 28 09:34:03 CEST 2025

Distribution by priority

Count Priority
1 P1
18 P2
59 P3
35 P4

Distribution by components

Count Component
113 100% Total
74 65.5% hotspot
28 24.8% hotspot/compiler
17 15.0% hotspot/jfr
13 11.5% hotspot/runtime
6 5.3% hotspot/gc
4 3.5% hotspot/test
3 2.7% hotspot/svc
2 1.8% hotspot/svc-agent
1 0.9% hotspot/jvmti
16 14.2% core-libs
5 4.4% core-libs/java.net
4 3.5% core-libs/java.nio
3 2.7% core-libs/java.lang
2 1.8% core-libs/java.io
1 0.9% core-libs/java.util:i18n
1 0.9% core-libs/java.lang.classfile
6 5.3% tools
4 3.5% tools/javac
2 1.8% tools/javadoc(tool)
5 4.4% client-libs
5 4.4% client-libs/java.awt
4 3.5% infrastructure
3 2.7% infrastructure/build
1 0.9% infrastructure
3 2.7% core-svc
2 1.8% core-svc/tools
1 0.9% core-svc/javax.management
3 2.7% security-libs
3 2.7% security-libs/java.security
1 0.9% globalization
1 0.9% globalization/translation
1 0.9% xml
1 0.9% xml/jaxp

Distribution by affiliation

This Release Pushes

Original Pushes

Count Committer
113 100% Total
69 61.1% Oracle
11 9.7% Erik Gahlin
10 8.8% Tobias Hartmann
5 4.4% David Holmes
4 3.5% Ioi Lam
3 2.7% Brian Burkhalter
3 2.7% Jaikiran Pai
2 1.8% Hannes Wallnoefer
2 1.8% Jan Lahoda
2 1.8% Chris Plummer
2 1.8% Daniel Fuchs
2 1.8% Vladimir Kozlov
2 1.8% Kevin Walls
1 0.9% Markus Grönlund
1 0.9% Stuart Marks
1 0.9% Alan Bateman
1 0.9% Calvin Cheung
1 0.9% Michael McMahon
1 0.9% Damon Fenacci
1 0.9% Fernando Guallini
1 0.9% Vicente Arturo Romero Zaldivar
1 0.9% Igor Veresov
1 0.9% Rajan Halade
1 0.9% Renjith Kannath Pariyangad
1 0.9% Coleen Phillimore
1 0.9% Roger Riggs
1 0.9% Anthony Scarpino
1 0.9% Robert Mckenna
1 0.9% Chen Liang
1 0.9% Alisen Chung
1 0.9% Jesper Wilhelmsson
1 0.9% Manukumar V S
1 0.9% Philip Race
1 0.9% Thomas Schatzl
11 9.7% SAP
4 3.5% Martin Doerr
3 2.7% Johannes Bechberger
2 1.8% Richard Reingruber
2 1.8% Matthias Baesken
9 8.0% Amazon
4 3.5% William Kemper
3 2.7% Aleksey Shipilev
1 0.9% Ian Myers
1 0.9% Roman Kennke
8 7.1% Independent
3 2.7% Fei Yang
2 1.8% Dingli Zhang
2 1.8% Matthias Bläsing
1 0.9% Archie Cobbs
6 5.3% Alibaba
6 5.3% Sendao Yan
3 2.7% Red Hat
2 1.8% Roland Westrelin
1 0.9% Ashutosh Mehra
2 1.8% BellSoft
2 1.8% Boris Ulasevich
2 1.8% Intel
2 1.8% Srinivas Parasa
2 1.8% Rivos
2 1.8% Hamlin Li
1 0.9% Unknown
1 0.9% tkurashige
Count Committer
113 100% Total
63 55.8% Oracle
11 9.7% Erik Gahlin
5 4.4% David Holmes
4 3.5% Ioi Lam
3 2.7% Brian Burkhalter
3 2.7% Jaikiran Pai
2 1.8% Hannes Wallnoefer
2 1.8% Jan Lahoda
2 1.8% Chris Plummer
2 1.8% Vladimir Kozlov
2 1.8% Kevin Walls
2 1.8% Thomas Schatzl
1 0.9% Markus Grönlund
1 0.9% Stuart Marks
1 0.9% Alan Bateman
1 0.9% Calvin Cheung
1 0.9% Michael McMahon
1 0.9% Damon Fenacci
1 0.9% Leonid Mesnik
1 0.9% Fernando Guallini
1 0.9% Vicente Arturo Romero Zaldivar
1 0.9% Igor Veresov
1 0.9% Rajan Halade
1 0.9% kieran.farrell
1 0.9% Roger Riggs
1 0.9% Anthony Scarpino
1 0.9% Daniel Fuchs
1 0.9% Naoto Sato
1 0.9% Robert Mckenna
1 0.9% Tobias Hartmann
1 0.9% Alexander Zvegintsev
1 0.9% Chen Liang
1 0.9% Alisen Chung
1 0.9% Alex Menkov
1 0.9% Jesper Wilhelmsson
1 0.9% Manukumar V S
1 0.9% Philip Race
12 10.6% SAP
4 3.5% Martin Doerr
3 2.7% Richard Reingruber
3 2.7% Johannes Bechberger
2 1.8% Matthias Baesken
9 8.0% Independent
2 1.8% Jasmine Karthikeyan
2 1.8% Dingli Zhang
2 1.8% Matthias Bläsing
1 0.9% Hannes Greule
1 0.9% Fei Yang
1 0.9% Archie Cobbs
8 7.1% Amazon
3 2.7% Aleksey Shipilev
3 2.7% William Kemper
1 0.9% Roman Kennke
1 0.9% Kelvin Nilsen
5 4.4% Intel
3 2.7% Srinivas Parasa
2 1.8% Jatin Bhateja
4 3.5% Alibaba
4 3.5% Sendao Yan
4 3.5% Unknown
2 1.8% wenanjian
1 0.9% missa
1 0.9% mhaessig
3 2.7% Red Hat
2 1.8% Roland Westrelin
1 0.9% Ashutosh Mehra
2 1.8% BellSoft
2 1.8% Boris Ulasevich
2 1.8% Rivos
2 1.8% Hamlin Li
1 0.9% Azul
1 0.9% Radim Vansa

Chronological push log:

UTC Time Priority Component Bug Summary This Release Push By Original Push By
Name Affiliation Name Affiliation
2025/08/05 23:17 P1 infrastructure JDK-8364944 Remove EA from the JDK 25 version string with first RC promotion Jesper Wilhelmsson Oracle (same) (same)
2025/07/18 11:36 P4 hotspot/gc JDK-8362942 Update java man page documentation to reflect current state of the UseNUMA flag Thomas Schatzl Oracle (same) (same)
2025/07/18 06:08 P4 hotspot/svc JDK-8362941 [TESTBUG] serviceability/HeapDump/UnmountedVThreadNativeMethodAtTop.java throws OutOfMemoryError Sendao Yan Alibaba Richard Reingruber SAP
2025/07/18 02:39 P4 hotspot/jfr JDK-8362940 ProblemList jdk/jfr/event/io/TestIOTopFrame.java David Holmes Oracle (same) (same)
2025/07/17 16:50 P3 hotspot/gc JDK-8362939 Shenandoah crash at size_given_klass in op_degenerated William Kemper Amazon (same) (same)
2025/07/17 12:50 P4 core-svc/tools JDK-8362938 Tests which call ThreadController should mark as /native Sendao Yan Alibaba (same) (same)
2025/07/17 12:41 P4 hotspot/test JDK-8362937 Delete applications/scimark/Scimark.java test Sendao Yan Alibaba Leonid Mesnik Oracle
2025/07/17 12:20 P3 hotspot/jfr JDK-8362936 JFR: Incorrect top frame for I/O events Erik Gahlin Oracle (same) (same)
2025/07/17 06:57 P2 core-libs/java.io JDK-8362935 AssertionError in File.listFiles(FileFilter | FilenameFilter) Brian Burkhalter Oracle (same) (same)
2025/07/17 01:29 P3 hotspot/compiler JDK-8362934 ARM32: forward_exception_entry missing return address Boris Ulasevich BellSoft (same) (same)
2025/07/16 15:35 P2 core-libs/java.io JDK-8362933 AssertionError in File.listFiles() when path is empty and -esa is enabled Brian Burkhalter Oracle (same) (same)
2025/07/16 15:35 P3 hotspot/jfr JDK-8362932 JFR: RandomAccessFile::readLine emits events for each character Erik Gahlin Oracle (same) (same)
2025/07/16 14:51 P2 hotspot/compiler JDK-8362931 C2 fails with unexpected node in SuperWord truncation: ModI Tobias Hartmann Oracle Jasmine Karthikeyan Independent
2025/07/16 10:13 P3 hotspot/jfr JDK-8362930 Fix interval recomputation in CPU Time Profiler Johannes Bechberger SAP (same) (same)
2025/07/16 07:31 P3 hotspot/jfr JDK-8362929 Reduce busy waiting in worse case at the synchronization point returning from native in CPU Time Profiler Johannes Bechberger SAP (same) (same)
2025/07/16 06:56 P2 hotspot/jfr JDK-8362928 JFR: Active Settings view broken Erik Gahlin Oracle (same) (same)
2025/07/16 06:33 P2 hotspot/compiler JDK-8362927 Installation of MethodData::extra_data_lock() misses synchronization on reader side Tobias Hartmann Oracle Thomas Schatzl Oracle
2025/07/15 21:46 P4 hotspot/runtime JDK-8362916 cds/appcds/dynamicArchive/TestAutoCreateSharedArchive.java archive timestamps comparison failed Calvin Cheung Oracle (same) (same)
2025/07/15 20:56 P3 hotspot/runtime JDK-8362913 invokeinterface Throws AbstractMethodError Instead of IncompatibleClassChangeError David Holmes Oracle (same) (same)
2025/07/15 18:29 P4 hotspot/svc-agent JDK-8362911 Problem list serviceability/sa/ClhsdbThreadContext.java on Windows due to JDK-8356704 Chris Plummer Oracle (same) (same)
2025/07/15 11:35 P3 hotspot/compiler JDK-8362910 C2: assert(static_cast(result) == thing) caused by ReverseBytesNode::Value() Tobias Hartmann Oracle Hannes Greule Independent
2025/07/15 08:02 P4 hotspot/svc JDK-8362909 [TESTBUG] serviceability/HeapDump/UnmountedVThreadNativeMethodAtTop.java deadlocks on exception Richard Reingruber SAP (same) (same)
2025/07/14 16:50 P3 hotspot/gc JDK-8362908 GenShen: Fix bad assert in swap card tables William Kemper Amazon Kelvin Nilsen Amazon
2025/07/14 15:26 P4 core-libs/java.util:i18n JDK-8362183 The first year is not displayed correctly in Japanese Calendar tkurashige Unknown Naoto Sato Oracle
2025/07/14 07:31 P3 hotspot/compiler JDK-8362907 C2 SuperWord: Integer.numberOfLeadingZeros, numberOfTrailingZeros, reverse and bitCount have input types wrongly truncated for byte and short Tobias Hartmann Oracle Jasmine Karthikeyan Independent
2025/07/14 02:55 P3 hotspot/gc JDK-8362906 Fix Shenandoah GC test failures when APX is enabled Srinivas Parasa Intel (same) (same)
2025/07/12 21:34 P3 hotspot/compiler JDK-8362905 Disable Intel APX by default and enable it with -XX:+UnlockExperimentalVMOptions -XX:+UseAPX in all builds Srinivas Parasa Intel (same) (same)
2025/07/11 22:52 P4 core-libs/java.lang.classfile JDK-8362904 CodeBuilder::parameterSlot throws undocumented IOOBE Chen Liang Oracle (same) (same)
2025/07/11 20:59 P4 hotspot/test JDK-8362070 [TESTBUG] RISC-V: compiler/vectorization/runner/BasicIntOpTest.java fails with RVV but not Zvbb Dingli Zhang Independent (same) (same)
2025/07/11 20:59 P3 hotspot/compiler JDK-8362069 RISC-V: Several vector tests fail after JDK-8354383 Dingli Zhang Independent (same) (same)
2025/07/11 11:59 P3 hotspot/compiler JDK-8362066 [JVMCI] crash accessing nmethod::jvmci_name in CodeCache::aggregate Boris Ulasevich BellSoft (same) (same)
2025/07/11 00:21 P2 hotspot/runtime JDK-8362065 New test runtime/jni/checked/TestCharArrayReleasing.java can cause disk full errors David Holmes Oracle (same) (same)
2025/07/11 00:21 P3 hotspot/runtime JDK-8362064 [REDO] Checked version of JNI ReleaseArrayElements needs to filter out known wrapped arrays David Holmes Oracle (same) (same)
2025/07/10 22:26 P3 hotspot/gc JDK-8362063 GenShen crash in swap_card_tables: Should be clean William Kemper Amazon (same) (same)
2025/07/10 17:04 P3 hotspot/compiler JDK-8362062 [ubsan] aotCache tests trigger runtime error: applying non-zero offset 16 to null pointer in CodeBlob::relocation_end() Vladimir Kozlov Oracle (same) (same)
2025/07/10 15:43 P3 hotspot/svc-agent JDK-8362061 Serviceability Agent tests fail with JFR enabled due to unknown thread type JfrRecorderThread Chris Plummer Oracle (same) (same)
2025/07/10 15:14 P2 core-libs/java.nio JDK-8362060 (bf) CharBuffer.getChars(int,int,char[],int) violates pre-existing specification Brian Burkhalter Oracle (same) (same)
2025/07/10 07:34 P4 core-svc/tools JDK-8362059 [TESTBUG] DumpThreadsWithEliminatedLock.java fails because of unstable inlining Richard Reingruber SAP (same) (same)
2025/07/09 15:32 P3 hotspot/jfr JDK-8362058 JFR: Document differences between method sample events Erik Gahlin Oracle (same) (same)
2025/07/09 13:41 P2 tools/javac JDK-8362057 Incorrect 'sealed is not allowed here' compile-time error Jan Lahoda Oracle (same) (same)
2025/07/09 05:07 P3 tools/javac JDK-8362056 javac crashes on unresolvable constant in @SuppressWarnings Jan Lahoda Oracle (same) (same)
2025/07/08 21:13 P3 tools/javac JDK-8362055 An anonymous class is erroneously being classify as an abstract class Vicente Arturo Romero Zaldivar Oracle (same) (same)
2025/07/08 19:02 P4 hotspot/runtime JDK-8362054 AOT cache creation fails: no strings should have been added Ioi Lam Oracle (same) (same)
2025/07/08 17:36 P3 hotspot/runtime JDK-8362053 AOT cache creation crashes in ~ThreadTotalCPUTimeClosure() Ioi Lam Oracle (same) (same)
2025/07/08 17:34 P4 hotspot/runtime JDK-8362052 Clarify CDS documentation about static vs dynamic archive Ioi Lam Oracle (same) (same)
2025/07/08 15:12 P4 hotspot/test JDK-8361603 Avoid running some jtreg tests when asan is configured Matthias Baesken SAP (same) (same)
2025/07/08 14:03 P3 hotspot/jfr JDK-8362051 JFR: Min and max time in MethodTime event is confusing Erik Gahlin Oracle (same) (same)
2025/07/07 22:18 P4 core-libs/java.lang JDK-8362050 Clarify java.lang.Process resource cleanup Roger Riggs Oracle (same) (same)
2025/07/07 16:24 P4 hotspot/jvmti JDK-8361514 Test serviceability/jvmti/thread/GetCurrentContendedMonitor/contmon01/contmon01.java failed: unexpexcted monitor object Ian Myers Amazon Alex Menkov Oracle
2025/07/07 13:14 P4 client-libs/java.awt JDK-8362049 java/awt/MenuItem/SetLabelTest.java inadvertently triggers clicks on items pinned to the taskbar Manukumar V S Oracle (same) (same)
2025/07/07 07:16 P4 hotspot/runtime JDK-8361469 ContainerRuntimeVersionTestUtils fromVersionString fails with some docker versions Matthias Baesken SAP (same) (same)
2025/07/04 15:07 P3 hotspot/jfr JDK-8362048 JFR: EventInstrumentation MASK_THROTTLE* constants should be computed in longs Erik Gahlin Oracle (same) (same)
2025/07/03 18:34 P3 hotspot/jfr JDK-8362047 JFR: PlatformTracer class should be loaded lazily Erik Gahlin Oracle (same) (same)
2025/07/03 08:52 P3 hotspot/compiler JDK-8362045 JDK25: Backout JDK-8258229 Martin Doerr SAP (same) (same)
2025/07/03 08:46 P3 core-libs/java.nio JDK-8362044 JDK-8360887 needs fixes to avoid cycles and better tests (aix) Martin Doerr SAP (same) (same)
2025/07/02 17:49 P3 hotspot/compiler JDK-8362043 AOTCodeAddressTable::_stubs_addr not initialized/freed properly Ashutosh Mehra Red Hat (same) (same)
2025/07/02 16:59 P2 hotspot/svc JDK-8362042 JVM crashes in AccessInternal::PostRuntimeDispatch Kevin Walls Oracle (same) (same)
2025/07/02 16:44 P3 client-libs/java.awt JDK-8361289 JNI exception pending in Java_sun_awt_screencast_ScreencastHelper_remoteDesktopKeyImpl of screencast_pipewire.c:1214 (ID: 51119) Renjith Kannath Pariyangad Oracle Alexander Zvegintsev Oracle
2025/07/02 15:34 P3 core-libs/java.nio JDK-8362041 (fs) Files.getFileAttributeView returns unusable FileAttributeView if UserDefinedFileAttributeView unavailable (aix) Martin Doerr SAP (same) (same)
2025/07/02 11:52 P3 hotspot/compiler JDK-8362040 AOTCompileEagerly should not be diagnostic Aleksey Shipilev Amazon (same) (same)
2025/07/02 08:23 P3 hotspot/compiler JDK-8362039 Performance regression in Math.cbrt Tobias Hartmann Oracle missa Unknown
2025/07/02 01:36 P4 xml/jaxp JDK-8362038 XML/JAXP tests that make network connections should ensure that no proxy is selected Jaikiran Pai Oracle (same) (same)
2025/07/01 00:49 P4 hotspot/compiler JDK-8361111 C2: alignment check should consider base offset when emitting arraycopy runtime call Fei Yang Independent (same) (same)
2025/06/30 16:54 P2 tools/javac JDK-8361094 Behavior change when both -Xlint:options and -Xlint:-options flags are given Archie Cobbs Independent (same) (same)
2025/06/30 13:28 P3 hotspot/jfr JDK-8362037 JFR: Initialize JfrThreadLocal::_sampling_critical_section Aleksey Shipilev Amazon (same) (same)
2025/06/30 01:06 P3 hotspot/runtime JDK-8362036 Access violation in ThreadsSMRSupport::print_info_on during thread dump David Holmes Oracle (same) (same)
2025/06/27 19:28 P3 globalization/translation JDK-8362035 JDK 25 RDP1 L10n resource files update Alisen Chung Oracle (same) (same)
2025/06/27 16:27 P2 hotspot/compiler JDK-8362034 C2: loop strip mining expansion doesn't take sunk stores into account Roland Westrelin Red Hat (same) (same)
2025/06/27 02:18 P3 core-libs/java.lang JDK-8362033 Incorrect os.version reported on macOS Tahoe 26 (Beta) Jaikiran Pai Oracle (same) (same)
2025/06/26 12:32 P4 hotspot/runtime JDK-8362032 Update Manpage for Compact Object Headers (Production) Roman Kennke Amazon (same) (same)
2025/06/26 09:14 P3 hotspot/runtime JDK-8362031 [PPC64] some environments don't support mfdscr instruction Martin Doerr SAP (same) (same)
2025/06/25 16:17 P3 core-libs/java.net JDK-8362030 3 JNI exception pending defect groups in 2 files Michael McMahon Oracle (same) (same)
2025/06/25 16:12 P3 hotspot/compiler JDK-8362029 Internal Error: assert(get_instanceKlass()->is_loaded()) failed: must be at least loaded Igor Veresov Oracle (same) (same)
2025/06/25 11:16 P4 hotspot/compiler JDK-8360516 RISC-V: Only enable BigInteger intrinsics when AvoidUnalignedAccess == false Fei Yang Independent wenanjian Unknown
2025/06/25 05:40 P4 tools/javadoc(tool) JDK-8362028 Inaccuracy in the documentation of the -group option Hannes Wallnoefer Oracle (same) (same)
2025/06/25 05:36 P3 tools/javadoc(tool) JDK-8362027 Accessibility bugs in API documentation Hannes Wallnoefer Oracle (same) (same)
2025/06/24 19:32 P3 security-libs/java.security JDK-8362026 PEM spec updates Anthony Scarpino Oracle (same) (same)
2025/06/24 17:10 P3 hotspot/runtime JDK-8362025 Perf regression accessing fields Coleen Phillimore Oracle Radim Vansa Azul
2025/06/24 16:49 P3 hotspot/jfr JDK-8362024 Disable constant pool ID assert during troubleshooting Markus Grönlund Oracle (same) (same)
2025/06/24 05:48 P3 infrastructure/build JDK-8362023 GHA: Bump MSVC to 14.44 Aleksey Shipilev Amazon (same) (same)
2025/06/23 21:03 P3 hotspot/gc JDK-8362022 GenShen crashes during freeze: assert(!chunk->requires_barriers()) failed William Kemper Amazon (same) (same)
2025/06/23 17:05 P2 client-libs/java.awt JDK-8362021 Clarify behavior of java.awt.HeadlessException constructed with no-args Philip Race Oracle (same) (same)
2025/06/23 13:09 P2 hotspot/jfr JDK-8362020 JFR: method-timing view doesn't work Erik Gahlin Oracle (same) (same)
2025/06/23 12:22 P3 hotspot/jfr JDK-8362019 JFR: Missing help text for method trace and timing Erik Gahlin Oracle (same) (same)
2025/06/20 21:49 P3 client-libs/java.awt JDK-8362018 Reading data from the clipboard from multiple threads crashes the JVM Matthias Bläsing Independent (same) (same)
2025/06/20 21:49 P4 client-libs/java.awt JDK-8362017 Clipboard interaction on Windows is unstable Matthias Bläsing Independent (same) (same)
2025/06/20 09:47 P2 core-libs/java.net JDK-8362016 java.net.HttpURLConnection sends unexpected "Host" request header in some cases after JDK-8344190 Jaikiran Pai Oracle (same) (same)
2025/06/20 08:29 P3 hotspot/compiler JDK-8362015 Fix incorrect value for max_size of C2CodeStub when APX is used Tobias Hartmann Oracle Srinivas Parasa Intel
2025/06/20 06:26 P4 core-libs/java.net JDK-8362014 Test CloseDescriptors.java should throw SkippedException when there is no lsof/sctp Sendao Yan Alibaba (same) (same)
2025/06/19 14:19 P2 hotspot/jfr JDK-8362013 JFR: Instrumentation of java.lang.String corrupts recording Erik Gahlin Oracle (same) (same)
2025/06/19 13:41 P3 hotspot/compiler JDK-8362012 C1 crash in AOTCodeAddressTable::add_C_string Vladimir Kozlov Oracle (same) (same)
2025/06/19 12:56 P3 hotspot/jfr JDK-8362011 JFR: Help text for-XX:StartFlightRecording:report-on-exit should explain option can be repeated Erik Gahlin Oracle (same) (same)
2025/06/18 11:50 P4 hotspot/compiler JDK-8359918 RISC-V: Only enable CRC32 intrinsic when AvoidUnalignedAccess == false Fei Yang Independent wenanjian Unknown
2025/06/17 20:45 P4 core-libs/java.lang JDK-8362010 (str) Add notes to String.trim and String.isEmpty pointing to newer APIs Stuart Marks Oracle (same) (same)
2025/06/17 13:10 P4 hotspot/compiler JDK-8362009 compiler/startup/StartupOutput.java runs into out of memory on Windows after JDK-8347406 Damon Fenacci Oracle (same) (same)
2025/06/17 08:06 P2 hotspot/compiler JDK-8362008 C2/Shenandoah: incorrect execution with Unsafe Roland Westrelin Red Hat (same) (same)
2025/06/17 06:10 P2 security-libs/java.security JDK-8362007 Add 2 TLS and 2 CS Sectigo roots Rajan Halade Oracle (same) (same)
2025/06/17 04:36 P3 hotspot/runtime JDK-8362006 JVM crash because archived method handle intrinsics are not restored Ioi Lam Oracle (same) (same)
2025/06/17 00:43 P4 hotspot/test JDK-8362005 Several vmTestbase/compact tests timed out on large memory machine Sendao Yan Alibaba (same) (same)
2025/06/16 16:20 P3 hotspot/jfr JDK-8362004 New test TestCPUTimeSampleThrottling fails intermittently Johannes Bechberger SAP (same) (same)
2025/06/16 11:18 P4 hotspot/compiler JDK-8362003 RISC-V: construct test to verify invocation of C2_MacroAssembler::enc_cmove_cmp_fp => BoolTest::ge/gt Hamlin Li Rivos (same) (same)
2025/06/16 11:18 P3 hotspot/compiler JDK-8362002 RISC-V: jvm crash when running dacapo sunflow after JDK-8352504 Hamlin Li Rivos (same) (same)
2025/06/16 09:54 P3 security-libs/java.security JDK-8361984 Additional code coverage for PEM API Fernando Guallini Oracle (same) (same)
2025/06/16 09:19 P3 core-libs/java.nio JDK-8362001 (sc) SocketChannel.close when thread blocked in read causes connection to be reset (win) Alan Bateman Oracle (same) (same)
2025/06/16 08:48 P3 hotspot/compiler JDK-8361999 Incorrect AVX3Threshold results into code buffer overflows on APX targets Tobias Hartmann Oracle Jatin Bhateja Intel
2025/06/15 12:25 P4 infrastructure/build JDK-8361998 Error messages generated by configure --help after 8301197 Sendao Yan Alibaba (same) (same)
2025/06/15 09:05 P3 hotspot/compiler JDK-8361997 JVM JIT Causes Static Initialization Order Issue Tobias Hartmann Oracle mhaessig Unknown
2025/06/15 09:04 P2 hotspot/compiler JDK-8361996 Memory corruption in MStack::push Tobias Hartmann Oracle (same) (same)
2025/06/13 16:54 P4 core-libs/java.net JDK-8361995 java/net/URL/EarlyOrDelayedParsing test fails intermittently Daniel Fuchs Oracle (same) (same)
2025/06/13 14:28 P3 core-svc/javax.management JDK-8361994 Remove misleading javax.management.remote API doc wording about JMX spec, and historic link to JMXMP Kevin Walls Oracle (same) (same)
2025/06/12 11:11 P3 hotspot/compiler JDK-8361993 Fix several failing BMI tests with -XX:+UseAPX Tobias Hartmann Oracle Jatin Bhateja Intel
2025/06/11 16:22 P4 core-libs/java.net JDK-8361992 java/net/HttpURLConnection/HttpURLConnectionExpectContinueTest.java fails with 403 due to system proxies Daniel Fuchs Oracle kieran.farrell Oracle
2025/06/09 23:01 P4 infrastructure/build JDK-8359059 Bump version numbers for 25.0.1 Robert Mckenna Oracle (same) (same)

No changesets log

P1 client-libs/javax.swing JDK-8365778 RadioButton is not shown if JRadioButtonMenuItem is rendered with ImageIcon in WindowsLookAndFeel
P3 client-libs/java.awt JDK-8365366 [XWayland] [OL10] NumPad keys are not triggered
P4 core-libs/java.rmi JDK-8364947 Java RMI specification still mentions applets
P2 hotspot/jfr JDK-8364943 ThreadGroup constant pool serialization is not normalized
P2 hotspot/compiler JDK-8364942 [BACKOUT] Consolidate Identity of self-inverse operations
P4 core-libs/java.text JDK-8364941 java.text.DecimalFormat specification indentation correction
P4 security-libs/java.security JDK-8364940 Incorrect l10n test case in sun/security/tools/keytool/i18n.java
P2 hotspot/compiler JDK-8364939 hotspot/jtreg/compiler/c2/TestLWLockingCodeGen.java fails on static JDK on x86_64 with AVX instruction extensions
P2 globalization JDK-8364938 JDK 25 RDP2 L10n resource files update
P3 security-libs/java.security JDK-8364811 Remove AffirmTrust root CAs
P2 hotspot/jfr JDK-8364422 Missing object ID X in pool jdk.types.Method
P2 hotspot/gc JDK-8364420 Shenandoah: AOT saved adapter calls into broken GC barrier stub
P3 core-libs/java.util.concurrent JDK-8364419 Update SubmissionPublisher() specification to reflect use of ForkJoinPool.asyncCommonPool()
P4 core-libs/java.lang.invoke JDK-8364417 Clarify VarHandle set/get access on 32-bit platforms
P2 core-libs/java.rmi JDK-8361987 Multiplex protocol not removed from RMI specification Index
P4 core-libs/java.rmi JDK-8361986 Remove the multiplex protocol from the RMI specification

Committer push log

Alisen Chung, Oracle

Bug Summary
JDK-8362035 JDK 25 RDP1 L10n resource files update

Archie Cobbs, Independent

Bug Summary
JDK-8361094 Behavior change when both -Xlint:options and -Xlint:-options flags are given

Alan Bateman, Oracle

Bug Summary
JDK-8362001 (sc) SocketChannel.close when thread blocked in read causes connection to be reset (win)

Anthony Scarpino, Oracle

Bug Summary
JDK-8362026 PEM spec updates

Ashutosh Mehra, Red Hat

Bug Summary
JDK-8362043 AOTCodeAddressTable::_stubs_addr not initialized/freed properly

Brian Burkhalter, Oracle

Bug Summary
JDK-8362060 (bf) CharBuffer.getChars(int,int,char[],int) violates pre-existing specification
JDK-8362933 AssertionError in File.listFiles() when path is empty and -esa is enabled
JDK-8362935 AssertionError in File.listFiles(FileFilter | FilenameFilter)

Boris Ulasevich, BellSoft

Bug Summary
JDK-8362066 [JVMCI] crash accessing nmethod::jvmci_name in CodeCache::aggregate
JDK-8362934 ARM32: forward_exception_entry missing return address

Calvin Cheung, Oracle

Bug Summary
JDK-8362916 cds/appcds/dynamicArchive/TestAutoCreateSharedArchive.java archive timestamps comparison failed

Chris Plummer, Oracle

Bug Summary
JDK-8362911 Problem list serviceability/sa/ClhsdbThreadContext.java on Windows due to JDK-8356704
JDK-8362061 Serviceability Agent tests fail with JFR enabled due to unknown thread type JfrRecorderThread

Coleen Phillimore, Oracle

Bug Summary
JDK-8362025 Perf regression accessing fields

Damon Fenacci, Oracle

Bug Summary
JDK-8362009 compiler/startup/StartupOutput.java runs into out of memory on Windows after JDK-8347406

Daniel Fuchs, Oracle

Bug Summary
JDK-8361992 java/net/HttpURLConnection/HttpURLConnectionExpectContinueTest.java fails with 403 due to system proxies
JDK-8361995 java/net/URL/EarlyOrDelayedParsing test fails intermittently

David Holmes, Oracle

Bug Summary
JDK-8362064 [REDO] Checked version of JNI ReleaseArrayElements needs to filter out known wrapped arrays
JDK-8362036 Access violation in ThreadsSMRSupport::print_info_on during thread dump
JDK-8362913 invokeinterface Throws AbstractMethodError Instead of IncompatibleClassChangeError
JDK-8362065 New test runtime/jni/checked/TestCharArrayReleasing.java can cause disk full errors
JDK-8362940 ProblemList jdk/jfr/event/io/TestIOTopFrame.java

Dingli Zhang, Independent

Bug Summary
JDK-8362070 [TESTBUG] RISC-V: compiler/vectorization/runner/BasicIntOpTest.java fails with RVV but not Zvbb
JDK-8362069 RISC-V: Several vector tests fail after JDK-8354383

Erik Gahlin, Oracle

Bug Summary
JDK-8362928 JFR: Active Settings view broken
JDK-8362058 JFR: Document differences between method sample events
JDK-8362048 JFR: EventInstrumentation MASK_THROTTLE* constants should be computed in longs
JDK-8362011 JFR: Help text for-XX:StartFlightRecording:report-on-exit should explain option can be repeated
JDK-8362936 JFR: Incorrect top frame for I/O events
JDK-8362013 JFR: Instrumentation of java.lang.String corrupts recording
JDK-8362020 JFR: method-timing view doesn't work
JDK-8362051 JFR: Min and max time in MethodTime event is confusing
JDK-8362019 JFR: Missing help text for method trace and timing
JDK-8362047 JFR: PlatformTracer class should be loaded lazily
JDK-8362932 JFR: RandomAccessFile::readLine emits events for each character

Fernando Guallini, Oracle

Bug Summary
JDK-8361984 Additional code coverage for PEM API

Fei Yang, Independent

Bug Summary
JDK-8361111 C2: alignment check should consider base offset when emitting arraycopy runtime call
JDK-8360516 RISC-V: Only enable BigInteger intrinsics when AvoidUnalignedAccess == false
JDK-8359918 RISC-V: Only enable CRC32 intrinsic when AvoidUnalignedAccess == false

Hannes Wallnoefer, Oracle

Bug Summary
JDK-8362027 Accessibility bugs in API documentation
JDK-8362028 Inaccuracy in the documentation of the -group option

Ioi Lam, Oracle

Bug Summary
JDK-8362053 AOT cache creation crashes in ~ThreadTotalCPUTimeClosure()
JDK-8362054 AOT cache creation fails: no strings should have been added
JDK-8362052 Clarify CDS documentation about static vs dynamic archive
JDK-8362006 JVM crash because archived method handle intrinsics are not restored

Ian Myers, Amazon

Bug Summary
JDK-8361514 Test serviceability/jvmti/thread/GetCurrentContendedMonitor/contmon01/contmon01.java failed: unexpexcted monitor object

Igor Veresov, Oracle

Bug Summary
JDK-8362029 Internal Error: assert(get_instanceKlass()->is_loaded()) failed: must be at least loaded

Johannes Bechberger, SAP

Bug Summary
JDK-8362930 Fix interval recomputation in CPU Time Profiler
JDK-8362004 New test TestCPUTimeSampleThrottling fails intermittently
JDK-8362929 Reduce busy waiting in worse case at the synchronization point returning from native in CPU Time Profiler

Jan Lahoda, Oracle

Bug Summary
JDK-8362057 Incorrect 'sealed is not allowed here' compile-time error
JDK-8362056 javac crashes on unresolvable constant in @SuppressWarnings

Jaikiran Pai, Oracle

Bug Summary
JDK-8362033 Incorrect os.version reported on macOS Tahoe 26 (Beta)
JDK-8362016 java.net.HttpURLConnection sends unexpected "Host" request header in some cases after JDK-8344190
JDK-8362038 XML/JAXP tests that make network connections should ensure that no proxy is selected

Jesper Wilhelmsson, Oracle

Bug Summary
JDK-8364944 Remove EA from the JDK 25 version string with first RC promotion

Kevin Walls, Oracle

Bug Summary
JDK-8362042 JVM crashes in AccessInternal::PostRuntimeDispatch
JDK-8361994 Remove misleading javax.management.remote API doc wording about JMX spec, and historic link to JMXMP

Vladimir Kozlov, Oracle

Bug Summary
JDK-8362062 [ubsan] aotCache tests trigger runtime error: applying non-zero offset 16 to null pointer in CodeBlob::relocation_end()
JDK-8362012 C1 crash in AOTCodeAddressTable::add_C_string

Chen Liang, Oracle

Bug Summary
JDK-8362904 CodeBuilder::parameterSlot throws undocumented IOOBE

Matthias Baesken, SAP

Bug Summary
JDK-8361603 Avoid running some jtreg tests when asan is configured
JDK-8361469 ContainerRuntimeVersionTestUtils fromVersionString fails with some docker versions

Matthias Bläsing, Independent

Bug Summary
JDK-8362017 Clipboard interaction on Windows is unstable
JDK-8362018 Reading data from the clipboard from multiple threads crashes the JVM

Martin Doerr, SAP

Bug Summary
JDK-8362041 (fs) Files.getFileAttributeView returns unusable FileAttributeView if UserDefinedFileAttributeView unavailable (aix)
JDK-8362031 [PPC64] some environments don't support mfdscr instruction
JDK-8362044 JDK-8360887 needs fixes to avoid cycles and better tests (aix)
JDK-8362045 JDK25: Backout JDK-8258229

Markus Grönlund, Oracle

Bug Summary
JDK-8362024 Disable constant pool ID assert during troubleshooting

Michael McMahon, Oracle

Bug Summary
JDK-8362030 3 JNI exception pending defect groups in 2 files

Hamlin Li, Rivos

Bug Summary
JDK-8362003 RISC-V: construct test to verify invocation of C2_MacroAssembler::enc_cmove_cmp_fp => BoolTest::ge/gt
JDK-8362002 RISC-V: jvm crash when running dacapo sunflow after JDK-8352504

Manukumar V S, Oracle

Bug Summary
JDK-8362049 java/awt/MenuItem/SetLabelTest.java inadvertently triggers clicks on items pinned to the taskbar

Philip Race, Oracle

Bug Summary
JDK-8362021 Clarify behavior of java.awt.HeadlessException constructed with no-args

Rajan Halade, Oracle

Bug Summary
JDK-8362007 Add 2 TLS and 2 CS Sectigo roots

Renjith Kannath Pariyangad, Oracle

Bug Summary
JDK-8361289 JNI exception pending in Java_sun_awt_screencast_ScreencastHelper_remoteDesktopKeyImpl of screencast_pipewire.c:1214 (ID: 51119)

Roman Kennke, Amazon

Bug Summary
JDK-8362032 Update Manpage for Compact Object Headers (Production)

Robert Mckenna, Oracle

Bug Summary
JDK-8359059 Bump version numbers for 25.0.1

Roland Westrelin, Red Hat

Bug Summary
JDK-8362008 C2/Shenandoah: incorrect execution with Unsafe
JDK-8362034 C2: loop strip mining expansion doesn't take sunk stores into account

Richard Reingruber, SAP

Bug Summary
JDK-8362059 [TESTBUG] DumpThreadsWithEliminatedLock.java fails because of unstable inlining
JDK-8362909 [TESTBUG] serviceability/HeapDump/UnmountedVThreadNativeMethodAtTop.java deadlocks on exception

Roger Riggs, Oracle

Bug Summary
JDK-8362050 Clarify java.lang.Process resource cleanup

Aleksey Shipilev, Amazon

Bug Summary
JDK-8362040 AOTCompileEagerly should not be diagnostic
JDK-8362023 GHA: Bump MSVC to 14.44
JDK-8362037 JFR: Initialize JfrThreadLocal::_sampling_critical_section

Stuart Marks, Oracle

Bug Summary
JDK-8362010 (str) Add notes to String.trim and String.isEmpty pointing to newer APIs

Srinivas Parasa, Intel

Bug Summary
JDK-8362905 Disable Intel APX by default and enable it with -XX:+UnlockExperimentalVMOptions -XX:+UseAPX in all builds
JDK-8362906 Fix Shenandoah GC test failures when APX is enabled

Sendao Yan, Alibaba

Bug Summary
JDK-8362941 [TESTBUG] serviceability/HeapDump/UnmountedVThreadNativeMethodAtTop.java throws OutOfMemoryError
JDK-8362937 Delete applications/scimark/Scimark.java test
JDK-8361998 Error messages generated by configure --help after 8301197
JDK-8362005 Several vmTestbase/compact tests timed out on large memory machine
JDK-8362014 Test CloseDescriptors.java should throw SkippedException when there is no lsof/sctp
JDK-8362938 Tests which call ThreadController should mark as /native

Tobias Hartmann, Oracle

Bug Summary
JDK-8362931 C2 fails with unexpected node in SuperWord truncation: ModI
JDK-8362907 C2 SuperWord: Integer.numberOfLeadingZeros, numberOfTrailingZeros, reverse and bitCount have input types wrongly truncated for byte and short
JDK-8362910 C2: assert(static_cast(result) == thing) caused by ReverseBytesNode::Value()
JDK-8362015 Fix incorrect value for max_size of C2CodeStub when APX is used
JDK-8361993 Fix several failing BMI tests with -XX:+UseAPX
JDK-8361999 Incorrect AVX3Threshold results into code buffer overflows on APX targets
JDK-8362927 Installation of MethodData::extra_data_lock() misses synchronization on reader side
JDK-8361997 JVM JIT Causes Static Initialization Order Issue
JDK-8361996 Memory corruption in MStack::push
JDK-8362039 Performance regression in Math.cbrt

tkurashige, Unknown

Bug Summary
JDK-8362183 The first year is not displayed correctly in Japanese Calendar

Thomas Schatzl, Oracle

Bug Summary
JDK-8362942 Update java man page documentation to reflect current state of the UseNUMA flag

Vicente Arturo Romero Zaldivar, Oracle

Bug Summary
JDK-8362055 An anonymous class is erroneously being classify as an abstract class

William Kemper, Amazon

Bug Summary
JDK-8362063 GenShen crash in swap_card_tables: Should be clean
JDK-8362022 GenShen crashes during freeze: assert(!chunk->requires_barriers()) failed
JDK-8362908 GenShen: Fix bad assert in swap card tables
JDK-8362939 Shenandoah crash at size_given_klass in op_degenerated