| UTC Time |
Priority |
Component |
Bug |
Summary |
This Release Push By |
Original Push By |
|
|
|
|
|
Name |
Affiliation |
Name |
Affiliation |
| 2026/09/20 01:43 |
P4 |
core-libs/java.net |
JDK-8392732 |
test/jdk/java/net/Socket/SetSoLinger.java fails on macos 27 - java.net.SocketException: Numerical argument out of domain |
Jaikiran Pai |
Oracle |
(same) |
(same) |
| 2026/09/19 15:34 |
P4 |
core-libs/java.nio |
JDK-8392711 |
(fs) UnixSecureDirectoryStream.newDirectoryStream error handling |
ljiwon |
Unknown |
(same) |
(same) |
| 2026/09/19 07:55 |
P4 |
core-libs/java.nio |
JDK-8392708 |
(fs) BsdNativeDispatcher.getmntonname0 should return when statfs fails |
ljiwon |
Unknown |
(same) |
(same) |
| 2026/09/19 04:01 |
P3 |
hotspot/runtime |
JDK-8391692 |
AOT cache asserts with HeapShared::is_archivable_hidden_klass(ik) with LambdaForm$LFI |
Ioi Lam |
Oracle |
(same) |
(same) |
| 2026/09/18 21:16 |
P4 |
core-libs/java.lang |
JDK-8380567 |
DynamicCallSiteDesc.bootstrapMethod should return DirectMethodHandleDesc |
Chen Liang |
Oracle |
(same) |
(same) |
| 2026/09/18 20:20 |
P4 |
hotspot/compiler |
JDK-8392715 |
ProblemList three mlvm/indy/func/jvmti tests on all configs |
Daniel Daugherty |
Oracle |
(same) |
(same) |
| 2026/09/18 18:26 |
P4 |
core-libs |
JDK-8392004 |
[VectorAPI] Required ByteVector/IntVector reinterpret operations cause heap allocation |
Chen Liang |
Oracle |
(same) |
(same) |
| 2026/09/18 17:55 |
P4 |
hotspot/gc |
JDK-8392703 |
ProblemList gc/metaspace/TestMetaspaceFirstGC.java |
Markus Grönlund |
Oracle |
(same) |
(same) |
| 2026/09/18 17:23 |
P4 |
client-libs/java.awt |
JDK-8390526 |
Remove pre-Windows 7 Windows versions from sun/awt/OSInfo.java |
Matthias Baesken |
SAP |
(same) |
(same) |
| 2026/09/18 15:18 |
P4 |
core-libs/java.lang |
JDK-8385944 |
Test java/lang/ProcessBuilder/Basic.java#id0 failed - Incorrect handling of envstrings containing NULs |
Daniel Jelinski |
Oracle |
(same) |
(same) |
| 2026/09/18 13:08 |
P4 |
hotspot/compiler |
JDK-8385093 |
C2: Missed Ideal optimization opportunity in PhaseIterGVN for RShiftI |
Marc Chevalier |
Oracle |
(same) |
(same) |
| 2026/09/18 12:26 |
P3 |
hotspot/compiler |
JDK-8392320 |
SIGSEGV when handling SOE during c2 extended frame construction |
Patricio Chilano Mateo |
Oracle |
(same) |
(same) |
| 2026/09/18 10:28 |
P3 |
tools/javadoc(tool) |
JDK-8376208 |
Provide browser setting for underlined links |
Hannes Wallnoefer |
Oracle |
(same) |
(same) |
| 2026/09/18 09:52 |
P3 |
hotspot/jfr |
JDK-8392551 |
JFR: Cloned recordings are incorrectly scheduled and stopped |
Erik Gahlin |
Oracle |
(same) |
(same) |
| 2026/09/18 09:49 |
P4 |
hotspot/runtime |
JDK-8384138 |
Linux container CPU hierarchy adjustment can ignore stricter leaf CPU quotas |
Casper Norrbin |
Oracle |
(same) |
(same) |
| 2026/09/18 09:22 |
P3 |
hotspot/compiler |
JDK-8392540 |
[Valhalla] ValueTypeNode::is_loaded does not correctly handle nullable empty flat fields |
Tobias Hartmann |
Oracle |
(same) |
(same) |
| 2026/09/18 08:45 |
P4 |
client-libs/2d |
JDK-8196185 |
sun/java2d/SunGraphics2D/SourceClippingBlitTest/SourceClippingBlitTest.java fails |
Jayathirth D V |
Oracle |
(same) |
(same) |
| 2026/09/18 07:56 |
P4 |
hotspot/gc |
JDK-8392208 |
GC related allocations should be tagged mtGC |
Matthias Baesken |
SAP |
(same) |
(same) |
| 2026/09/18 07:48 |
P4 |
hotspot/compiler |
JDK-8391597 |
RISC-V: Use movptr2 for C2 pointer constants |
2402365479 |
Independent |
(same) |
(same) |
| 2026/09/18 07:45 |
P4 |
hotspot/test |
JDK-8384068 |
ValueClassPlugin misses some annotations |
Axel Boldt-Christmas |
Oracle |
(same) |
(same) |
| 2026/09/18 07:33 |
P4 |
security-libs/javax.net.ssl |
JDK-8392076 |
Sporadic failure of test InvalidateServerSessionRenegotiate.java |
Arno Zeller |
SAP |
(same) |
(same) |
| 2026/09/18 07:26 |
P4 |
client-libs/2d |
JDK-8392463 |
Add more logging to test java/awt/font/TextLayout/LigatureCaretTest.java |
Matthias Baesken |
SAP |
(same) |
(same) |
| 2026/09/18 07:22 |
P4 |
hotspot/compiler |
JDK-8303762 |
Optimize vector slice operation with constant index using VPALIGNR instruction |
Jatin Bhateja |
Intel |
(same) |
(same) |
| 2026/09/18 05:50 |
P4 |
client-libs/java.awt |
JDK-8169103 |
ChoiceFocus.java fails because some of event wasn't come |
Prasanta Sadhukhan |
Oracle |
(same) |
(same) |
| 2026/09/18 05:50 |
P3 |
client-libs/java.awt |
JDK-8165863 |
[macosx] stack overflow in java/awt/Component/SetEnabledPerformance/SetEnabledPerformance.java |
Prasanta Sadhukhan |
Oracle |
(same) |
(same) |
| 2026/09/18 05:01 |
P4 |
hotspot/runtime |
JDK-8392599 |
ValueObjectPrinting.java fails with -XX:-CompressedOops |
Ioi Lam |
Oracle |
(same) |
(same) |
| 2026/09/18 00:18 |
P4 |
hotspot/compiler |
JDK-8392529 |
Take into account trampoline stub size and its relocations on RISC-V |
Dingli Zhang |
Independent |
(same) |
(same) |
| 2026/09/18 00:02 |
P4 |
hotspot/runtime |
JDK-8392084 |
Assert while GC scanning frozen C2 OSR frame |
Patricio Chilano Mateo |
Oracle |
(same) |
(same) |
| 2026/09/17 21:30 |
P4 |
client-libs/2d |
JDK-6992007 |
[TEST BUG] tests in 2d fails with wrong color at pixel |
Philip Race |
Oracle |
(same) |
(same) |
| 2026/09/17 21:13 |
P4 |
hotspot/svc |
JDK-8392345 |
Omit filler objects in 'live' heap dump |
Oli Gillespie |
Amazon |
(same) |
(same) |
| 2026/09/17 19:45 |
P4 |
hotspot/runtime |
JDK-8391720 |
Refactor FieldClosure for inlined fields |
Ioi Lam |
Oracle |
(same) |
(same) |
| 2026/09/17 17:51 |
P4 |
hotspot/runtime |
JDK-8391443 |
AOT training run fails with --module-path=nosuchdir |
Ioi Lam |
Oracle |
(same) |
(same) |
| 2026/09/17 16:58 |
P4 |
hotspot/compiler |
JDK-8269555 |
Stress tests fail with "Out of space in CodeCache" when executed with C1 only |
Igor Veresov |
Oracle |
(same) |
(same) |
| 2026/09/17 16:56 |
P4 |
infrastructure |
JDK-8392456 |
Configure fails with --enable-aarch64-sve and --with-extra-cflags='-Wall' |
Daniel Hu |
Amazon |
(same) |
(same) |
| 2026/09/17 16:34 |
P3 |
core-libs/java.util.concurrent |
JDK-8392075 |
ConcurrentHashMap may permanently stop resizing |
Fabian Meumertzheim |
Independent |
(same) |
(same) |
| 2026/09/17 16:12 |
P4 |
hotspot/gc |
JDK-8391711 |
gc/metaspace/TestMetaspaceFirstGC.java test failing |
shiv.shah |
Oracle |
(same) |
(same) |
| 2026/09/17 15:32 |
P4 |
client-libs/java.awt |
JDK-6848406 |
java/awt/Focus/AutoRequestFocusTest/AutoRequestFocusToFrontTest.java fails |
Alexander Zuev |
Oracle |
(same) |
(same) |
| 2026/09/17 13:54 |
P4 |
tools |
JDK-8391811 |
(jdeps) Fix typos in man page and help output |
Pavel Rappo |
Independent |
(same) |
(same) |
| 2026/09/17 13:40 |
P4 |
hotspot/runtime |
JDK-8392474 |
Remove default argument from strdup_check_oom mem_tag parameter |
Matthias Baesken |
SAP |
(same) |
(same) |
| 2026/09/17 12:27 |
P4 |
hotspot/jfr |
JDK-8388428 |
Log level of jfr+startup might be changed implicitly |
Yasumasa Suenaga |
NTT DATA |
(same) |
(same) |
| 2026/09/17 12:10 |
P4 |
hotspot/compiler |
JDK-8392467 |
RISC-V: Enable several extensions in Xuantie vendor at product mode |
Guoxiong Li |
Independent |
(same) |
(same) |
| 2026/09/17 09:55 |
P4 |
hotspot/svc-agent |
JDK-8247504 |
SA: InstanceKlass.getSize() needs an update because of value types |
Yasumasa Suenaga |
NTT DATA |
(same) |
(same) |
| 2026/09/17 08:19 |
P4 |
hotspot/compiler |
JDK-8392454 |
Test compiler/intrinsics/string/TestStringIntrinsics2.java doesn't correctly test empty strings |
cube9928 |
Unknown: @naver.com |
(same) |
(same) |
| 2026/09/17 08:04 |
P4 |
hotspot/runtime |
JDK-8313315 |
runtime/ErrorHandling/MachCodeFramesInErrorFile.java fails on linux ppc64le |
Suchismith Roy |
IBM |
(same) |
(same) |
| 2026/09/17 07:42 |
P4 |
client-libs/2d |
JDK-8392376 |
Problem list failing test java/awt/font/TextLayout/LigatureCaretTest.java on AIX |
Matthias Baesken |
SAP |
(same) |
(same) |
| 2026/09/17 07:30 |
P4 |
hotspot/runtime |
JDK-8392091 |
Replace RegQueryValueEx* function calls in hotspot that get byte and string data by RegGetValue |
Matthias Baesken |
SAP |
(same) |
(same) |
| 2026/09/17 07:29 |
P4 |
core-libs/java.util.concurrent |
JDK-8392085 |
ConcurrentSkipListMap.clone() on an emptied map shares state |
Fabian Meumertzheim |
Independent |
(same) |
(same) |
| 2026/09/17 06:51 |
P4 |
hotspot/compiler |
JDK-8392321 |
RISC-V: Enable Zabha extension |
Guoxiong Li |
Independent |
(same) |
(same) |
| 2026/09/17 05:50 |
P3 |
hotspot/compiler |
JDK-8391658 |
[Valhalla] Assert due to nested MergeMem after incremental inlining |
Tobias Hartmann |
Oracle |
(same) |
(same) |
| 2026/09/17 05:47 |
P3 |
hotspot/compiler |
JDK-8391418 |
C2: "assert(_base >= VectorMask && _base <= VectorZ) failed: Not a Vector" with VectorMaskCast |
erfang |
Unknown |
(same) |
(same) |
| 2026/09/17 05:10 |
P4 |
client-libs |
JDK-8392527 |
Problemlist java/awt/Modal/ModalDialogOrderingTest/ModalDialogOrderingTest.java |
Prasanta Sadhukhan |
Oracle |
(same) |
(same) |
| 2026/09/17 03:25 |
P3 |
client-libs/java.awt |
JDK-8202882 |
java/awt/FileDialog/FilenameFilterTest/FilenameFilterTest.java fails on Linux |
Prasanta Sadhukhan |
Oracle |
(same) |
(same) |
| 2026/09/17 01:02 |
P4 |
hotspot/runtime |
JDK-8392319 |
Remove use of BULLET in HotSpot logging code |
cube9928 |
Unknown: @naver.com |
(same) |
(same) |
| 2026/09/16 22:54 |
P3 |
security-libs/javax.net.ssl |
JDK-8381641 |
ML-DSA in TLS 1.3 |
Haimay Chao |
Oracle |
(same) |
(same) |
| 2026/09/16 22:11 |
P5 |
hotspot/jfr |
JDK-8392369 |
JFR: Incorrect default value with beginChunk + endChunk |
Erik Gahlin |
Oracle |
(same) |
(same) |
| 2026/09/16 20:46 |
P3 |
hotspot/runtime |
JDK-8391685 |
AOT cache creation fails with unarchived method in ResolvedMethodEntry |
Ioi Lam |
Oracle |
(same) |
(same) |
| 2026/09/16 20:17 |
P4 |
client-libs/2d |
JDK-8135174 |
javax/print/PrintSEUmlauts/PrintSEUmlauts.java failed |
Philip Race |
Oracle |
(same) |
(same) |
| 2026/09/16 20:14 |
P3 |
security-libs/javax.crypto |
JDK-8379016 |
Improve double_keccak() intrinsic on ARM when SHA3 instructions are not available |
semery |
Unknown |
(same) |
(same) |
| 2026/09/16 19:45 |
P4 |
hotspot/compiler |
JDK-8392413 |
ciField constructor should set _is_constant for strict final fields |
Quan Anh Mai |
Independent |
(same) |
(same) |
| 2026/09/16 19:05 |
P4 |
client-libs/2d |
JDK-8392349 |
Remove usage of GetPrimitiveArrayCritical in creating dither cube |
Philip Race |
Oracle |
(same) |
(same) |
| 2026/09/16 16:31 |
P4 |
tools/javac |
JDK-8389654 |
BaseFileManager --preview-mode handling need to be more robust |
Chen Liang |
Oracle |
(same) |
(same) |
| 2026/09/16 15:13 |
P4 |
hotspot/compiler |
JDK-8384415 |
Shenandoah: Hotpatch GC state checks |
Aleksey Shipilev |
Amazon |
(same) |
(same) |
| 2026/09/16 14:30 |
P4 |
hotspot/compiler |
JDK-8386465 |
4th argument in inline_dilithiumNttMult() is unused |
Navi.Bereziuk |
Independent |
(same) |
(same) |
| 2026/09/16 13:11 |
P3 |
hotspot/compiler |
JDK-8391777 |
C2 hits "Bad immediate dominator info" in CountedLoopConverter::filtered_type_from_dominators |
Frederic Parain |
Oracle |
(same) |
(same) |
| 2026/09/16 12:57 |
P4 |
hotspot/runtime |
JDK-8392412 |
Remove STATIC_ASSERT macro |
Axel Boldt-Christmas |
Oracle |
(same) |
(same) |
| 2026/09/16 12:20 |
P5 |
security-libs/javax.net.ssl |
JDK-8376837 |
Typo in code comment in sun/security/ssl/TransportContext.java |
cube9928 |
Unknown: @naver.com |
(same) |
(same) |
| 2026/09/16 11:50 |
P3 |
hotspot/compiler |
JDK-8389342 |
[Valhalla] C2: assert(false) failed: value_type does not fit field_type |
Frederic Parain |
Oracle |
(same) |
(same) |
| 2026/09/16 11:39 |
P4 |
hotspot/runtime |
JDK-8392390 |
Initialize ObjectMonitor::_object_strong_lock |
Fredrik Bredberg |
Oracle |
(same) |
(same) |
| 2026/09/16 11:34 |
P4 |
hotspot/test |
JDK-8392389 |
TestPids.java fails as "--pids-limit=0" caps max number of threads to 1 |
Navi.Bereziuk |
Independent |
(same) |
(same) |
| 2026/09/16 07:56 |
P4 |
hotspot/runtime |
JDK-8392458 |
[s390x] Add missing assert |
Amit Kumar |
IBM |
(same) |
(same) |
| 2026/09/16 06:12 |
P3 |
client-libs/java.awt |
JDK-8066259 |
[macosx] Possible regression: test/java/awt/Modal/ModalDialogOrderingTest/ModalDialogOrderingTest.java failure |
Prasanta Sadhukhan |
Oracle |
(same) |
(same) |
| 2026/09/16 05:47 |
P4 |
hotspot/gc |
JDK-8392427 |
ZGC: Missing ICacheInvalidationContext forward declaration |
Stefan Karlsson |
Oracle |
(same) |
(same) |
| 2026/09/16 05:47 |
P4 |
hotspot/compiler |
JDK-8392366 |
compiler/vectorapi/TestVectorLogicConeFuzzer.java fails IR verification |
Quan Anh Mai |
Independent |
(same) |
(same) |
| 2026/09/16 03:19 |
P4 |
hotspot/svc |
JDK-8392031 |
Crash in ThreadSnapshot::initialize |
Denghui Dong |
Alibaba |
(same) |
(same) |
| 2026/09/16 02:48 |
P4 |
hotspot/compiler |
JDK-8392364 |
RISC-V: Merge reloc_destination into destination |
Dingli Zhang |
Independent |
(same) |
(same) |
| 2026/09/16 01:48 |
P4 |
infrastructure/build |
JDK-8384073 |
VM does not build without g1gc |
benshuai5d |
Independent |
(same) |
(same) |
| 2026/09/15 23:25 |
P4 |
hotspot/compiler |
JDK-8392452 |
ProblemList compiler/igvn/TestIncorrectDeadPathTypeNode.java |
David Holmes |
Oracle |
(same) |
(same) |
| 2026/09/15 23:25 |
P4 |
hotspot/compiler |
JDK-8392451 |
ProblemList compiler/vectorapi/VectorExpressionFuzzer.java |
David Holmes |
Oracle |
(same) |
(same) |
| 2026/09/15 23:25 |
P4 |
hotspot/compiler |
JDK-8392450 |
ProblemList compiler\vectorapi\VectorMaskCompareNotTest.java on Windows-x64 |
David Holmes |
Oracle |
(same) |
(same) |
| 2026/09/15 23:07 |
P4 |
core-svc/debugger |
JDK-8392429 |
Problem list vmTestbase/nsk/jdwp/StackFrame/PopFrames/popframes001/TestDescription.java due to JDK-8391440 |
Chris Plummer |
Oracle |
(same) |
(same) |
| 2026/09/15 22:13 |
P4 |
hotspot/gc |
JDK-8391591 |
GenShen: Humongous allocation failure should trigger a degenerated cycle instead of a full GC |
pfontanilla |
Unknown |
(same) |
(same) |
| 2026/09/15 17:52 |
P3 |
hotspot/jfr |
JDK-8392123 |
JFR: Harden jdk.jfr.AnnotationElement |
Erik Gahlin |
Oracle |
(same) |
(same) |
| 2026/09/15 16:23 |
P4 |
hotspot/runtime |
JDK-8392353 |
[valhalla] clean up incorrect verification comments |
Dan Heidinga |
Oracle |
(same) |
(same) |
| 2026/09/15 16:22 |
P4 |
hotspot/compiler |
JDK-8387759 |
PPC64: Remove postalloc_expand from EncodeP/DecodeN not-null nodes |
David Briemann |
SAP |
(same) |
(same) |
| 2026/09/15 14:52 |
P4 |
hotspot/runtime |
JDK-8392172 |
[REDO] os::print_location should handle markword printing with COH |
Simon Tooke |
Red Hat |
(same) |
(same) |
| 2026/09/15 13:53 |
P4 |
hotspot/compiler |
JDK-8392195 |
[PPC64] Several vector tests fail on Power8 |
Martin Doerr |
SAP |
(same) |
(same) |
| 2026/09/15 12:50 |
P3 |
hotspot/jfr |
JDK-8392325 |
JFR parser reads empty string as null |
Andrei Pangin |
Amazon |
(same) |
(same) |
| 2026/09/15 11:12 |
P4 |
hotspot/runtime |
JDK-8392342 |
Delete Hotspot's LinkedList utility class |
Johan Sjölen |
Oracle |
(same) |
(same) |
| 2026/09/15 08:09 |
P4 |
client-libs/java.awt |
JDK-8081489 |
[macosx] Test java/awt/Focus/FocusOwnerFrameOnClick/FocusOwnerFrameOnClick.java fails in Mac 10.10 but passes in 10.9 |
Alexander Zuev |
Oracle |
(same) |
(same) |
| 2026/09/15 07:29 |
P4 |
hotspot/compiler |
JDK-8392216 |
Use more mtCompiler NMT tags in compiler code |
Matthias Baesken |
SAP |
(same) |
(same) |
| 2026/09/15 07:07 |
P4 |
tools/javac |
JDK-8390284 |
javac does not consider the exporting default of automatic modules in --patch-module |
Jan Lahoda |
Oracle |
N/A |
Unknown |
| 2026/09/15 07:05 |
P4 |
client-libs/2d |
JDK-8196102 |
sun/java2d/DirectX/OverriddenInsetsTest/OverriddenInsetsTest.java fails |
Jayathirth D V |
Oracle |
(same) |
(same) |
| 2026/09/15 06:48 |
P3 |
hotspot/jfr |
JDK-8373416 |
JFR: Cutoff parameter ignored for path-to-gc-roots in JFR.dump |
Erik Gahlin |
Oracle |
(same) |
(same) |
| 2026/09/15 04:57 |
P4 |
core-libs/java.net |
JDK-8391915 |
New test IdleConnectionTimeoutReuseTest times out on AIX |
Volkan Yazici |
Oracle |
(same) |
(same) |
| 2026/09/15 02:28 |
P4 |
hotspot/compiler |
JDK-8373730 |
Missing identity optimization in arithmetic Or |
benshuai5d |
Independent |
(same) |
(same) |
| 2026/09/15 02:08 |
P3 |
hotspot/svc-agent |
JDK-8392323 |
serviceability/sa/ClhsdbInspectWithValueObject.java fails due to "Multiple garbage collectors selected" |
Yasumasa Suenaga |
NTT DATA |
(same) |
(same) |
| 2026/09/14 23:54 |
P3 |
hotspot/jfr |
JDK-8392334 |
JFR: Incorrect average duration for 'jfr view' |
Erik Gahlin |
Oracle |
(same) |
(same) |
| 2026/09/14 22:39 |
P5 |
hotspot/compiler |
JDK-8389652 |
HotCodeHeap should throw warning when enabled without SegmentedCodeCache |
Chad Rakoczy |
Amazon |
(same) |
(same) |
| 2026/09/14 21:59 |
P4 |
hotspot/compiler |
JDK-8392175 |
Remove VtableStub::receiver_location |
bpeterson |
Unknown |
(same) |
(same) |
| 2026/09/14 21:15 |
P4 |
hotspot/jfr |
JDK-8391986 |
JFR: TestLookForUntestedEvents should only read a file once |
Erik Gahlin |
Oracle |
(same) |
(same) |
| 2026/09/14 19:13 |
P3 |
hotspot/jfr |
JDK-8392326 |
JFR: Custom .jfc-files in lib/jfr can't be resolved |
Erik Gahlin |
Oracle |
(same) |
(same) |
| 2026/09/14 17:46 |
P4 |
hotspot/jfr |
JDK-8391835 |
JFR: Clarify deprecated event level helper name |
Markus Grönlund |
Oracle |
(same) |
(same) |
| 2026/09/14 17:43 |
P4 |
client-libs/java.awt |
JDK-8392254 |
Remove java/awt/Modal/ModalExclusionTests from the problem list on Linux |
Alexander Zvegintsev |
Oracle |
(same) |
(same) |
| 2026/09/14 17:31 |
P3 |
hotspot/jfr |
JDK-8391824 |
JFR: wrong field lookup for JVM.getEventWriter() slow path |
Markus Grönlund |
Oracle |
(same) |
(same) |
| 2026/09/14 17:27 |
P3 |
hotspot/jfr |
JDK-8391751 |
JFR: Acquire JfrStacktrace_lock on reverse lookup for leak profiler |
Markus Grönlund |
Oracle |
(same) |
(same) |
| 2026/09/14 17:08 |
P3 |
hotspot/jfr |
JDK-8391707 |
JFR: Underscoped SerializerRegistrationGuard |
Markus Grönlund |
Oracle |
(same) |
(same) |
| 2026/09/14 14:10 |
P3 |
hotspot/jfr |
JDK-8391790 |
JFR: MethodTracer should inspect the union of unload sets |
Markus Grönlund |
Oracle |
(same) |
(same) |
| 2026/09/14 13:51 |
P5 |
hotspot/compiler |
JDK-8391287 |
C2: Potential null dereference in inline_vector_gather_scatter |
aivy |
Unknown |
(same) |
(same) |
| 2026/09/14 12:53 |
P4 |
infrastructure/build |
JDK-8338063 |
Passing "|" as argument to TEST fails |
benshuai5d |
Independent |
(same) |
(same) |
| 2026/09/14 11:52 |
P4 |
hotspot/runtime |
JDK-8391951 |
Rename inlined fields to flat fields |
Stefan Karlsson |
Oracle |
(same) |
(same) |
| 2026/09/14 11:36 |
P3 |
hotspot/jfr |
JDK-8391865 |
JFR: JfrEventThrottler::_disabled needs unadorned atomic loads and stores |
Markus Grönlund |
Oracle |
(same) |
(same) |
| 2026/09/14 11:30 |
P3 |
hotspot/jfr |
JDK-8391766 |
JFR: Reset JfrSet element count when clearing |
Markus Grönlund |
Oracle |
(same) |
(same) |
| 2026/09/14 11:29 |
P3 |
hotspot/jfr |
JDK-8391861 |
JFR: JfrThreadLocal::_dead termination condition has a data race |
Markus Grönlund |
Oracle |
(same) |
(same) |
| 2026/09/14 09:59 |
P4 |
core-libs/java.lang.foreign |
JDK-8391662 |
Deadlock in UpcallContext dtor when called after JVM shutdown due to System.exit |
Jorn Vernee |
Oracle |
(same) |
(same) |
| 2026/09/14 08:45 |
P4 |
core-libs/java.lang.foreign |
JDK-8365968 |
Error in FFM tests due to swallowing exception |
Per-Ake Minborg |
Oracle |
(same) |
(same) |
| 2026/09/14 08:39 |
P4 |
hotspot/compiler |
JDK-8392002 |
Improve BCEscapeAnalyzer tracing readability |
Roberto Castaneda Lozano |
Oracle |
(same) |
(same) |
| 2026/09/14 08:27 |
P3 |
tools/javac |
JDK-8390759 |
Checked exception in switch guard is hidden |
dbalek |
Unknown |
(same) |
(same) |
| 2026/09/14 06:52 |
P4 |
hotspot/gc |
JDK-8311029 |
G1: Check constraints before adjusting G1HeapRegionSize |
benshuai5d |
Independent |
(same) |
(same) |
| 2026/09/14 06:16 |
P4 |
hotspot/compiler |
JDK-8392205 |
RISC-V: Small refactoring for C1 volatile load handling |
Gui Cao |
Independent |
(same) |
(same) |
| 2026/09/14 05:57 |
P2 |
hotspot/runtime |
JDK-8392167 |
[arm32] safepoint poll always takes slow path |
Sergey Nazarkin |
Azul |
(same) |
(same) |
| 2026/09/12 11:40 |
P4 |
core-libs/java.net |
JDK-8392129 |
Remove the usage of DONT_ENABLE_IPV6 macro in net_util_md.c |
Jaikiran Pai |
Oracle |
(same) |
(same) |
| 2026/09/12 00:30 |
P4 |
hotspot/svc-agent |
JDK-8390106 |
SA: Inline object support is incomplete |
Yasumasa Suenaga |
NTT DATA |
(same) |
(same) |
| 2026/09/11 23:56 |
P4 |
hotspot/gc |
JDK-8391988 |
Disable stringop-overflow in shenandoahInPlacePromoter.cpp |
Hao Sun |
Nvidia |
(same) |
(same) |
| 2026/09/11 17:00 |
P4 |
core-libs |
JDK-8392180 |
Enable JSON unit tests in CI |
Naoto Sato |
Oracle |
(same) |
(same) |
| 2026/09/11 16:11 |
P4 |
client-libs/java.awt |
JDK-8340022 |
java/awt/PopupMenu/PopupHangTest/PopupHangTest.java fails on windows |
Prasanta Sadhukhan |
Oracle |
(same) |
(same) |
| 2026/09/11 14:32 |
P4 |
client-libs/java.awt |
JDK-8196441 |
java/awt/Modal/ToBack/*.java tests fail |
Alexander Zvegintsev |
Oracle |
(same) |
(same) |
| 2026/09/11 14:28 |
P4 |
client-libs/javax.accessibility |
JDK-8378404 |
VoiceOver Too Chatty For Tooltips |
Jeremy Wood |
Independent |
(same) |
(same) |
| 2026/09/11 12:54 |
P3 |
hotspot/compiler |
JDK-8384101 |
C2: Memory edge of boxed load incorrectly moved above modifying call |
Manuel Hässig |
Oracle |
(same) |
(same) |
| 2026/09/11 12:13 |
P4 |
core-libs/java.net |
JDK-8391687 |
Add a test to check that java.net.URI doesn't throw NumberFormatException |
Volkan Yazici |
Oracle |
(same) |
(same) |
| 2026/09/11 11:25 |
P4 |
hotspot/runtime |
JDK-8385565 |
Store MallocSites in MemBaseline in an array instead of a linked list |
Johan Sjölen |
Oracle |
(same) |
(same) |
| 2026/09/11 09:46 |
P4 |
hotspot/compiler |
JDK-8391695 |
[Valhalla] Timeouts due to unbounded GC stress threads in compiler tests |
Tobias Hartmann |
Oracle |
(same) |
(same) |
| 2026/09/11 08:35 |
P3 |
hotspot/compiler |
JDK-8391669 |
[Valhalla] C2 hits assert due to expensive node with StoreFlat control input |
Tobias Hartmann |
Oracle |
(same) |
(same) |
| 2026/09/11 08:03 |
P4 |
core-libs/java.net |
JDK-8391688 |
Add test to check that InetAddress.getByName doesn't throw NumberFormatException |
Volkan Yazici |
Oracle |
(same) |
(same) |
| 2026/09/11 06:53 |
P4 |
hotspot/compiler |
JDK-8390747 |
C2: Improve VerifyIterativeGVN flag description |
Guanqiang Han |
Independent |
(same) |
(same) |
| 2026/09/11 03:27 |
P4 |
client-libs |
JDK-8369311 |
De-problem list non-failing SizeMinimizedTest |
Prasanta Sadhukhan |
Oracle |
(same) |
(same) |
| 2026/09/11 00:29 |
P4 |
hotspot/compiler |
JDK-8392127 |
RISC-V: Replace assert with guarantee in patch_offset_in_jal and patch_offset_in_conditional_branch |
Dingli Zhang |
Independent |
(same) |
(same) |
| 2026/09/11 00:16 |
P4 |
hotspot/compiler |
JDK-8392015 |
Remove broken and untested VerifyStackAtCalls debug flag |
Dean Long |
Oracle |
(same) |
(same) |
| 2026/09/10 23:12 |
P4 |
hotspot/compiler |
JDK-8392156 |
RISC-V: Inverted VerifyStackAtCalls condition in in_preserve_stack_slots() |
Dingli Zhang |
Independent |
(same) |
(same) |
| 2026/09/10 20:06 |
P4 |
hotspot/runtime |
JDK-8391998 |
Mutex name should be mtSynchronizer |
John Spurling |
Amazon |
(same) |
(same) |
| 2026/09/10 18:53 |
P4 |
core-svc/javax.management |
JDK-8391064 |
JMX: RMIConnector findRMIServer error message should not mention /ior/ |
zhangyinuo |
Independent |
(same) |
(same) |
| 2026/09/10 17:04 |
P4 |
hotspot/compiler |
JDK-8387446 |
Update vtableStubs.hpp comments |
bpeterson |
Unknown |
(same) |
(same) |
| 2026/09/10 16:04 |
P4 |
hotspot/runtime |
JDK-8392095 |
EventLogs memory allocations should be mtLogging |
Aleksey Shipilev |
Amazon |
(same) |
(same) |
| 2026/09/10 15:31 |
P4 |
hotspot/compiler |
JDK-8387336 |
C2: PPC64: should elide more ConvL2I nodes |
Richard Reingruber |
SAP |
(same) |
(same) |
| 2026/09/10 14:39 |
P4 |
hotspot/runtime |
JDK-8392090 |
HashOverflowTest.java fails on PPC64 due to too small stack size |
Martin Doerr |
SAP |
(same) |
(same) |
| 2026/09/10 14:01 |
P3 |
hotspot/compiler |
JDK-8391146 |
assert(_base == AryPtr) failed: Not an array pointer |
Vladimir Kozlov |
Oracle |
(same) |
(same) |
| 2026/09/10 11:31 |
P4 |
core-libs/java.net |
JDK-8392037 |
Avoid switching off the unused-variable warning in BUILD_LIBNET and BUILD_LIBNIO |
Matthias Baesken |
SAP |
(same) |
(same) |
| 2026/09/10 11:16 |
P3 |
hotspot/compiler |
JDK-8390513 |
[Valhalla] Scalar replacement of clone can tear atomic flat arrays |
Frederic Parain |
Oracle |
(same) |
(same) |
| 2026/09/10 09:35 |
P4 |
hotspot/runtime |
JDK-8391950 |
Clean out leftovers from inline to value rename |
Stefan Karlsson |
Oracle |
(same) |
(same) |
| 2026/09/10 09:06 |
P4 |
hotspot/compiler |
JDK-8391454 |
[Valhalla][AArch64] C2 stack-repair fails with PAC-RET branch protection enabled |
Hao Sun |
Nvidia |
(same) |
(same) |
| 2026/09/10 08:36 |
P4 |
hotspot/svc-agent |
JDK-8390949 |
Remove displaced-mark related code from SA agent |
Fredrik Bredberg |
Oracle |
(same) |
(same) |
| 2026/09/10 08:16 |
P4 |
hotspot/svc-agent |
JDK-8391940 |
Test serviceability/sa/TestJhsdbJstackMixedWithXComp.java#xcomp failed: ERROR: DWARF: Unknown opcode: 0xf |
Yasumasa Suenaga |
NTT DATA |
(same) |
(same) |
| 2026/09/10 08:03 |
P4 |
hotspot/compiler |
JDK-8392041 |
RISC-V: TestFloat16ScalarOperations.java fails after JDK-8391717 with fastdebug |
Gui Cao |
Independent |
(same) |
(same) |
| 2026/09/10 05:54 |
P4 |
hotspot/gc |
JDK-8386885 |
Parallel: Support dynamic young/old generation boundary |
Albert Yang |
Oracle |
(same) |
(same) |
| 2026/09/10 05:04 |
P4 |
hotspot/compiler |
JDK-8385134 |
Empty switch profile is incorrectly treated as unreachable |
Tobias Hartmann |
Oracle |
(same) |
(same) |
| 2026/09/10 02:28 |
P4 |
client-libs/javax.swing |
JDK-7184956 |
[macosx] JPopupMenu.setDefaultLightPopupEnable(true) doesn't work correctly |
Prasanta Sadhukhan |
Oracle |
(same) |
(same) |
| 2026/09/10 01:37 |
P4 |
hotspot/compiler |
JDK-8389223 |
RISC-V: Implement CRC32C intrinsic using Zbc extension |
xupeijun.xpj |
Alibaba |
(same) |
(same) |
| 2026/09/09 23:16 |
P4 |
core-libs/java.util:i18n |
JDK-8391973 |
TimeZoneNamesTest fails for America/Vancouver for non-US default locales |
Naoto Sato |
Oracle |
(same) |
(same) |
| 2026/09/09 21:32 |
P4 |
hotspot/runtime |
JDK-8392000 |
JNI memory allocations should be mtJNI |
Aleksey Shipilev |
Amazon |
(same) |
(same) |
| 2026/09/09 16:45 |
P2 |
core-libs |
JDK-8381976 |
Implement JEP 540: Simple JSON API (Incubator) |
Naoto Sato |
Oracle |
(same) |
(same) |
| 2026/09/09 15:58 |
P4 |
hotspot/runtime |
JDK-8392082 |
Missed a Klass in jfieldIDWorkaround.hpp |
Coleen Phillimore |
Oracle |
(same) |
(same) |
| 2026/09/09 15:21 |
P4 |
hotspot/compiler |
JDK-8383724 |
C2: Implement AddI128T and SubI128T |
Quan Anh Mai |
Independent |
(same) |
(same) |
| 2026/09/09 15:20 |
P4 |
hotspot/compiler |
JDK-8391538 |
[PPC64] Improve GHASH intrinsic by using better Power8/9 instructions |
Suchismith Roy |
IBM |
(same) |
(same) |
| 2026/09/09 14:29 |
P4 |
hotspot/gc |
JDK-8391972 |
G1: Remove usage of n_ prefix instead of num_ |
Thomas Schatzl |
Oracle |
(same) |
(same) |
| 2026/09/09 14:28 |
P3 |
security-libs/javax.net.ssl |
JDK-8391863 |
Missed usage cases for TLSHandshakeEvent |
Artur Barashev |
Oracle |
(same) |
(same) |
| 2026/09/09 14:25 |
P4 |
hotspot/compiler |
JDK-8390300 |
[Valhalla] PPC64 C2 Provide Instruction Forms for StoreLSpecial Nodes |
Richard Reingruber |
SAP |
(same) |
(same) |
| 2026/09/09 14:02 |
P4 |
hotspot/gc |
JDK-8391965 |
G1: Fix number of regions identifiers in G1HeapRegionClaimer |
Thomas Schatzl |
Oracle |
(same) |
(same) |
| 2026/09/09 14:02 |
P4 |
core-svc/tools |
JDK-8391063 |
Attach API (v2) should check for zero-sized request |
Kevin Walls |
Oracle |
(same) |
(same) |
| 2026/09/09 13:55 |
P4 |
hotspot/gc |
JDK-8391977 |
Shenandoah: Internal memory should be mtGC |
Aleksey Shipilev |
Amazon |
(same) |
(same) |
| 2026/09/09 13:44 |
P4 |
hotspot/svc-agent |
JDK-8391886 |
Test serviceability/sa/sadebugd/DebugdConnectTest.java fails due to unexpected largepage warnings |
Fairoz Matte |
Oracle |
(same) |
(same) |
| 2026/09/09 13:42 |
P4 |
hotspot/gc |
JDK-8391954 |
G1: Cleanup committed region ranges length to use num_regions |
Thomas Schatzl |
Oracle |
(same) |
(same) |
| 2026/09/09 13:37 |
P4 |
hotspot/gc |
JDK-8391974 |
G1: Clean up policy related number-of-regions identifiers |
Thomas Schatzl |
Oracle |
(same) |
(same) |
| 2026/09/09 13:24 |
P4 |
hotspot/gc |
JDK-8391962 |
G1: Change counts in uncommit task to num_regions |
Thomas Schatzl |
Oracle |
(same) |
(same) |
| 2026/09/09 13:24 |
P4 |
hotspot/gc |
JDK-8391958 |
G1: Evacuation failure handling should use num_regions identifiers |
Thomas Schatzl |
Oracle |
(same) |
(same) |
| 2026/09/09 13:17 |
P4 |
hotspot/gc |
JDK-8391923 |
G1: NUMA-node accounting should use num_regions identifiers |
Thomas Schatzl |
Oracle |
(same) |
(same) |
| 2026/09/09 11:06 |
P3 |
core-libs/java.lang.foreign |
JDK-8391689 |
Specify selected-range encoding and allocator-neutral results for SegmentAllocator.allocateFrom(String, Charset, int, int) |
Liam Miller-Cushon |
Google |
(same) |
(same) |
| 2026/09/09 11:06 |
P3 |
core-libs/java.lang.foreign |
JDK-8391678 |
Correct encoding wording and destination bound in MemorySegment.copy(String, Charset, int, MemorySegment, long, int) |
Liam Miller-Cushon |
Google |
(same) |
(same) |
| 2026/09/09 10:17 |
P3 |
hotspot/compiler |
JDK-8389670 |
C2: VectorBitwiseBlendNode assert when inputs are not vector nodes |
erfang |
Unknown |
(same) |
(same) |
| 2026/09/09 09:45 |
P4 |
hotspot/compiler |
JDK-8388558 |
C2: Specify return_addr relative to _old_SP |
Richard Reingruber |
SAP |
(same) |
(same) |
| 2026/09/09 09:34 |
P4 |
hotspot/runtime |
JDK-8387723 |
Scoped memory async exceptions can be delivered inside FJP compensation code |
Jorn Vernee |
Oracle |
(same) |
(same) |
| 2026/09/09 09:12 |
P4 |
hotspot/compiler |
JDK-8387725 |
RISC-V: Redundant memory barrier around various CAS instrucions |
Gui Cao |
Independent |
(same) |
(same) |
| 2026/09/09 08:50 |
P4 |
core-libs/java.lang |
JDK-8389634 |
Overflow in SequenceLayoutImpl.reshape leads to ArithmeticException (division by zero) instead of IllegalArgumentException |
Per-Ake Minborg |
Oracle |
(same) |
(same) |
| 2026/09/09 08:01 |
P4 |
hotspot/gc |
JDK-8391919 |
G1: Change G1CardSetGroup* length identifiers to num_regions |
Thomas Schatzl |
Oracle |
(same) |
(same) |
| 2026/09/09 07:15 |
P3 |
core-libs/java.lang.foreign |
JDK-8391708 |
Resolve same-size versus unbounded-size contract of MemorySegment.reinterpret(Arena, Consumer) |
Per-Ake Minborg |
Oracle |
(same) |
(same) |
| 2026/09/09 06:04 |
P4 |
hotspot/runtime |
JDK-8391347 |
[s390x] Enable Field & Array Flattening with Null/Non null atomic optimisation |
Amit Kumar |
IBM |
(same) |
(same) |
| 2026/09/09 06:04 |
P3 |
hotspot/runtime |
JDK-8391341 |
[s390] fix out of index crash in MOAT.java |
Amit Kumar |
IBM |
(same) |
(same) |
| 2026/09/09 05:02 |
P4 |
hotspot/compiler |
JDK-8391871 |
AArch64: Prevent non-acquire CAS patterns from matching nodes that need acquire |
Gui Cao |
Independent |
(same) |
(same) |
| 2026/09/09 04:35 |
P4 |
hotspot/compiler |
JDK-8391873 |
RISC-V: Prevent non-acquire CAS patterns from matching nodes that need acquire |
Gui Cao |
Independent |
(same) |
(same) |
| 2026/09/09 03:53 |
P4 |
client-libs/2d |
JDK-8266312 |
java/awt/font/TextLayout/LigatureCaretTest.java fails with "Error: Left hit failed. Hit:TextHitInfo[1L]" |
Prasanta Sadhukhan |
Oracle |
(same) |
(same) |
| 2026/09/09 03:45 |
P4 |
client-libs/2d |
JDK-7003378 |
test/jdk/java/awt/print/print/PrinterJob/GlyphPositions.java fails |
Prasanta Sadhukhan |
Oracle |
(same) |
(same) |
| 2026/09/09 03:45 |
P4 |
client-libs/2d |
JDK-7003376 |
test/jdk/java/awt/print/PrinterJob/PSQuestionMark.java fails |
Prasanta Sadhukhan |
Oracle |
(same) |
(same) |
| 2026/09/09 01:48 |
P4 |
hotspot/compiler |
JDK-8391942 |
RISC-V: Remove redundant null checks in needs_acquiring_load_reserved() |
Gui Cao |
Independent |
(same) |
(same) |
| 2026/09/08 20:57 |
P4 |
tools/jpackage |
JDK-8391713 |
Streamline additional content handling in jpackage |
Alexey Semenyuk |
Oracle |
(same) |
(same) |
| 2026/09/08 19:47 |
P4 |
client-libs/java.awt |
JDK-8001150 |
[TEST_BUG] Improve instructions for java/awt/xembed/server/TestXEmbedServerJava.java |
jyothilekshmi.s |
Oracle |
(same) |
(same) |
| 2026/09/08 14:50 |
P4 |
core-libs/java.lang |
JDK-8391611 |
Remove old NT 4.0 code from src/java.base/windows/native/libjava/TimeZone_md.c |
Matthias Baesken |
SAP |
(same) |
(same) |
| 2026/09/08 12:39 |
P4 |
core-libs/java.nio |
JDK-8391920 |
(fs) Improve Files.readSymbolicLink handling of corrupt sym links (win) |
Alan Bateman |
Oracle |
(same) |
(same) |
| 2026/09/08 12:24 |
P4 |
tools/launcher |
JDK-8391912 |
Avoid switching off the unused-variable warning in BUILD_LIBJLI |
Matthias Baesken |
SAP |
(same) |
(same) |
| 2026/09/08 10:34 |
P4 |
tools/launcher |
JDK-8391329 |
[REDO] Not all --long-options accept space as seperator |
Guanqiang Han |
Independent |
(same) |
(same) |
| 2026/09/08 09:09 |
P4 |
core-libs/java.lang.foreign |
JDK-8391804 |
Test java/foreign/TestConfinedSegmentPoolDefensiveRelease.java fails on zero |
Per-Ake Minborg |
Oracle |
(same) |
(same) |
| 2026/09/08 08:47 |
P4 |
hotspot/compiler |
JDK-8390450 |
RISC-V: Add Xuantie vendor feature detection |
Guoxiong Li |
Independent |
(same) |
(same) |
| 2026/09/08 07:47 |
P4 |
hotspot/gc |
JDK-8390941 |
G1: The oop-not-in-collection-set verification inconsistently checks oops |
aivy |
Unknown |
(same) |
(same) |
| 2026/09/08 06:57 |
P4 |
security-libs/javax.security |
JDK-8391760 |
[windows] libjaas nt.c seems to have some handle leaks |
Matthias Baesken |
SAP |
(same) |
(same) |
| 2026/09/08 06:41 |
P4 |
hotspot/compiler |
JDK-8391908 |
X86: string indexof stubs use a wrong jump table |
Kuai Wei |
Alibaba |
(same) |
(same) |
| 2026/09/08 05:19 |
P4 |
tools/javac |
JDK-8385563 |
javac non-exhaustive switch diagnostic should avoid mentioning inaccessible types |
Jan Lahoda |
Oracle |
(same) |
(same) |
| 2026/09/08 05:13 |
P4 |
hotspot/compiler |
JDK-8391717 |
[VectorAPI] Assertion error in Float16 FMA kernel with -XX:-UseFMA |
Jatin Bhateja |
Intel |
(same) |
(same) |
| 2026/09/07 23:27 |
P3 |
hotspot/compiler |
JDK-8391881 |
RISC-V: jni_fast_GetField registers the wrong pc for the speculative load |
Gui Cao |
Independent |
(same) |
(same) |
| 2026/09/07 19:39 |
P4 |
core-libs/java.net |
JDK-8391805 |
New test java/net/httpclient/IdleConnectionTimeoutReuseTest.java timed out with virtual threads |
Volkan Yazici |
Oracle |
(same) |
(same) |
| 2026/09/07 15:35 |
P4 |
hotspot/gc |
JDK-8386366 |
G1: Improve naming for variables that have _cset_length postfix |
aivy |
Unknown |
(same) |
(same) |
| 2026/09/07 13:57 |
P5 |
hotspot/compiler |
JDK-8391353 |
C2: Missed Identity optimization opportunity in PhaseIterGVN for CMoveI |
aivy |
Unknown |
(same) |
(same) |
| 2026/09/07 12:48 |
P4 |
hotspot/compiler |
JDK-8391757 |
[PPC64] C1 runs into assertion with -XX:+VerifyOops |
Martin Doerr |
SAP |
(same) |
(same) |
| 2026/09/07 11:48 |
P4 |
hotspot/gc |
JDK-8318477 |
[jmh] the test gc.MicroLargePages.micro_HOP_DIST_4KB failed with multiple threads |
benshuai5d |
Independent |
(same) |
(same) |
| 2026/09/07 11:14 |
P3 |
hotspot/compiler |
JDK-8385995 |
C2: assert(phi->_idx >= nodes_size()) failed: only new Phi per instance memory slice |
Quan Anh Mai |
Independent |
(same) |
(same) |
| 2026/09/07 09:52 |
P4 |
hotspot/compiler |
JDK-8384408 |
AArch64: Replace DCPS1 with UDF |
ruben |
Unknown |
(same) |
(same) |
| 2026/09/07 09:32 |
P4 |
hotspot/gc |
JDK-8389707 |
G1: Allocation by VM Thread after GC allocates on VMThread NUMA node id not requesting thread NUMA node id |
gaoxiang |
Independent |
(same) |
(same) |
| 2026/09/07 08:26 |
P4 |
hotspot/runtime |
JDK-8391728 |
Rename inline klass / type to value klass / type to match Java side of JEP 401 |
Stefan Karlsson |
Oracle |
(same) |
(same) |
| 2026/09/07 08:14 |
P4 |
hotspot/runtime |
JDK-8391175 |
Cleanup BasicLock and displaced header references after removing UseObjectMonitorTable |
Axel Boldt-Christmas |
Oracle |
(same) |
(same) |
| 2026/09/07 06:50 |
P3 |
core-libs/java.lang.foreign |
JDK-8391756 |
SegmentAllocator string methods promise to return native segments which it should not |
Per-Ake Minborg |
Oracle |
(same) |
(same) |
| 2026/09/07 06:48 |
P4 |
core-libs/java.lang.foreign |
JDK-8391841 |
MemorySegment.copy does not throw for zero-sized segments |
Per-Ake Minborg |
Oracle |
(same) |
(same) |
| 2026/09/07 06:48 |
P4 |
core-libs/java.lang.foreign |
JDK-8391837 |
MemorySegment.mismatch does not throw for zero-sized segments |
Per-Ake Minborg |
Oracle |
(same) |
(same) |
| 2026/09/07 05:40 |
P4 |
tools/javac |
JDK-8388373 |
Exclude preview warnings from '-Xlint' by default |
Jan Lahoda |
Oracle |
(same) |
(same) |
| 2026/09/05 01:07 |
P4 |
core-libs/java.lang.foreign |
JDK-8391868 |
disable java/foreign/TestConfinedSegmentPoolDefensiveRelease.java with zero |
Daniel Daugherty |
Oracle |
(same) |
(same) |
| 2026/09/04 19:18 |
P5 |
hotspot/svc-agent |
JDK-8391495 |
Apply JDK-8370201 to serviceability/sa/sadebugd/DebugdConnectTest.java |
Fairoz Matte |
Oracle |
(same) |
(same) |
| 2026/09/04 17:17 |
P2 |
tools/javac |
JDK-8388329 |
Forward variable access in strict initializers bypass DA |
Maurizio Cimadamore |
Oracle |
(same) |
(same) |
| 2026/09/04 15:43 |
P3 |
hotspot/compiler |
JDK-8389912 |
[REDO] Regression >6% on Crypto-MLDSA.sign on x64 |
Derek White |
Intel |
(same) |
(same) |
| 2026/09/04 15:28 |
P4 |
hotspot/compiler |
JDK-8391442 |
Test compiler/c1/CanonicalizeArrayLength.java is timing out with VerifyOops |
Vladimir Kozlov |
Oracle |
(same) |
(same) |
| 2026/09/04 15:00 |
P3 |
core-libs/java.lang.foreign |
JDK-8391831 |
MemorySegment.asOverlappingSlice() fails for enclosed segment |
Per-Ake Minborg |
Oracle |
(same) |
(same) |
| 2026/09/04 13:07 |
P4 |
hotspot/gc |
JDK-8391679 |
G1: Rename G1CSetCandidateGroup* to G1CardSetGroup* |
Thomas Schatzl |
Oracle |
(same) |
(same) |
| 2026/09/04 13:07 |
P4 |
hotspot/gc |
JDK-8391753 |
G1: Fix groud-id typo in remembered set size message |
Thomas Schatzl |
Oracle |
(same) |
(same) |
| 2026/09/04 09:05 |
P4 |
hotspot/compiler |
JDK-8391808 |
Problemlist compiler/vectorapi/AllBitsSetVectorMatchRuleTest.java |
Manuel Hässig |
Oracle |
(same) |
(same) |
| 2026/09/04 08:35 |
P4 |
hotspot/runtime |
JDK-8390970 |
Remove ObjectMonitor::_metadata |
Fredrik Bredberg |
Oracle |
(same) |
(same) |
| 2026/09/04 08:08 |
P4 |
core-libs/java.lang |
JDK-8391169 |
(process) Stale comments after JDK-8357089 |
Thomas Stuefe |
Red Hat |
(same) |
(same) |
| 2026/09/04 07:36 |
P4 |
hotspot/runtime |
JDK-8385564 |
Replace VMA linked list with hashtable in MemBaseline |
Johan Sjölen |
Oracle |
(same) |
(same) |
| 2026/09/04 07:32 |
P4 |
hotspot/compiler |
JDK-8389218 |
C2: assert(false) failed: PhaseCCP not at fixpoint: analysis result may be unsound for CmpU |
Guanqiang Han |
Independent |
(same) |
(same) |
| 2026/09/04 07:30 |
P4 |
hotspot/runtime |
JDK-8391451 |
Various ErrorHandling - related hotspot tests fail after JDK-8379453 |
Matthias Baesken |
SAP |
(same) |
(same) |
| 2026/09/04 06:47 |
P4 |
hotspot/compiler |
JDK-8385698 |
[Valhalla] C1 omits type profiling for null-free types |
Manuel Hässig |
Oracle |
(same) |
(same) |
| 2026/09/04 06:47 |
P4 |
hotspot/compiler |
JDK-8391605 |
Record jfr stubs to aot code cache |
Kuai Wei |
Alibaba |
(same) |
(same) |
| 2026/09/04 02:28 |
P4 |
hotspot/compiler |
JDK-8382713 |
[VectorAPI] Perform late inlining of failed vector intrinsics |
Jatin Bhateja |
Intel |
(same) |
(same) |
| 2026/09/04 01:18 |
P4 |
hotspot/runtime |
JDK-8391599 |
Remove runtime/cds/appcds/aotCode/AOTCodeFlags.java from problem list |
Hao Sun |
Nvidia |
(same) |
(same) |
| 2026/09/04 01:15 |
P4 |
hotspot/runtime |
JDK-8391600 |
[TESTBUG] Improve runtime/cds/TestDefaultArchiveLoading.java to check --enable-preview from test.vm.opts |
Hao Sun |
Nvidia |
(same) |
(same) |
| 2026/09/04 00:01 |
P4 |
hotspot/svc-agent |
JDK-8388696 |
DW_CFA_offset_extended and DW_CFA_restore_extended are not supported in SA |
Yasumasa Suenaga |
NTT DATA |
(same) |
(same) |
| 2026/09/03 23:58 |
P4 |
hotspot/svc-agent |
JDK-8390442 |
Heap dump generated by SA cannot be parsed on MAT |
Yasumasa Suenaga |
NTT DATA |
(same) |
(same) |
| 2026/09/03 19:30 |
P4 |
client-libs/java.awt |
JDK-8391786 |
ProblemList java/awt/FullScreen/SetFSWindow/FSFrame.java#default on macosx-aarch64 |
Daniel Daugherty |
Oracle |
(same) |
(same) |
| 2026/09/03 16:53 |
P4 |
tools/javac |
JDK-8389044 |
javac crashes with StackOverflowError during type erasure of recursively bounded array type parameter (U extends U[]) |
Vicente Arturo Romero Zaldivar |
Oracle |
(same) |
(same) |
| 2026/09/03 16:27 |
P4 |
core-libs |
JDK-8391307 |
VectorAPI: Floating-point test operators throw AssertionError on integral vectors |
Xueming Shen |
Oracle |
(same) |
(same) |
| 2026/09/03 16:12 |
P3 |
hotspot/runtime |
JDK-8387462 |
ClassFileParser::verify_legal_field_modifiers has out-of-date comment about strict-init field |
Matias Saavedra Silva |
Oracle |
(same) |
(same) |
| 2026/09/03 16:09 |
P3 |
hotspot/runtime |
JDK-8390256 |
JEP 539: Verifier accepts early_larval_frame whose wrapped base has no uninitializedThis |
Matias Saavedra Silva |
Oracle |
(same) |
(same) |
| 2026/09/03 15:31 |
P4 |
hotspot/compiler |
JDK-8391296 |
C2: Assert in PhaseIdealLoop::intrinsify_fill too strong with compact object headers |
Frederic Parain |
Oracle |
(same) |
(same) |
| 2026/09/03 14:12 |
P4 |
hotspot/compiler |
JDK-8391343 |
[PPC64] Share AES round key sequences between block and CBC stubs |
Suchismith Roy |
IBM |
(same) |
(same) |
| 2026/09/03 12:40 |
P3 |
core-libs/java.lang.foreign |
JDK-8385697 |
Add a Pooled Confined Arena |
Per-Ake Minborg |
Oracle |
(same) |
(same) |
| 2026/09/03 12:30 |
P4 |
hotspot/compiler |
JDK-8391466 |
RISC-V: Remove unreachable non-acquiring CAS/GetAndSet/GetAndAdd match rules |
Gui Cao |
Independent |
(same) |
(same) |
| 2026/09/03 12:30 |
P4 |
hotspot/compiler |
JDK-8391515 |
AArch64: Remove unreachable non-acquiring CAS/GetAndSet/GetAndAdd match rules |
Gui Cao |
Independent |
(same) |
(same) |
| 2026/09/03 11:39 |
P3 |
hotspot/gc |
JDK-8391646 |
Shenandoah: Mach node analysis should not strip extra bits |
Aleksey Shipilev |
Amazon |
(same) |
(same) |
| 2026/09/03 11:32 |
P4 |
hotspot/compiler |
JDK-8391749 |
Disable VerifyOops in compiler/c1/CanonicalizeArrayLength.java |
Christian Hagedorn |
Oracle |
(same) |
(same) |
| 2026/09/03 11:18 |
P4 |
hotspot/compiler |
JDK-8391750 |
Disable StressVerifyMeetJoin in CTW until JDK-8391748 is fixed |
Tobias Hartmann |
Oracle |
(same) |
(same) |
| 2026/09/03 10:50 |
P4 |
hotspot/compiler |
JDK-8391643 |
C2: Missing ResourceMark when allocating GrowableArray in type.cpp |
Quan Anh Mai |
Independent |
(same) |
(same) |
| 2026/09/03 09:21 |
P3 |
hotspot/jvmti |
JDK-8387648 |
Return the OPAQUE_FRAME from JVMTI ForceEarlyReturn from class init or constructor of a class with strictly-initialized static or instance fields |
Alan Bateman |
Oracle |
(same) |
(same) |
| 2026/09/03 08:30 |
P4 |
hotspot/gc |
JDK-8391194 |
Shenandoah: Rebalance marking queues upfront |
Aleksey Shipilev |
Amazon |
(same) |
(same) |
| 2026/09/03 08:30 |
P4 |
hotspot/runtime |
JDK-8391656 |
MethodHandles::print_as_basic_type_signature_on has unreachable code |
sovtouch |
Unknown: @altlinux.org |
(same) |
(same) |
| 2026/09/03 08:17 |
P4 |
hotspot/compiler |
JDK-8391629 |
RISC-V: Avoid unnecessary address materialization for loads and stores |
Gui Cao |
Independent |
(same) |
(same) |
| 2026/09/03 07:28 |
P4 |
hotspot/runtime |
JDK-8391467 |
Show InstallationType in Windows System info |
Matthias Baesken |
SAP |
(same) |
(same) |
| 2026/09/03 07:24 |
P3 |
hotspot/compiler |
JDK-8388592 |
C2: ShouldNotReachHere in loop stripmining scheduling verification |
devnexen |
Independent |
(same) |
(same) |
| 2026/09/03 07:12 |
P4 |
hotspot/compiler |
JDK-8388363 |
[Valhalla] C1: Constant fold substitutability check with non-value objects |
Manuel Hässig |
Oracle |
(same) |
(same) |
| 2026/09/03 05:18 |
P4 |
hotspot/runtime |
JDK-8391612 |
Use heapOopSize consistently in AOT |
aivy |
Unknown |
(same) |
(same) |
| 2026/09/03 05:15 |
P4 |
hotspot/runtime |
JDK-8380647 |
ASAN: heap-buffer-overflow in ArchiveBuilder::make_shallow_copy |
Ioi Lam |
Oracle |
(same) |
(same) |
| 2026/09/03 03:45 |
P4 |
hotspot/gc |
JDK-8391716 |
ProblemList gc/metaspace/TestMetaspaceFirstGC.java |
David Holmes |
Oracle |
(same) |
(same) |
| 2026/09/02 23:29 |
P4 |
core-libs/java.lang.invoke |
JDK-8391593 |
Typos and omissions in VarHandle test templates |
Chen Liang |
Oracle |
(same) |
(same) |
| 2026/09/02 22:43 |
P4 |
hotspot/compiler |
JDK-8384411 |
Cleanup BarrierSetC2 interface now that Shenandoah, G1 and ZGC use late-barrier expansion |
Cesar Soares |
Amazon |
(same) |
(same) |
| 2026/09/02 22:42 |
P4 |
hotspot/compiler |
JDK-8379228 |
C2: Missing trailing_expanded_array_copy flag on MemBar after clone expansion |
Cesar Soares |
Amazon |
(same) |
(same) |
| 2026/09/02 22:40 |
P4 |
hotspot/compiler |
JDK-8386284 |
Test CompileLevelPrintTest.java fails with RuntimeException: Compiler queue is still not empty |
Igor Veresov |
Oracle |
(same) |
(same) |
| 2026/09/02 22:16 |
P4 |
performance/libraries |
JDK-8388706 |
PolynomialP256Bench::benchAssign regression after JDK-8355216 |
semery |
Unknown |
(same) |
(same) |
| 2026/09/02 21:03 |
P1 |
hotspot/runtime |
JDK-8391694 |
[BACKOUT] fixes for JDK-8391683, JDK-8391683, and JDK-8380425 |
Daniel Daugherty |
Oracle |
(same) |
(same) |
| 2026/09/02 21:00 |
P4 |
hotspot/runtime |
JDK-8380847 |
Versioned class loaded from multi-release jar file is not cached |
Matias Saavedra Silva |
Oracle |
(same) |
(same) |
| 2026/09/02 20:32 |
P5 |
hotspot/compiler |
JDK-8391496 |
nmethod copy constructor incorrectly clears _oops_do_mark_nmethods |
Chad Rakoczy |
Amazon |
(same) |
(same) |
| 2026/09/02 20:28 |
P3 |
security-libs/java.security |
JDK-8370245 |
Change default PKCS12 mac algorithm to PBMAC1 |
Mark Powers |
Oracle |
(same) |
(same) |
| 2026/09/02 18:30 |
P2 |
hotspot/runtime |
JDK-8391683 |
Gtest failure with markWord is_unlocked |
Coleen Phillimore |
Oracle |
(same) |
(same) |
| 2026/09/02 18:24 |
P4 |
hotspot/gc |
JDK-8391488 |
GenShen: Remembered set scan should use compact-object-header aware accessors |
William Kemper |
Amazon |
(same) |
(same) |
| 2026/09/02 17:43 |
P4 |
hotspot/gc |
JDK-8208250 |
vmTestbase:metaspace/gc/firstGC* tests are outdated |
shiv.shah |
Oracle |
(same) |
(same) |
| 2026/09/02 17:41 |
P4 |
hotspot/gc |
JDK-8391312 |
GenShen: Avoid testing region affiliation when the region's index is already available |
pfontanilla |
Unknown |
(same) |
(same) |
| 2026/09/02 17:07 |
P4 |
hotspot/gc |
JDK-8391062 |
Shenandoah: Drain overflow queues eagerly |
Aleksey Shipilev |
Amazon |
(same) |
(same) |
| 2026/09/02 16:06 |
P2 |
hotspot/runtime |
JDK-8391667 |
Fix for removed has_no_hash() method |
Simon Tooke |
Red Hat |
(same) |
(same) |
| 2026/09/02 15:36 |
P4 |
hotspot/jvmti |
JDK-8295169 |
Simplify Suspend/Resume and other nsk jvmti tests using checkStatus to sync |
shiv.shah |
Oracle |
(same) |
(same) |
| 2026/09/02 14:56 |
P4 |
hotspot/runtime |
JDK-8380425 |
os::print_location should handle markword printing with COH |
Simon Tooke |
Red Hat |
(same) |
(same) |
| 2026/09/02 13:52 |
P4 |
core-libs/java.lang.classfile |
JDK-8389843 |
Synchronize ClassFile API verifier up to jdk-28+11 |
Chen Liang |
Oracle |
(same) |
(same) |
| 2026/09/02 12:23 |
P4 |
hotspot/compiler |
JDK-8391338 |
[IR Framework] Various minor cleanups |
Christian Hagedorn |
Oracle |
(same) |
(same) |
| 2026/09/02 12:04 |
P2 |
hotspot/gc |
JDK-8391477 |
G1: CSet candidate groups selected for optional collection are not sorted |
Ivan Walulya |
Oracle |
(same) |
(same) |
| 2026/09/02 11:56 |
P4 |
hotspot/compiler |
JDK-8390778 |
[PPC] : stubgen stubs using incorrect StubCodeMark constructor |
Varada M |
IBM |
(same) |
(same) |
| 2026/09/02 11:48 |
P4 |
hotspot/compiler |
JDK-8376286 |
VM asserts with "assert(false) failed: Possible safepoint reached by thread that does not allow it" when running with -XX:+ExitOnFullCodeCache |
ozanctn |
Amazon |
(same) |
(same) |
| 2026/09/02 11:45 |
P4 |
hotspot/runtime |
JDK-8376668 |
Consolidate common logic in FieldLayoutBuilder field sorting methods |
Casper Norrbin |
Oracle |
(same) |
(same) |
| 2026/09/02 11:22 |
P4 |
hotspot/compiler |
JDK-8389108 |
RISC-V: Use shift pairs for logical right shift and mask patterns |
Gui Cao |
Independent |
(same) |
(same) |
| 2026/09/02 10:48 |
P4 |
core-libs/java.nio |
JDK-8391574 |
(fs) Files.createTempFile should reject prefix with root component (win) |
Alan Bateman |
Oracle |
(same) |
(same) |
| 2026/09/02 10:04 |
P4 |
hotspot/compiler |
JDK-8391476 |
[Valhalla] PPC64 C1 stubs Load/StoreFlattenedArrayStub require sign extend to pass the index |
Martin Doerr |
SAP |
(same) |
(same) |
| 2026/09/02 08:38 |
P4 |
hotspot/gc |
JDK-8391350 |
G1: Rename G1HeapRegionRemset::code_roots_list* methods |
Thomas Schatzl |
Oracle |
(same) |
(same) |
| 2026/09/02 08:26 |
P4 |
hotspot/gc |
JDK-8391522 |
G1: Double counting of embedded member in G1CodeRootSetHashTable::mem_size() |
Thomas Schatzl |
Oracle |
(same) |
(same) |
| 2026/09/02 07:54 |
P4 |
hotspot/runtime |
JDK-8391176 |
Cleanup the markWord locking bits |
Axel Boldt-Christmas |
Oracle |
(same) |
(same) |
| 2026/09/02 07:49 |
P4 |
core-libs/java.net |
JDK-8384192 |
java/net/httpclient/IdleConnectionTimeoutTest.java fails with AssertionFailedError: idleConnectionTimeoutEvent was not expected but occurred ==> expected: <200> but was: <400> |
Volkan Yazici |
Oracle |
(same) |
(same) |
| 2026/09/02 07:42 |
P4 |
core-libs/java.lang |
JDK-8391474 |
[windows] TimeZone_md.c some RegCloseKey calls on hSubKey are missing |
Matthias Baesken |
SAP |
(same) |
(same) |
| 2026/09/02 07:05 |
P4 |
hotspot/compiler |
JDK-8391452 |
C2: Add StressVerifyMeetJoin to CtwRunner |
Quan Anh Mai |
Independent |
(same) |
(same) |
| 2026/09/02 06:48 |
P4 |
hotspot/gc |
JDK-8391349 |
G1: Clean up G1HeapRegionRemSet files |
Thomas Schatzl |
Oracle |
(same) |
(same) |
| 2026/09/02 05:21 |
P2 |
hotspot/compiler |
JDK-8391280 |
[Valhalla] PhaseMacroExpand::expand_flatarraycheck_node asserts with "Mixing array and klass inputs" |
Tobias Hartmann |
Oracle |
(same) |
(same) |
| 2026/09/02 04:21 |
P4 |
hotspot/compiler |
JDK-8390818 |
Set UseFPUForSpilling default off on AMD Zen3+ targets |
Jatin Bhateja |
Intel |
(same) |
(same) |
| 2026/09/02 01:03 |
P4 |
hotspot/compiler |
JDK-8391236 |
RISC-V: Save a jump in string_indexof_char intrinsic |
Dingli Zhang |
Independent |
(same) |
(same) |
| 2026/09/02 00:17 |
P3 |
hotspot/runtime |
JDK-8390604 |
Speed up native --> Java transitions |
Dean Long |
Oracle |
(same) |
(same) |
| 2026/09/02 00:14 |
P4 |
hotspot/gc |
JDK-8391311 |
GenShen: Avoid double region iteration in final mark |
pfontanilla |
Unknown |
(same) |
(same) |
| 2026/09/01 23:30 |
P4 |
hotspot/svc-agent |
JDK-8390689 |
TestHeapDumpForInvokeDynamic fails HPROF verification when LingeredApp runs on a virtual thread |
shiv.shah |
Oracle |
(same) |
(same) |
| 2026/09/01 19:57 |
P3 |
core-libs/java.lang.invoke |
JDK-8388448 |
VarHandle can set @NullRestricted static field to null |
Chen Liang |
Oracle |
(same) |
(same) |
| 2026/09/01 19:17 |
P4 |
core-libs/java.lang |
JDK-8391478 |
Remove java.lang.runtime.Carriers |
Daniel Jelinski |
Oracle |
(same) |
(same) |
| 2026/09/01 18:54 |
P4 |
core-libs/java.lang.foreign |
JDK-8390175 |
FFM upcallstub can skip reinit_heapbase() right before restore_callee_saved_registers |
Xin Liu |
Amazon |
(same) |
(same) |
| 2026/09/01 16:30 |
P5 |
hotspot/compiler |
JDK-8389730 |
[Valhalla] Fix two masked inverted conditions in LibraryCallKit::should_bail_out_on_non_ref_arrays() |
Christian Hagedorn |
Oracle |
(same) |
(same) |
| 2026/09/01 16:00 |
P4 |
tools/javac |
JDK-8389058 |
javac crashes with StackOverflowError in Resolve.findInheritedMemberType when a class illegally extends itself and references a member type |
Vicente Arturo Romero Zaldivar |
Oracle |
(same) |
(same) |
| 2026/09/01 15:53 |
P4 |
infrastructure/build |
JDK-8388932 |
Enable 'local variable is initialized but not referenced' warnings with MSVC in JDK |
Matthias Baesken |
SAP |
(same) |
(same) |
| 2026/09/01 15:40 |
P4 |
hotspot/gc |
JDK-8391560 |
Shenandoah: JDK-8391299 broke some log tests |
Aleksey Shipilev |
Amazon |
(same) |
(same) |
| 2026/09/01 15:20 |
P4 |
security-libs/java.security |
JDK-8387949 |
Implementation of PEM Encodings of Cryptographic Objects |
Anthony Scarpino |
Oracle |
(same) |
(same) |
| 2026/09/01 15:14 |
P4 |
hotspot/compiler |
JDK-8390159 |
[ARM32] Native ARM32 build hangs in COMPILE_CREATE_SYMBOLS |
Boris Ulasevich |
BellSoft |
(same) |
(same) |
| 2026/09/01 14:18 |
P3 |
hotspot/jfr |
JDK-8387756 |
JFR: subtle issue related to class loading constraints and early unwinds can lead to crashes and data corruption |
Markus Grönlund |
Oracle |
(same) |
(same) |
| 2026/09/01 10:48 |
P3 |
hotspot/runtime |
JDK-8391450 |
Aarch64: Remove the movk narrowKlass mode |
Thomas Stuefe |
Red Hat |
(same) |
(same) |
| 2026/09/01 09:37 |
P4 |
hotspot/compiler |
JDK-8390121 |
C2: StressBailout and VerifyIterativeGVN lead to nullptr push to igvn worklist |
aivy |
Unknown |
(same) |
(same) |
| 2026/09/01 09:26 |
P4 |
hotspot/compiler |
JDK-8387457 |
Test compiler/c2/Test6857159.java times out |
Tobias Hartmann |
Oracle |
(same) |
(same) |
| 2026/09/01 08:46 |
P4 |
hotspot/compiler |
JDK-8390813 |
C2: Wrong entries in adlc commutative op lists |
Dingli Zhang |
Independent |
(same) |
(same) |
| 2026/09/01 08:10 |
P4 |
hotspot/gc |
JDK-8371327 |
G1: Replace FromCardCache with thread-local per-card cache |
Ivan Walulya |
Oracle |
(same) |
(same) |
| 2026/09/01 07:43 |
P4 |
client-libs/javax.sound |
JDK-8391186 |
Avoid unused variables in libjsound |
Matthias Baesken |
SAP |
(same) |
(same) |
| 2026/09/01 07:30 |
P4 |
hotspot/gc |
JDK-8391351 |
G1: G1HeapRegionRemSet double counts code roots in mem_size() |
Thomas Schatzl |
Oracle |
(same) |
(same) |
| 2026/09/01 06:56 |
P4 |
hotspot/runtime |
JDK-8391518 |
Un-ProblemList runtime/Thread/TestAlwaysPreTouchStacks.java on macOS |
David Holmes |
Oracle |
(same) |
(same) |
| 2026/09/01 05:56 |
P4 |
hotspot/gc |
JDK-8391299 |
Shenandoah: Improve GC trigger messages |
Aleksey Shipilev |
Amazon |
(same) |
(same) |
| 2026/09/01 03:26 |
P4 |
hotspot/compiler |
JDK-8391439 |
C2: Add StressVerifyMeetJoin option |
Quan Anh Mai |
Independent |
(same) |
(same) |
| 2026/09/01 02:50 |
P4 |
tools/launcher |
JDK-8353495 |
tools/launcher/ExecutionEnvironment.java fails on RISC-V when run by qemu |
lilijuan |
Independent |
(same) |
(same) |
| 2026/09/01 01:48 |
P4 |
hotspot/jvmti |
JDK-8391509 |
Add serviceability/jvmti/RedefineClasses/RedefineRunningMethodsWithBacktrace.java to the ProblemList for Windows-x64 |
David Holmes |
Oracle |
(same) |
(same) |
| 2026/09/01 00:10 |
P3 |
tools/jpackage |
JDK-8391473 |
jpackage ignores exit code of the "dpkg-deb" command |
Alexey Semenyuk |
Oracle |
(same) |
(same) |
| 2026/08/31 19:53 |
P4 |
tools/jpackage |
JDK-8391423 |
jpackage DEB packaging tests fail on RPM-based Linux |
Alexey Semenyuk |
Oracle |
(same) |
(same) |
| 2026/08/31 19:30 |
P4 |
hotspot/compiler |
JDK-8390471 |
[Valhalla] "assert(_sig_cc == nullptr) failed: Already initialized" with -XX:+TestAOTAdapterLinkFailure |
Frederic Parain |
Oracle |
(same) |
(same) |
| 2026/08/31 17:13 |
P4 |
infrastructure/build |
JDK-8348737 |
PlatformProperties always triggers rebuild when cross compiling |
benshuai5d |
Independent |
(same) |
(same) |
| 2026/08/31 16:33 |
P5 |
core-libs/java.nio |
JDK-8391445 |
(dc) DatagramChannel.open fails with Linux build of JDK on BSD |
Alan Bateman |
Oracle |
(same) |
(same) |
| 2026/08/31 13:19 |
P4 |
hotspot/compiler |
JDK-8391431 |
RISC-V: AOTCodeTest.java fails after JDK-8388288 with fastdebug |
Gui Cao |
Independent |
(same) |
(same) |
| 2026/08/31 13:02 |
P3 |
hotspot/jfr |
JDK-8391298 |
JFR: Overscoping JfrEpochShift_lock |
Markus Grönlund |
Oracle |
(same) |
(same) |
| 2026/08/31 12:59 |
P4 |
tools/jpackage |
JDK-8371868 |
Use desktop-file-validate command to validate desktop entry files created by jpackage |
Alexey Semenyuk |
Oracle |
(same) |
(same) |
| 2026/08/31 09:07 |
P4 |
hotspot/runtime |
JDK-8387276 |
Replace LinkedList with GrowableArray in shared trampolines |
Johan Sjölen |
Oracle |
(same) |
(same) |
| 2026/08/31 08:57 |
P4 |
hotspot/runtime |
JDK-8387971 |
Minor comment typos "successfull" |
Casper Norrbin |
Oracle |
(same) |
(same) |
| 2026/08/31 08:10 |
P3 |
hotspot/compiler |
JDK-8338094 |
C1: assert(result->covers(op_id, mode)) failed: op_id not covered by interval |
Roberto Castaneda Lozano |
Oracle |
(same) |
(same) |
| 2026/08/31 07:02 |
P4 |
core-libs/java.net |
JDK-8390064 |
Test sun/net/www/http/HttpClient/IsAvailable.java fails intermittently with AssertionFailedError: Connection over closed socket should not be available ==> expected: but was: |
107186291+dlwldnjs1009 |
Independent |
(same) |
(same) |
| 2026/08/31 06:58 |
P4 |
client-libs/java.awt |
JDK-8389901 |
[windows] CCombinedSegTable::GetEUDCFileName from awt_Font.cpp seems to miss RegCloseKey calls |
Matthias Baesken |
SAP |
(same) |
(same) |
| 2026/08/31 06:11 |
P4 |
hotspot/compiler |
JDK-8390782 |
TestExpressions.java does not correctly handle NaNs in Float16 reduction result |
Jatin Bhateja |
Intel |
(same) |
(same) |
| 2026/08/31 05:33 |
P3 |
hotspot/compiler |
JDK-8387799 |
Infinite attempts of post-parse call devirtualization on nullable receiver |
Tobias Hartmann |
Oracle |
(same) |
(same) |
| 2026/08/31 01:20 |
P3 |
client-libs/javax.swing |
JDK-8388884 |
[macOS] Swing Aqua L&F text components enable drag by default |
Prasanta Sadhukhan |
Oracle |
(same) |
(same) |
| 2026/08/29 16:19 |
P3 |
hotspot/jfr |
JDK-8391075 |
'jfr assemble' doesn't handle unfinished files |
Erik Gahlin |
Oracle |
(same) |
(same) |
| 2026/08/29 08:32 |
P4 |
hotspot/compiler |
JDK-8391333 |
RISC-V: Use zext.h and zext.w for AndL with 16-bit and 32-bit mask |
Gui Cao |
Independent |
(same) |
(same) |
| 2026/08/29 03:14 |
P4 |
hotspot/compiler |
JDK-8391330 |
RISC-V: JSR166TestCase.java fails after JDK-8369828 |
Gui Cao |
Independent |
(same) |
(same) |
| 2026/08/28 22:06 |
P4 |
core-libs/java.lang |
JDK-8384108 |
Test Object.clone on a value object read from a flattened field |
shiv.shah |
Oracle |
(same) |
(same) |
| 2026/08/28 18:22 |
P4 |
core-libs |
JDK-8389844 |
VectorAPI: VectorOperators.ZOMO specifies "Integral only", inconsistency between spec vs impl |
Xueming Shen |
Oracle |
(same) |
(same) |
| 2026/08/28 16:37 |
P5 |
core-libs/java.util |
JDK-8391222 |
Clarify the explanation of line terminator sequences in java.util.Properties.load(Reader) |
Naoto Sato |
Oracle |
(same) |
(same) |
| 2026/08/28 16:19 |
P4 |
infrastructure |
JDK-8391224 |
Fix Amazon copyright in various files |
Sergey Bylokhov |
Amazon |
(same) |
(same) |
| 2026/08/28 15:56 |
P4 |
hotspot/gc |
JDK-8391235 |
Zero build fails due to GCC-15.2.0 stringop-overflow warning after JDK-8390310 |
William Kemper |
Amazon |
(same) |
(same) |
| 2026/08/28 12:48 |
P4 |
hotspot/runtime |
JDK-8384133 |
StringTableCorruptionTest should keep Strings alive to reliably trigger |
Aleksey Shipilev |
Amazon |
(same) |
(same) |
| 2026/08/28 12:39 |
P4 |
core-libs/java.nio |
JDK-8391295 |
Net.c and other native code cleanup |
Alan Bateman |
Oracle |
(same) |
(same) |
| 2026/08/28 12:37 |
P4 |
hotspot/gc |
JDK-8390948 |
G1: Simplify the selection logic in G1CollectionSet::select_candidates_from_marking() |
Thomas Schatzl |
Oracle |
(same) |
(same) |
| 2026/08/28 11:31 |
P4 |
hotspot/compiler |
JDK-8374574 |
Enable AES CBC intrinsic for PowerPC |
Suchismith Roy |
IBM |
(same) |
(same) |
| 2026/08/28 11:06 |
P4 |
hotspot/compiler |
JDK-8385696 |
Remove unnecessary ICache flush calls before code copy operations |
David Briemann |
SAP |
(same) |
(same) |
| 2026/08/28 09:59 |
P4 |
hotspot/gc |
JDK-8390935 |
G1: Retained regions do not get an efficiency assigned |
Thomas Schatzl |
Oracle |
(same) |
(same) |
| 2026/08/28 09:54 |
P4 |
hotspot/gc |
JDK-8390661 |
gc/TestGCALotAtSafepoints sub-tests times out |
Thomas Schatzl |
Oracle |
(same) |
(same) |
| 2026/08/28 09:36 |
P4 |
hotspot/runtime |
JDK-8391174 |
Simplify `identity_hash` after UseObjectMonitorTable removal |
Axel Boldt-Christmas |
Oracle |
(same) |
(same) |
| 2026/08/28 09:28 |
P2 |
hotspot/compiler |
JDK-8391178 |
TypeAryPtr::narrow_size_type returns incorrect type for flat arrays |
Tobias Hartmann |
Oracle |
(same) |
(same) |
| 2026/08/28 09:21 |
P4 |
hotspot/compiler |
JDK-8391171 |
Enable TestVectorBroadcastTransforms.java IR tests for RISC-V |
lilijuan |
Independent |
(same) |
(same) |
| 2026/08/28 08:05 |
P4 |
hotspot/gc |
JDK-8387026 |
Shenandoah: Cleanup and outline native barriers |
Aleksey Shipilev |
Amazon |
(same) |
(same) |
| 2026/08/28 07:04 |
P3 |
tools/launcher |
JDK-8391315 |
[BACKOUT] Not all --long-options accept space as seperator |
Jaikiran Pai |
Oracle |
(same) |
(same) |
| 2026/08/28 06:49 |
P4 |
core-svc/java.lang.management |
JDK-8340088 |
Stack tracing tests of sleeping thread should be more resilient to code changes |
shiv.shah |
Oracle |
(same) |
(same) |
| 2026/08/28 05:50 |
P4 |
hotspot/compiler |
JDK-8389669 |
Add a fuzzer for the C2 vector logic cone (MacroLogicV) optimization |
Jatin Bhateja |
Intel |
(same) |
(same) |
| 2026/08/28 02:44 |
P4 |
hotspot/compiler |
JDK-8388288 |
RISC-V: Use Zicond instruction for encode/decode heap oop |
Kuai Wei |
Alibaba |
(same) |
(same) |
| 2026/08/27 21:01 |
P4 |
infrastructure/build |
JDK-8386092 |
Implement JEP 541: Deprecate the macOS/x64 Port for Removal |
Mikael Vidstedt |
Oracle |
(same) |
(same) |
| 2026/08/27 19:27 |
P4 |
tools/jpackage |
JDK-8388795 |
Add --app-resources CLI option to copy files and directories into the application resources directory |
Alexander Matveev |
Oracle |
(same) |
(same) |
| 2026/08/27 15:26 |
P3 |
security-libs/javax.crypto |
JDK-8388138 |
Emit runtime warning for the RSA/ECB/PKCS1Padding Cipher |
Mark Powers |
Oracle |
(same) |
(same) |
| 2026/08/27 15:04 |
P3 |
hotspot/runtime |
JDK-8388265 |
early_larval StackMapTable frames not rejected for non-preview class files |
Matias Saavedra Silva |
Oracle |
(same) |
(same) |
| 2026/08/27 13:11 |
P4 |
hotspot/runtime |
JDK-8391220 |
Rewriter has unused _invokedynamic_references_map |
Coleen Phillimore |
Oracle |
(same) |
(same) |
| 2026/08/27 12:15 |
P2 |
core-libs/java.util.concurrent |
JDK-8390870 |
ForkJoinTask.get(long, TimeUnit) stuck in busy-wait with another waiter |
Fabian Meumertzheim |
Independent |
(same) |
(same) |
| 2026/08/27 12:03 |
P4 |
hotspot/runtime |
JDK-8369828 |
Generalize share/utilities/bytes.hpp |
Coleen Phillimore |
Oracle |
(same) |
(same) |
| 2026/08/27 11:58 |
P3 |
hotspot/compiler |
JDK-8375639 |
C2: transformation to counted loop in Stemmer.java fails with StressIncrementalInlining |
Roland Westrelin |
Red Hat |
(same) |
(same) |
| 2026/08/27 11:53 |
P4 |
hotspot/compiler |
JDK-8390825 |
C1: -XX:-GenerateArrayStoreCheck is unsafe and should be removed |
gaoxiang |
Independent |
(same) |
(same) |
| 2026/08/27 10:43 |
P4 |
hotspot/gc |
JDK-8390938 |
Shenandoah: Outside-of-cycle cancellation misses GC ID log |
Aleksey Shipilev |
Amazon |
(same) |
(same) |
| 2026/08/27 09:29 |
P4 |
hotspot/gc |
JDK-8390930 |
G1: Clearing card table worker estimation overflows on large heaps |
Thomas Schatzl |
Oracle |
(same) |
(same) |
| 2026/08/27 09:23 |
P3 |
hotspot/compiler |
JDK-8388369 |
C2: VectorAPI: Potential null pointer dereference in LibraryCallKit::inline_vector_test |
Quan Anh Mai |
Independent |
(same) |
(same) |
| 2026/08/27 09:18 |
P3 |
hotspot/compiler |
JDK-8390617 |
[REDO] C2: Fix the memory around some intrinsics nodes |
Quan Anh Mai |
Independent |
(same) |
(same) |
| 2026/08/27 09:17 |
P3 |
infrastructure/build |
JDK-8390947 |
C2: GTest test_typejavaptr.cpp intermittently fails with assert(ptr2 == TypePtr::Constant || ptr2 == TypePtr::NotNull || ptr2 == TypePtr::BotPTR) failed: unexpected ptr: 0 |
Quan Anh Mai |
Independent |
(same) |
(same) |
| 2026/08/27 08:04 |
P4 |
hotspot/compiler |
JDK-8388858 |
C2: Add UseLoopLimitCheckPredicate and UseParsePredicates flags |
Christian Hagedorn |
Oracle |
(same) |
(same) |
| 2026/08/27 07:47 |
P4 |
tools/javac |
JDK-8387668 |
javac should warn on use of value classes |
Jan Lahoda |
Oracle |
(same) |
(same) |
| 2026/08/27 07:13 |
P4 |
tools/jlink |
JDK-8391170 |
JLinkToolProviderTest fails after JDK-8390505 when using configure --enable-linkable-runtime |
dbalek |
Unknown |
(same) |
(same) |
| 2026/08/27 05:41 |
P4 |
hotspot/svc-agent |
JDK-8390619 |
Validate sender SP before to return sender frame in LinuxAMD64CFrame.java |
Yasumasa Suenaga |
NTT DATA |
(same) |
(same) |
| 2026/08/27 05:39 |
P3 |
hotspot/compiler |
JDK-8391160 |
C2 uses a raw base for an oop arraycopy destination |
Tobias Hartmann |
Oracle |
(same) |
(same) |
| 2026/08/27 05:36 |
P4 |
hotspot/runtime |
JDK-8376968 |
Signal handling: JNI_FastGetField stub search may be invoked too eagerly |
Thomas Stuefe |
Red Hat |
(same) |
(same) |
| 2026/08/27 01:41 |
P4 |
security-libs/java.security |
JDK-8385672 |
SunEC NONEwithECDSA Signature.update(ByteBuffer) rejects an input of exactly 64 bytes, while update(byte[]) accepts it |
Valerie Peng |
Oracle |
(same) |
(same) |
| 2026/08/26 21:27 |
P3 |
hotspot/compiler |
JDK-8390765 |
[PPC64] AES Crypto intrinsics may access memory beyond the key array |
Martin Doerr |
SAP |
(same) |
(same) |
| 2026/08/26 20:14 |
P4 |
hotspot/gc |
JDK-8390907 |
Genshen: Improve mark loop performance |
William Kemper |
Amazon |
(same) |
(same) |
| 2026/08/26 19:55 |
P2 |
hotspot/compiler |
JDK-8390874 |
MethodData::extra_data_lock memory leak |
John Spurling |
Amazon |
(same) |
(same) |
| 2026/08/26 19:26 |
P4 |
core-svc/debugger |
JDK-8388833 |
Fix JDWP spec w.r.t. setting static final fields and provide warnings about setting final fields |
Chris Plummer |
Oracle |
(same) |
(same) |
| 2026/08/26 17:57 |
P4 |
hotspot/runtime |
JDK-8383246 |
Add relaxed implementations of atomics for Windows/AArch64 |
arane |
Unknown |
(same) |
(same) |
| 2026/08/26 17:25 |
P4 |
hotspot/runtime |
JDK-8383460 |
Replace "sharing" in VM version string with "aot" information |
Ioi Lam |
Oracle |
(same) |
(same) |
| 2026/08/26 17:21 |
P3 |
infrastructure |
JDK-8390906 |
Allow to collect per-test code coverage information |
Aleksandre Iline |
Oracle |
(same) |
(same) |
| 2026/08/26 17:18 |
P4 |
hotspot/runtime |
JDK-8324871 |
Several container tests fail with java.io.tmpdir directory does not exist on linux-aarch64 cgroups-v2 |
shiv.shah |
Oracle |
(same) |
(same) |
| 2026/08/26 17:02 |
P4 |
core-svc/debugger |
JDK-8388530 |
JDI and JDWP spec cleanup to get rid of "if preview is enabled" |
Chris Plummer |
Oracle |
(same) |
(same) |
| 2026/08/26 16:17 |
P2 |
hotspot/compiler |
JDK-8391022 |
[valhalla] Missed ValueObjectMethods class initialization in JVM_IHashCode() |
Vladimir Kozlov |
Oracle |
(same) |
(same) |
| 2026/08/26 15:34 |
P4 |
hotspot/test |
JDK-8390350 |
Remove test-local verbose mode from vmTestbase nsk tests |
shiv.shah |
Oracle |
(same) |
(same) |
| 2026/08/26 15:24 |
P4 |
core-libs/java.lang.foreign |
JDK-8388793 |
Convert test/jdk/java/foreign tests to use JUnit |
Jorn Vernee |
Oracle |
(same) |
(same) |
| 2026/08/26 11:20 |
P4 |
hotspot/gc |
JDK-8300944 |
Test vmTestbase/gc/gctests/WeakReference/weak005/weak005.java fails with "Last weak reference has not been cleared" |
shiv.shah |
Oracle |
(same) |
(same) |
| 2026/08/26 10:57 |
P4 |
hotspot/gc |
JDK-8390940 |
G1: Retained region selection may take more than minimum regions |
Thomas Schatzl |
Oracle |
(same) |
(same) |
| 2026/08/26 10:57 |
P5 |
hotspot/gc |
JDK-8390937 |
G1: Iterating FullCardSet containers in test API only iterates over the first entry |
Thomas Schatzl |
Oracle |
(same) |
(same) |
| 2026/08/26 10:10 |
P4 |
hotspot/gc |
JDK-8391060 |
ZGC: ZMarkingSMR re-orded hazard pointer loads with unlinking results in use after free |
Axel Boldt-Christmas |
Oracle |
(same) |
(same) |
| 2026/08/26 09:59 |
P4 |
tools/javac |
JDK-8387571 |
Typos/grammar/duplicated word/missing hyperlink errors in javac man page |
Jan Lahoda |
Oracle |
(same) |
(same) |
| 2026/08/26 09:06 |
P4 |
hotspot/gc |
JDK-8391044 |
[zgc] unused parameter "node" in z_color and z_uncolor |
Amit Kumar |
IBM |
(same) |
(same) |
| 2026/08/26 08:51 |
P4 |
hotspot/runtime |
JDK-8389938 |
Follow up after removing UseObjectMonitorTable flag |
Fredrik Bredberg |
Oracle |
(same) |
(same) |
| 2026/08/26 08:10 |
P3 |
hotspot/compiler |
JDK-8358889 |
C2 hits assert in backend due to malformed uncommon trap |
Tobias Hartmann |
Oracle |
(same) |
(same) |
| 2026/08/26 07:22 |
P3 |
hotspot/compiler |
JDK-8390337 |
[Valhalla] Missing stopped() check in Parse::acmp_type_check |
Tobias Hartmann |
Oracle |
(same) |
(same) |
| 2026/08/26 06:04 |
P4 |
hotspot/runtime |
JDK-8379453 |
Fix problems with ErrorLogTimeout |
Thomas Stuefe |
Red Hat |
(same) |
(same) |
| 2026/08/26 05:28 |
P4 |
hotspot/compiler |
JDK-8390826 |
RISC-V: Use dedicated vector mask logical instructions |
Dingli Zhang |
Independent |
(same) |
(same) |
| 2026/08/26 02:08 |
P4 |
hotspot/compiler |
JDK-8391041 |
RISC-V: Fix out-of-bounds read in string_indexof_char intrinsic |
zangchuanqi |
Independent |
(same) |
(same) |
| 2026/08/25 18:06 |
P4 |
hotspot/test |
JDK-8241634 |
Support execution of threads as virtual in LingeredApp |
shiv.shah |
Oracle |
(same) |
(same) |
| 2026/08/25 18:06 |
P4 |
core-svc/debugger |
JDK-8382276 |
Update nsk/jdwp to use ThreadWrapper |
shiv.shah |
Oracle |
(same) |
(same) |
| 2026/08/25 16:15 |
P4 |
hotspot/gc |
JDK-8390390 |
Shenandoah: ShenandoahAdaptiveInitialConfidence accepts negative values |
pfontanilla |
Unknown |
(same) |
(same) |
| 2026/08/25 15:12 |
P4 |
tools/launcher |
JDK-8387729 |
Not all --long-options accept space as seperator |
Guanqiang Han |
Independent |
(same) |
(same) |
| 2026/08/25 15:10 |
P4 |
core-svc/debugger |
JDK-8390339 |
Test vmTestbase/nsk/jdb/interrupt/interrupt001/interrupt001.java timed out due to missing prompt with virtual threads |
Chris Plummer |
Oracle |
(same) |
(same) |
| 2026/08/25 14:42 |
P4 |
core-svc/debugger |
JDK-8389487 |
Test vmTestbase/nsk/jdi/ThreadReference/stop/stop002/TestDescription.java failed: unexpected com.sun.jdi.OpaqueFrameException |
Chris Plummer |
Oracle |
(same) |
(same) |
| 2026/08/25 13:45 |
P4 |
hotspot/runtime |
JDK-8389880 |
Test: inlinetypes/DirectMethodTest.java needs to assert something |
Johan Sjölen |
Oracle |
(same) |
(same) |
| 2026/08/25 12:40 |
P4 |
hotspot/gc |
JDK-8390929 |
G1: Uninitalized G1Policy::_to_collection_set_cards may cause unnecessary GC |
Thomas Schatzl |
Oracle |
(same) |
(same) |
| 2026/08/25 09:41 |
P2 |
hotspot/runtime |
JDK-8391051 |
UnsafeAccessErrorHandshakeClosure should not be passed nullptr |
Thomas Stuefe |
Red Hat |
(same) |
(same) |
| 2026/08/25 09:00 |
P4 |
hotspot/runtime |
JDK-8390469 |
LogTest_large_message_vm_Test::TestBody crashes in case of low disc space |
Matthias Baesken |
SAP |
(same) |
(same) |
| 2026/08/25 08:36 |
P3 |
hotspot/compiler |
JDK-8389666 |
C2: assert(false) failed: unexpected scalar opcode for integer DivV* |
erfang |
Unknown |
(same) |
(same) |
| 2026/08/25 08:33 |
P4 |
infrastructure/build |
JDK-8369182 |
Don't force recompile of abstract_vm_version.cpp |
benshuai5d |
Independent |
(same) |
(same) |
| 2026/08/25 07:38 |
P4 |
hotspot/compiler |
JDK-8390641 |
C1/C2 on x86_64 - remove unused variables |
Matthias Baesken |
SAP |
(same) |
(same) |
| 2026/08/25 06:02 |
P4 |
hotspot/svc-agent |
JDK-8390620 |
Refactor eh_frame to frame in libsaproc |
Yasumasa Suenaga |
NTT DATA |
(same) |
(same) |
| 2026/08/25 03:57 |
P4 |
hotspot/runtime |
JDK-8390807 |
Reduce run time of test AOTCodeFlags.java |
Ioi Lam |
Oracle |
(same) |
(same) |
| 2026/08/25 02:49 |
P4 |
hotspot/test |
JDK-8390334 |
Remove deprecated println() method from nsk.share.Log |
shiv.shah |
Oracle |
(same) |
(same) |
| 2026/08/25 00:02 |
P2 |
core-libs/java.util.concurrent |
JDK-8388310 |
AtomicReferenceFieldUpdater does not perform a substitutability check |
Chen Liang |
Oracle |
(same) |
(same) |
| 2026/08/24 21:15 |
P4 |
hotspot/compiler |
JDK-8381640 |
Enable UseAPX as a product feature |
Srinivas Parasa |
Intel |
(same) |
(same) |
| 2026/08/24 20:22 |
P4 |
hotspot/runtime |
JDK-8390603 |
Remove obsolete thread transition states |
Dean Long |
Oracle |
(same) |
(same) |
| 2026/08/24 16:59 |
P4 |
hotspot/runtime |
JDK-8366417 |
Use InstanceKlass instead of Klass in jfieldIDWorkaround |
Coleen Phillimore |
Oracle |
(same) |
(same) |
| 2026/08/24 16:40 |
P4 |
hotspot/runtime |
JDK-8390917 |
NullPointerException test fails with new message |
Coleen Phillimore |
Oracle |
(same) |
(same) |
| 2026/08/24 15:57 |
P4 |
hotspot/compiler |
JDK-8390550 |
C2 hit MemLimit when run with -Xcomp -XX:VerifyIterativeGVN=1110 |
Vladimir Kozlov |
Oracle |
(same) |
(same) |
| 2026/08/24 15:15 |
P4 |
hotspot/compiler |
JDK-8390914 |
[leyden] add missing relocations for addresses recorded in AOT code cache |
Vladimir Kozlov |
Oracle |
(same) |
(same) |
| 2026/08/24 14:45 |
P4 |
hotspot/runtime |
JDK-8390824 |
ProblemList container tests intolerant of non-writable /tmp |
Navi.Bereziuk |
Independent |
(same) |
(same) |
| 2026/08/24 13:47 |
P4 |
hotspot/runtime |
JDK-8389140 |
VarHandle CAS should not initialize value class |
Johan Sjölen |
Oracle |
(same) |
(same) |
| 2026/08/24 12:59 |
P4 |
infrastructure/build |
JDK-8390109 |
[REDO] Add the hotspot compiler testlibrary to the test-image |
Manuel Hässig |
Oracle |
(same) |
(same) |
| 2026/08/24 12:30 |
P4 |
hotspot/runtime |
JDK-8388404 |
Initialize nm_offset |
Casper Norrbin |
Oracle |
(same) |
(same) |
| 2026/08/24 12:12 |
P3 |
hotspot/runtime |
JDK-8389452 |
Inherited @Contended annotation corrupts concrete value class layout |
Casper Norrbin |
Oracle |
(same) |
(same) |
| 2026/08/24 10:54 |
P4 |
core-libs |
JDK-8390647 |
Clean up the functions made available in libzip |
Jaikiran Pai |
Oracle |
(same) |
(same) |
| 2026/08/24 09:50 |
P4 |
core-libs/java.net |
JDK-8308183 |
Add a small ServerSocket based test to verify the fix |
dlwldnjs1009 |
Independent |
(same) |
(same) |
| 2026/08/24 09:29 |
P4 |
hotspot/compiler |
JDK-8387969 |
RISC-V: Optimize zero-result integer cmoves with Zicond |
Gui Cao |
Independent |
(same) |
(same) |
| 2026/08/24 08:16 |
P4 |
hotspot/compiler |
JDK-8373613 |
PEXT/PDEP intrinsics cause performance regression on AMD pre-Zen 3 CPUs |
alautiero |
Independent |
(same) |
(same) |
| 2026/08/24 07:31 |
P4 |
hotspot/gc |
JDK-8390654 |
Test gc/TestUseGCOverheadLimit.java#G1 fails on linux-arm32 |
Roman Marchenko |
Azul |
(same) |
(same) |
| 2026/08/24 07:13 |
P4 |
hotspot/compiler |
JDK-8389390 |
[Valhalla] Compile::adjust_flat_array_access_aliases asserts due SCMemProj |
Roland Westrelin |
Red Hat |
(same) |
(same) |
| 2026/08/24 07:00 |
P4 |
hotspot/compiler |
JDK-8390459 |
[Valhalla] compiler/valhalla/inlinetypes/TestArrays.java#id6 fails IR matching |
Tobias Hartmann |
Oracle |
(same) |
(same) |
| 2026/08/24 06:49 |
P3 |
hotspot/compiler |
JDK-8357381 |
C2: assert(false) failed: should not be here |
Tobias Hartmann |
Oracle |
(same) |
(same) |
| 2026/08/24 06:49 |
P4 |
hotspot/compiler |
JDK-8390650 |
Unsafe access with constant zero offset triggers assert in EA |
Tobias Hartmann |
Oracle |
(same) |
(same) |
| 2026/08/23 11:00 |
P4 |
hotspot/compiler |
JDK-8370914 |
C2: Reimplement Type::meet and Type::join |
Quan Anh Mai |
Independent |
(same) |
(same) |
| 2026/08/23 01:12 |
P4 |
hotspot/compiler |
JDK-8390614 |
RISC-V: Support VerifyOops for AOT caching stub and code |
Dingli Zhang |
Independent |
(same) |
(same) |
| 2026/08/22 10:34 |
P4 |
hotspot/compiler |
JDK-8390370 |
[Valhalla] PPC64 C1 LIR_Assembler::emit_alloc_array() doesn't check LIR_OpAllocArray::always_slow_path() |
Richard Reingruber |
SAP |
(same) |
(same) |
| 2026/08/22 06:20 |
P4 |
core-libs/java.nio |
JDK-8389968 |
(dc) DatagramChannel.open() attempts to disable IPPROTO_IPV6/IP_MULTICAST_ALL (lnx) |
Alan Bateman |
Oracle |
(same) |
(same) |
| 2026/08/21 22:04 |
P4 |
hotspot/runtime |
JDK-8390266 |
Avoid static for the template function in headers |
Xin Liu |
Amazon |
(same) |
(same) |
| 2026/08/21 19:35 |
P4 |
hotspot/runtime |
JDK-8389474 |
Class of inlined objects may not be AOT-initialized |
Ioi Lam |
Oracle |
(same) |
(same) |
| 2026/08/21 18:42 |
P4 |
hotspot/compiler |
JDK-8390391 |
[perf] InlineSmallCode should be increased for APX mode |
Vladimir Ivanov |
Intel |
(same) |
(same) |
| 2026/08/21 17:36 |
P4 |
core-libs/java.nio |
JDK-8389110 |
java/nio/file/FileStore/Basic.java testEnumerateFileStores fails in container: FileStores should be unique |
shiv.shah |
Oracle |
(same) |
(same) |
| 2026/08/21 17:18 |
P4 |
hotspot/runtime |
JDK-8359208 |
Remove runtime/signal/TestSigstop.java since it is always skipped |
shiv.shah |
Oracle |
(same) |
(same) |
| 2026/08/21 17:12 |
P4 |
hotspot/test |
JDK-8390309 |
Remove deprecated comment() method from nsk.share.Log |
shiv.shah |
Oracle |
(same) |
(same) |
| 2026/08/21 16:07 |
P3 |
hotspot/runtime |
JDK-8390257 |
New test runtime/valhalla/inlinetypes/NPEInPreviewTest.java fails with -Xcomp |
Coleen Phillimore |
Oracle |
(same) |
(same) |
| 2026/08/21 16:02 |
P2 |
hotspot/compiler |
JDK-8388476 |
[Valhalla] C2 incorrectly eliminates store to flat array |
Roland Westrelin |
Red Hat |
(same) |
(same) |
| 2026/08/21 15:07 |
P4 |
client-libs/javax.sound |
JDK-8324189 |
Test javax/sound/sampled/Clip/SetPositionHang.java timed out |
Alexander Zvegintsev |
Oracle |
(same) |
(same) |
| 2026/08/21 14:56 |
P4 |
hotspot/runtime |
JDK-8390353 |
AllocateHeapAt option can cause a HotSpot crash |
arane |
Unknown |
(same) |
(same) |
| 2026/08/21 14:06 |
P3 |
hotspot/jfr |
JDK-8389756 |
JFR: premises for exclusive access to previous epoch are insufficient |
Markus Grönlund |
Oracle |
(same) |
(same) |
| 2026/08/21 14:02 |
P3 |
security-libs/javax.crypto |
JDK-8381223 |
Improve Java ML-DSA Performance |
Mark Powers |
Oracle |
(same) |
(same) |
| 2026/08/21 13:19 |
P4 |
client-libs/java.awt |
JDK-8390545 |
java/awt/Mixing/AWT_Mixing/JPopupMenuOverlapping.java fails on OL9 |
Alexander Zvegintsev |
Oracle |
(same) |
(same) |
| 2026/08/21 13:16 |
P4 |
client-libs/javax.swing |
JDK-8390288 |
The javax/swing/JTable/7124218/SelectEditTableCell.java fails on OL9.5 |
Alexander Zvegintsev |
Oracle |
(same) |
(same) |
| 2026/08/21 13:13 |
P4 |
tools/jlink |
JDK-8390505 |
jlink is not thread safe when used via ToolProvider API |
dbalek |
Unknown |
(same) |
(same) |
| 2026/08/21 11:44 |
P3 |
hotspot/runtime |
JDK-8390386 |
[Linux] Systemd tests failing on systemd newer than 257 |
Severin Gehwolf |
Red Hat |
(same) |
(same) |
| 2026/08/21 09:31 |
P4 |
hotspot/compiler |
JDK-8328078 |
C2 compilation bailout with "too many D-U pinch points" |
Tobias Hartmann |
Oracle |
(same) |
(same) |
| 2026/08/21 09:01 |
P3 |
hotspot/runtime |
JDK-8390314 |
Linux: "assert(current_limit <= upper_bound) failed: invariant" build failure on incus (cgroups) |
Severin Gehwolf |
Red Hat |
(same) |
(same) |
| 2026/08/21 08:30 |
P4 |
hotspot/runtime |
JDK-8390143 |
[lworld] PPC64 TemplateTable::getfield_or_static() with `may_not_rewrite` does not detect flattened field |
Richard Reingruber |
SAP |
(same) |
(same) |
| 2026/08/21 08:20 |
P2 |
hotspot/compiler |
JDK-8387204 |
C2 VectorAPI: logic cones wrongly treats masked XorV |
Jatin Bhateja |
Intel |
(same) |
(same) |
| 2026/08/21 05:32 |
P4 |
hotspot/compiler |
JDK-8390499 |
Clean up suspicious bailout in ciMethod::find_monomorphic_target |
Quan Anh Mai |
Independent |
(same) |
(same) |
| 2026/08/21 05:08 |
P3 |
hotspot/runtime |
JDK-8389610 |
ARM32: native method wrapper unlocks a stale oop after GC relocates the object |
avoznia |
Azul |
(same) |
(same) |
| 2026/08/20 22:55 |
P4 |
hotspot/gc |
JDK-8390310 |
Shenandoah: Abbreviated cycles should allow promotion-in-place |
William Kemper |
Amazon |
(same) |
(same) |
| 2026/08/20 19:52 |
P4 |
hotspot/runtime |
JDK-8390485 |
Migrate appcds/aotCache/ tests to AOT workflow |
Matias Saavedra Silva |
Oracle |
(same) |
(same) |
| 2026/08/20 19:42 |
P4 |
core-svc/debugger |
JDK-8390481 |
stop002 test should no longer call Thread.interrupted() to work around JDK-8306324 |
Chris Plummer |
Oracle |
(same) |
(same) |
| 2026/08/20 17:48 |
P4 |
hotspot/runtime |
JDK-8390613 |
Missing class in loadable descriptors causes AOT crash |
Ioi Lam |
Oracle |
(same) |
(same) |
| 2026/08/20 16:08 |
P3 |
hotspot/gc |
JDK-8387469 |
Shenandoah: GC logs should show end-to-end cycle time and heap used updates |
Aleksey Shipilev |
Amazon |
(same) |
(same) |
| 2026/08/20 15:44 |
P4 |
hotspot/gc |
JDK-8387539 |
Shenandoah: Nonsensical values for consumption acceleration |
William Kemper |
Amazon |
(same) |
(same) |
| 2026/08/20 12:39 |
P3 |
hotspot/compiler |
JDK-8390451 |
[Valhalla] Array re-materialization loses properties |
Tobias Hartmann |
Oracle |
(same) |
(same) |
| 2026/08/20 12:39 |
P4 |
hotspot/compiler |
JDK-8372384 |
Remove unused local variable in MacroAssembler::sha512_update_sha_state on PPC |
Suchismith Roy |
IBM |
(same) |
(same) |
| 2026/08/20 12:25 |
P4 |
hotspot/compiler |
JDK-8389932 |
C2: Merge bits F and G in VerifyIterativeGVN together |
Guanqiang Han |
Independent |
(same) |
(same) |
| 2026/08/20 10:58 |
P3 |
hotspot/compiler |
JDK-8388873 |
C2: AddHF is wrongly reassociated using AddNode::Ideal |
Jatin Bhateja |
Intel |
(same) |
(same) |
| 2026/08/20 10:55 |
P4 |
hotspot/jvmti |
JDK-8389941 |
JvmtiEnv::FollowReferences has unreachable code in jvmtiEnv.cpp |
sovtouch |
Unknown: @altlinux.org |
(same) |
(same) |
| 2026/08/20 09:42 |
P4 |
hotspot/runtime |
JDK-8390299 |
Unify *oop type hierarchy with *oopDesc type hierarchy |
Axel Boldt-Christmas |
Oracle |
(same) |
(same) |
| 2026/08/20 07:48 |
P3 |
core-libs/java.nio |
JDK-8390212 |
(dc) On AIX, DatagramChannel.join can join IPv4 multicast group with IPv6 socket |
David Briemann |
SAP |
(same) |
(same) |
| 2026/08/20 06:39 |
P3 |
hotspot/compiler |
JDK-8390625 |
C2_MacroAssembler::vector_iota_entry_index hits assert(regs[i] != regs[j]) |
Tobias Hartmann |
Oracle |
(same) |
(same) |
| 2026/08/20 05:59 |
P4 |
hotspot/runtime |
JDK-8389939 |
RISC-V: OrderAccess can be simplified by UseZtso |
Kuai Wei |
Alibaba |
(same) |
(same) |
| 2026/08/20 02:17 |
P4 |
hotspot/compiler |
JDK-8390521 |
RISC-V: Clean up vector register dispatch in MachSpillCopyNode::implementation |
Dingli Zhang |
Independent |
(same) |
(same) |
| 2026/08/20 01:31 |
P4 |
hotspot/compiler |
JDK-8298991 |
vmTestbase/nsk/sysdict tests fail with OOME: Java heap space: failed reallocation of scalar replaced objects |
shiv.shah |
Oracle |
(same) |
(same) |
| 2026/08/20 01:08 |
P4 |
hotspot/compiler |
JDK-8390522 |
RISC-V: Avoid clobbering ra in the nmethod entry barrier |
Gui Cao |
Independent |
(same) |
(same) |
| 2026/08/19 22:32 |
P3 |
hotspot/runtime |
JDK-8390240 |
Full chunk thawing path misses deoptimization check in monitorenter case |
Patricio Chilano Mateo |
Oracle |
(same) |
(same) |
| 2026/08/19 21:07 |
P4 |
hotspot/runtime |
JDK-8390335 |
Refactor AOTClassLocationConfig::validate() |
Ioi Lam |
Oracle |
(same) |
(same) |
| 2026/08/19 17:18 |
P4 |
core-libs |
JDK-8387798 |
VectorAPI: VectorOperators.DIV javadoc incorrectly says "Floating only" |
Xueming Shen |
Oracle |
(same) |
(same) |
| 2026/08/19 16:50 |
P4 |
hotspot/gc |
JDK-8390683 |
Problemlist gc/TestGCALotAtSafepoints tests |
Thomas Schatzl |
Oracle |
(same) |
(same) |
| 2026/08/19 16:32 |
P4 |
core-svc/tools |
JDK-8378071 |
Class ThreadSnapshot$ThreadLock is not initialized by VM |
Leonid Mesnik |
Oracle |
(same) |
(same) |
| 2026/08/19 15:57 |
P4 |
tools/javac |
JDK-8388979 |
javac crashes with NullPointerException in Types.erasure when evaluating bounds of mutually dependent array type variables inside an intersection type definition |
Vicente Arturo Romero Zaldivar |
Oracle |
(same) |
(same) |
| 2026/08/19 15:51 |
P4 |
hotspot/runtime |
JDK-8384600 |
Improve java_lang_Throwable::fill_in_stack_trace |
Coleen Phillimore |
Oracle |
(same) |
(same) |
| 2026/08/19 14:54 |
P4 |
hotspot/runtime |
JDK-8389310 |
Virtual thread can miss deoptimization when propagating exception |
Patricio Chilano Mateo |
Oracle |
(same) |
(same) |
| 2026/08/19 14:10 |
P4 |
hotspot/runtime |
JDK-8390480 |
Remove unnecessary check in ThawBase::patch |
Patricio Chilano Mateo |
Oracle |
(same) |
(same) |
| 2026/08/19 13:33 |
P1 |
hotspot/compiler |
JDK-8390591 |
Add regression test for JDK-8390590 |
Vladimir Kozlov |
Oracle |
(same) |
(same) |
| 2026/08/19 12:37 |
P4 |
hotspot/runtime |
JDK-8383567 |
VM.class_print_layout should use external class names |
Casper Norrbin |
Oracle |
(same) |
(same) |
| 2026/08/19 12:07 |
P4 |
hotspot/gc |
JDK-8389096 |
Multiple hangs trying to execute GC with GCALotAtAllSafepoints and ScavengeALot |
Thomas Schatzl |
Oracle |
(same) |
(same) |
| 2026/08/19 09:47 |
P4 |
hotspot/runtime |
JDK-8389576 |
Test resourcehogs/runtime/ValueTearingTest.java fails due to ArrayIndexOutOfBoundsException on many-core machines |
Johan Sjölen |
Oracle |
(same) |
(same) |
| 2026/08/19 07:51 |
P4 |
hotspot/compiler |
JDK-8387014 |
C2: stringopts produces NegativeArraySizeException instead of OOM for UTF-16 overflow |
Daniel Skantz |
Oracle |
(same) |
(same) |
| 2026/08/19 07:16 |
P4 |
hotspot/compiler |
JDK-8390044 |
RISC-V: Support vector integer division |
lilijuan |
Independent |
(same) |
(same) |
| 2026/08/19 06:55 |
P4 |
hotspot/runtime |
JDK-8390432 |
Zero i386 build broken after JDK-8389219 |
Vladimir Petko |
Canonical |
(same) |
(same) |
| 2026/08/19 05:15 |
P1 |
hotspot/compiler |
JDK-8390590 |
[BACKOUT] C2: Fix the memory around some intrinsics nodes |
Vladimir Kozlov |
Oracle |
(same) |
(same) |
| 2026/08/19 02:21 |
P4 |
hotspot/compiler |
JDK-8389378 |
RISC-V: Eliminate redundant sext.w by fusing ConvI2L with int producers |
Gui Cao |
Independent |
(same) |
(same) |
| 2026/08/19 01:56 |
P4 |
hotspot/test |
JDK-8390330 |
Remove deprecated Log() constructor and logTo() method from nsk.share.Log |
shiv.shah |
Oracle |
(same) |
(same) |
| 2026/08/19 00:14 |
P4 |
core-libs |
JDK-8389858 |
[VectorAPI] VectorMask.toVector API note incorrectly describes the result for fp masks |
Xueming Shen |
Oracle |
(same) |
(same) |
| 2026/08/19 00:04 |
P4 |
infrastructure/build |
JDK-8368597 |
make should support selection by status for JTREG tests |
Vladimir Ivanov |
Intel |
(same) |
(same) |
| 2026/08/18 17:21 |
P4 |
core-libs/java.lang.foreign |
JDK-8388792 |
False positives in jdk_foreign test suite |
Jorn Vernee |
Oracle |
(same) |
(same) |
| 2026/08/18 16:21 |
P4 |
hotspot/compiler |
JDK-8386861 |
[Valhalla] emit_opSubstitutabilityCheck speedup |
dyama |
Unknown |
(same) |
(same) |
| 2026/08/18 16:17 |
P4 |
hotspot/gc |
JDK-8388292 |
Shenandoah: Micro-optimize CompressedOops uses |
Aleksey Shipilev |
Amazon |
(same) |
(same) |
| 2026/08/18 16:14 |
P3 |
hotspot/compiler |
JDK-8389873 |
C2 crashes in ConnectionGraph::can_reduce_phi during escape analysis |
Cesar Soares |
Amazon |
(same) |
(same) |
| 2026/08/18 16:14 |
P4 |
hotspot/gc |
JDK-8390307 |
Shenandoah: Print region age in region printouts |
Aleksey Shipilev |
Amazon |
(same) |
(same) |
| 2026/08/18 15:59 |
P4 |
hotspot/compiler |
JDK-8381564 |
[IR Framework] Fix race between accept thread and Driver VM thread |
Christian Hagedorn |
Oracle |
(same) |
(same) |
| 2026/08/18 13:55 |
P4 |
hotspot/compiler |
JDK-8390102 |
RISC-V: Support AOT Code Cache |
xupeijun.xpj |
Alibaba |
(same) |
(same) |
| 2026/08/18 13:53 |
P3 |
hotspot/jfr |
JDK-8390133 |
JFR: OngoingStream reads stale header |
Erik Gahlin |
Oracle |
(same) |
(same) |
| 2026/08/18 13:52 |
P4 |
hotspot/test |
JDK-8390065 |
TestDockerMemoryMetrics.java fails in MetricsMemoryTester failcount |
Navi.Bereziuk |
Independent |
(same) |
(same) |
| 2026/08/18 13:46 |
P3 |
hotspot/compiler |
JDK-8390467 |
C2: _map != nullptr assert failure in LibraryCallKit::inline_Class_cast() |
Roland Westrelin |
Red Hat |
(same) |
(same) |
| 2026/08/18 12:50 |
P3 |
hotspot/compiler |
JDK-8362117 |
C2: compiler/stringopts/TestStackedConcatsAppendUncommonTrap.java fails with a wrong result due to invalidated liveness assumptions for data phis |
Daniel Skantz |
Oracle |
(same) |
(same) |
| 2026/08/18 10:14 |
P4 |
tools/javac |
JDK-8389859 |
Missing TYPE_USE annotations on type variable uses |
dbalek |
Unknown |
(same) |
(same) |
| 2026/08/18 08:27 |
P4 |
client-libs |
JDK-8390455 |
Fix more typos in java.desktop module |
Prasanta Sadhukhan |
Oracle |
(same) |
(same) |
| 2026/08/18 01:44 |
P4 |
hotspot/compiler |
JDK-8390441 |
RISC-V: Fix C2 stack-to-stack spill copies with large offsets |
Gui Cao |
Independent |
(same) |
(same) |
| 2026/08/18 01:16 |
P4 |
hotspot/jvmti |
JDK-8390493 |
Remove vmTestbase/nsk/jvmti/IterateOverReachableObjects/iterreachobj002/TestDescription.java from the ProblemList |
David Holmes |
Oracle |
(same) |
(same) |
| 2026/08/17 23:15 |
P3 |
hotspot/gc |
JDK-8390452 |
RISC-V: gc/shenandoah/TestSieveObjects.java fails with "assert(UseZba) failed: must be" |
Dingli Zhang |
Independent |
(same) |
(same) |
| 2026/08/17 23:08 |
P4 |
hotspot/runtime |
JDK-8390484 |
Problem list appcds/aotCache/ tests |
Matias Saavedra Silva |
Oracle |
(same) |
(same) |
| 2026/08/17 22:55 |
P4 |
core-svc/debugger |
JDK-8390429 |
Enable suspend001 jdb test to run with virtual threads |
shiv.shah |
Oracle |
(same) |
(same) |
| 2026/08/17 19:46 |
P4 |
infrastructure/build |
JDK-8378896 |
A make target "clean-microbenchmark", for micro development |
benshuai5d |
Independent |
(same) |
(same) |
| 2026/08/17 18:52 |
P4 |
core-svc/debugger |
JDK-8390184 |
Some typos in the jdk.jdi module |
Fairoz Matte |
Oracle |
(same) |
(same) |
| 2026/08/17 18:48 |
P4 |
hotspot/runtime |
JDK-8368350 |
Do not support -XX:+AOTClassLinking for static CDS archive |
Matias Saavedra Silva |
Oracle |
(same) |
(same) |
| 2026/08/17 16:44 |
P4 |
core-libs/java.net |
JDK-8390202 |
Typos in the javadoc of various classes in jdk.sctp module |
Jaikiran Pai |
Oracle |
(same) |
(same) |
| 2026/08/17 16:29 |
P4 |
hotspot/runtime |
JDK-8390357 |
AOTMapTest.java fails --vmoptions:--enable-preview |
Ioi Lam |
Oracle |
(same) |
(same) |
| 2026/08/17 16:29 |
P4 |
hotspot/runtime |
JDK-8390447 |
Update ProblemList-Xcomp.txt entries for 8388438 |
Ioi Lam |
Oracle |
(same) |
(same) |
| 2026/08/17 16:20 |
P4 |
core-libs/java.nio |
JDK-8389829 |
(fs) Copying symbolic link fails in Developer Mode (win) |
arane |
Unknown |
(same) |
(same) |
| 2026/08/17 16:17 |
P3 |
hotspot/runtime |
JDK-8387494 |
ResolvedMethodName::vmtarget is not updated when class in AOT cache is redefined |
Ioi Lam |
Oracle |
(same) |
(same) |
| 2026/08/17 08:33 |
P4 |
hotspot/compiler |
JDK-8390101 |
RISC-V: Use vmandn.mm for vector mask and-not |
Dingli Zhang |
Independent |
(same) |
(same) |
| 2026/08/17 08:03 |
P2 |
hotspot/compiler |
JDK-8252185 |
[Valhalla] Improve performance of identityHashCode for value objects |
Marc Chevalier |
Oracle |
(same) |
(same) |
| 2026/08/17 06:33 |
P4 |
hotspot/compiler |
JDK-8386580 |
Typing corrections and style improvements in x86 ML DSA/KEM/SHA3 stub code |
Daniel Skantz |
Oracle |
(same) |
(same) |
| 2026/08/17 06:25 |
P4 |
hotspot/compiler |
JDK-8389579 |
C2: Missed Ideal optimization opportunity in PhaseIterGVN for CompressBits and ExpandBits |
Guanqiang Han |
Independent |
(same) |
(same) |
| 2026/08/17 05:30 |
P3 |
client-libs/javax.swing |
JDK-8390296 |
Swing MultiUIDefaults#containsKey inconsistancy |
Prasanta Sadhukhan |
Oracle |
(same) |
(same) |
| 2026/08/17 05:29 |
P4 |
client-libs |
JDK-8390183 |
Some typos in JavaDocs for the java.desktop module |
Prasanta Sadhukhan |
Oracle |
(same) |
(same) |
| 2026/08/17 00:54 |
P5 |
client-libs/2d |
JDK-8390249 |
Add missing @Override annotations in "javax.imageio.stream" package |
Sergey Bylokhov |
Amazon |
(same) |
(same) |
| 2026/08/15 08:16 |
P3 |
client-libs/javax.swing |
JDK-8387267 |
Editor for the last column in JTable is hard to activate after AUTO_RESIZE_LAST_COLUMN was configured |
Prasanta Sadhukhan |
Oracle |
(same) |
(same) |
| 2026/08/15 07:50 |
P4 |
hotspot/compiler |
JDK-8389677 |
RISC-V: Prefer vmv.v.i to zero vector registers |
zangchuanqi |
Independent |
(same) |
(same) |
| 2026/08/15 01:26 |
P4 |
hotspot/runtime |
JDK-8388525 |
Disallow different module options between AOT training and assembly |
Ioi Lam |
Oracle |
(same) |
(same) |
| 2026/08/14 16:23 |
P4 |
hotspot/compiler |
JDK-8390329 |
Obsolete AlwaysCompileLoopMethods VM flag |
Vladimir Kozlov |
Oracle |
(same) |
(same) |
| 2026/08/14 12:33 |
P4 |
hotspot/gc |
JDK-8378525 |
ZGC: Refactor ZBarrierSet to better fit with ZGC coding style |
Stefan Karlsson |
Oracle |
(same) |
(same) |
| 2026/08/14 10:27 |
P3 |
tools/javac |
JDK-8389659 |
Cannot invoke "com.sun.tools.javac.code.Type.getTag()" because "type" is null on invalid LHS |
Jan Lahoda |
Oracle |
(same) |
(same) |
| 2026/08/14 10:26 |
P3 |
tools/javac |
JDK-8389987 |
null is accepted as synchronized lock |
Jan Lahoda |
Oracle |
(same) |
(same) |
| 2026/08/14 10:16 |
P4 |
hotspot/compiler |
JDK-8387332 |
Template Framework: Add utility methods to build scopes |
Christian Hagedorn |
Oracle |
(same) |
(same) |
| 2026/08/13 22:21 |
P4 |
infrastructure/build |
JDK-8387792 |
Enable PAC-RET for VM code on Windows/ARM64 |
arane |
Unknown |
(same) |
(same) |
| 2026/08/13 21:49 |
P4 |
hotspot/runtime |
JDK-8389187 |
-XX:+VerifyContinuations triggers assert(max_thawing_size() == calculated_max_size) |
Patricio Chilano Mateo |
Oracle |
(same) |
(same) |
| 2026/08/13 21:32 |
P4 |
tools/javac |
JDK-8389071 |
Javac crashes with OutOfMemoryError during Least Upper Bound (LUB) inference of highly entangled F-bounded generic classes |
Vicente Arturo Romero Zaldivar |
Oracle |
(same) |
(same) |
| 2026/08/13 20:17 |
P3 |
hotspot/runtime |
JDK-8388596 |
Virtual-thread freeze asserts on MethodHandle frame with scalarized value argument |
Patricio Chilano Mateo |
Oracle |
(same) |
(same) |
| 2026/08/13 17:12 |
P4 |
hotspot/gc |
JDK-8389866 |
ZGC: Accepts an extremely negative ZAllocationSpikeTolerance value |
Fairoz Matte |
Oracle |
(same) |
(same) |
| 2026/08/13 16:02 |
P3 |
hotspot/runtime |
JDK-8389293 |
Remove developer flag -XX:ArchiveHeapTestClass |
Ioi Lam |
Oracle |
(same) |
(same) |
| 2026/08/13 15:50 |
P4 |
hotspot/gc |
JDK-8390215 |
Shenandoah: Simplify GC logging by dropping unnecessary suffixes |
Aleksey Shipilev |
Amazon |
(same) |
(same) |
| 2026/08/13 15:03 |
P4 |
tools/javac |
JDK-8389868 |
Empty LocalVariableTable attribute is generated for an unused variable in clinit |
dbalek |
Unknown |
(same) |
(same) |
| 2026/08/13 13:08 |
P4 |
hotspot/compiler |
JDK-8386510 |
AArch64: MacroAssembler constructor undefined behaviour |
Suchismith Roy |
IBM |
(same) |
(same) |
| 2026/08/13 12:52 |
P4 |
hotspot/compiler |
JDK-8388458 |
RISC-V: Use LSB for conditional card mark in G1 post-write barrier |
Gui Cao |
Independent |
(same) |
(same) |
| 2026/08/13 12:51 |
P4 |
infrastructure/build |
JDK-8389209 |
Add sccache support to the build |
arane |
Unknown |
(same) |
(same) |
| 2026/08/13 12:38 |
P4 |
hotspot/compiler |
JDK-8382604 |
Remove unused kscratch temp register from mask_opers_evex |
Suchismith Roy |
IBM |
(same) |
(same) |
| 2026/08/13 12:17 |
P3 |
hotspot/gc |
JDK-8390122 |
Shenandoah: SBS::oop_load drops memory ordering decorators |
Aleksey Shipilev |
Amazon |
(same) |
(same) |
| 2026/08/13 08:40 |
P4 |
hotspot/runtime |
JDK-8389325 |
Remove the UseObjectMonitorTable flag and related code |
Fredrik Bredberg |
Oracle |
(same) |
(same) |
| 2026/08/13 08:33 |
P4 |
hotspot/compiler |
JDK-8390190 |
[IR-Framework] Integrate valhalla IR nodes into IRNode.java |
Manuel Hässig |
Oracle |
(same) |
(same) |
| 2026/08/13 08:25 |
P4 |
hotspot/runtime |
JDK-8390136 |
ResourceMark needed for external_name calls in continuationFreezeThaw.cpp |
Matthias Baesken |
SAP |
(same) |
(same) |
| 2026/08/13 07:46 |
P4 |
core-libs/java.net |
JDK-8387853 |
HttpServer unexpectedly closes the connection after first response to empty requests if "drainAmount <= 0" |
Volkan Yazici |
Oracle |
(same) |
(same) |
| 2026/08/13 06:33 |
P3 |
client-libs/javax.swing |
JDK-8390042 |
Test "javax/swing/JToolBar/RightLeftOrientation.java" fails on macOS because two tool bar are not mirror images of each other for "Mac OS X" look and feel |
Prasanta Sadhukhan |
Oracle |
(same) |
(same) |
| 2026/08/13 03:44 |
P4 |
hotspot/runtime |
JDK-8390261 |
ProblemList valhalla/valuetypes/NullRestrictedTest.java |
David Holmes |
Oracle |
(same) |
(same) |
| 2026/08/13 01:22 |
P4 |
core-libs/java.net |
JDK-8371903 |
HttpClient: improve handling of HTTP/2 GOAWAY frames with error code |
Jaikiran Pai |
Oracle |
(same) |
(same) |
| 2026/08/13 00:58 |
P4 |
tools/jpackage |
JDK-8386893 |
add "#include " to get defintion of "std::nothrow_t" |
Alexey Semenyuk |
Oracle |
(same) |
(same) |
| 2026/08/12 22:13 |
P4 |
hotspot/runtime |
JDK-8390259 |
ProblemList runtime/valhalla/inlinetypes/NPEInPreviewTest.java |
David Holmes |
Oracle |
(same) |
(same) |
| 2026/08/12 21:05 |
P4 |
hotspot/runtime |
JDK-8373348 |
Cache AdapterHandleEntry::_sig_cc field in AOTCache |
Matias Saavedra Silva |
Oracle |
(same) |
(same) |
| 2026/08/12 16:49 |
P2 |
hotspot/runtime |
JDK-8389233 |
AOTMode=record asserts while archiving an initialized application value class |
Matias Saavedra Silva |
Oracle |
(same) |
(same) |
| 2026/08/12 13:59 |
P4 |
infrastructure/build |
JDK-8390113 |
JEP 401 integration breaks some pre-existing microbenchmarks |
Claes Redestad |
Oracle |
(same) |
(same) |
| 2026/08/12 12:28 |
P4 |
hotspot/runtime |
JDK-8389538 |
StringUtils::string_match may underflow-read a buffer |
Johan Sjölen |
Oracle |
(same) |
(same) |
| 2026/08/12 08:04 |
P4 |
hotspot/test |
JDK-8390077 |
Rebalance tier1_compiler test groups |
Aleksey Shipilev |
Amazon |
(same) |
(same) |
| 2026/08/12 07:09 |
P4 |
hotspot/compiler |
JDK-8390186 |
[Valhalla] LoadNode::Value should check for ary->is_not_flat() |
Quan Anh Mai |
Independent |
(same) |
(same) |
| 2026/08/12 06:17 |
P4 |
hotspot/compiler |
JDK-8353624 |
C2: Re-enable malformed graph assert removed with JDK-8317998 to reduce noise |
Christian Hagedorn |
Oracle |
(same) |
(same) |
| 2026/08/12 05:55 |
P4 |
core-libs/java.nio |
JDK-8389671 |
(se) Blocking selection op in virtual thread does not keep spare alive beyond scheduler keep alive time (win) |
Alan Bateman |
Oracle |
(same) |
(same) |
| 2026/08/12 04:19 |
P4 |
hotspot/compiler |
JDK-8387213 |
Optimize Float16Vector.fma JIT sequence for x86 AVX512-FP16 targets |
Jatin Bhateja |
Intel |
(same) |
(same) |
| 2026/08/12 02:31 |
P4 |
client-libs/javax.swing |
JDK-8390104 |
Use correct bugid for test |
Prasanta Sadhukhan |
Oracle |
(same) |
(same) |
| 2026/08/12 00:33 |
P4 |
hotspot/svc-agent |
JDK-8390014 |
TestInstanceKlassSize.java and TestInstanceKlassSizeForInterface.java failed when --enable-preview was passed |
Yasumasa Suenaga |
NTT DATA |
(same) |
(same) |
| 2026/08/11 19:53 |
P4 |
hotspot/runtime |
JDK-8390132 |
Test runtime/cds/appcds/ClassPathAttrCircularReference.java "written dynamic archive" missing in output |
Ioi Lam |
Oracle |
(same) |
(same) |
| 2026/08/11 19:33 |
P4 |
hotspot/test |
JDK-8355320 |
FileUtils.copyDirectory() mishandles an existing destination directory |
shiv.shah |
Oracle |
(same) |
(same) |
| 2026/08/11 18:27 |
P4 |
hotspot/runtime |
JDK-8341120 |
NPE message can be wrong for null restricted fields |
Coleen Phillimore |
Oracle |
(same) |
(same) |
| 2026/08/11 18:23 |
P4 |
security-libs/javax.crypto:pkcs11 |
JDK-8390076 |
iList should be free'd after a failed C_GetInterfaceList() call in DEBUG mode |
Valerie Peng |
Oracle |
(same) |
(same) |
| 2026/08/11 16:46 |
P4 |
hotspot/compiler |
JDK-8388417 |
Support VerifyOops for AOT caching stub and code |
Vladimir Kozlov |
Oracle |
(same) |
(same) |
| 2026/08/11 16:07 |
P3 |
tools/jlink |
JDK-8389480 |
GenerateJLIClassesPluginTest.java and IncludeLocalesPluginTest.java tests in tools/jlink/plugins/ fail due to AccessDeniedExceptions on Windows |
Christoph Langer |
SAP |
(same) |
(same) |
| 2026/08/11 16:04 |
P4 |
hotspot/runtime |
JDK-8389860 |
Remove CDS "optimized module handling" optimization |
Ioi Lam |
Oracle |
(same) |
(same) |
| 2026/08/11 16:02 |
P4 |
hotspot/runtime |
JDK-8390002 |
Windows AArch64 needs an additional yellow stack page (total 3) |
arane |
Unknown |
(same) |
(same) |
| 2026/08/11 13:25 |
P3 |
core-libs/java.lang.classfile |
JDK-8388374 |
Class-File API does not enforce required validation for null matches and empty PackageEntry names |
Chen Liang |
Oracle |
(same) |
(same) |
| 2026/08/11 13:20 |
P4 |
core-libs/java.util |
JDK-8387812 |
Refine ArraysSupport.vectorizedMismatch to compare all elements |
Kuai Wei |
Alibaba |
(same) |
(same) |
| 2026/08/11 13:09 |
P4 |
hotspot/jvmti |
JDK-8336666 |
Investigate why AIX needs more metaspace in test serviceability/jvmti/RedefineClasses/RedefineLeakThrowable.java |
Sorna Sarathi |
IBM |
(same) |
(same) |
| 2026/08/11 11:35 |
P4 |
hotspot/runtime |
JDK-8387800 |
[lworld] PPC64 field flattening bugs in JEP 401 |
Martin Doerr |
SAP |
(same) |
(same) |
| 2026/08/11 11:28 |
P3 |
hotspot/compiler |
JDK-8390053 |
Shenandoah: Entry point is beyond 64K with lots of scalarized args |
Aleksey Shipilev |
Amazon |
(same) |
(same) |
| 2026/08/11 10:56 |
P4 |
hotspot/runtime |
JDK-8390033 |
Disable stringop-overflow in shenandoahHeap.cpp |
Dingli Zhang |
Independent |
(same) |
(same) |
| 2026/08/11 09:23 |
P4 |
hotspot/compiler |
JDK-8347266 |
C2: Verify that Node::Identity() doesn't return new nodes |
Guanqiang Han |
Independent |
(same) |
(same) |
| 2026/08/11 09:00 |
P4 |
hotspot/compiler |
JDK-8389914 |
C2: LoadNode::Ideal modifies the node but returns nullptr |
Marc Chevalier |
Oracle |
(same) |
(same) |
| 2026/08/11 08:43 |
P4 |
hotspot/runtime |
JDK-8388017 |
[aix] Narrow klass encoding protection region should be protected in mmap mode |
Thomas Stuefe |
Red Hat |
(same) |
(same) |
| 2026/08/11 07:40 |
P3 |
client-libs/javax.accessibility |
JDK-8348872 |
jabswitch.cpp: regEnable and regDeleteValue leak reallocated data buffer |
Matthias Baesken |
SAP |
(same) |
(same) |
| 2026/08/11 07:35 |
P3 |
hotspot/compiler |
JDK-8388490 |
Assert in VectorUnboxNode::Ideal because value input is TOP |
Tobias Hartmann |
Oracle |
(same) |
(same) |
| 2026/08/11 06:47 |
P4 |
core-libs/java.net |
JDK-8384644 |
Document that HttpResponse::body can return null |
Volkan Yazici |
Oracle |
(same) |
(same) |
| 2026/08/11 06:22 |
P4 |
hotspot/compiler |
JDK-8389936 |
Share the C2 stress infrastructure between compilers |
Manuel Hässig |
Oracle |
(same) |
(same) |
| 2026/08/11 04:49 |
P4 |
hotspot/compiler |
JDK-8389636 |
assert(_base == AryPtr) failed: Not an array pointer |
Vladimir Kozlov |
Oracle |
(same) |
(same) |
| 2026/08/11 01:35 |
P4 |
security-libs/javax.net.ssl |
JDK-8380569 |
Update comments for X25519MLKEM768 per draft RFC in HybridProvider once spec becomes standardized |
Haimay Chao |
Oracle |
(same) |
(same) |
| 2026/08/10 19:52 |
P1 |
infrastructure/build |
JDK-8390081 |
[BACKOUT] Add the hotspot compiler testlibrary to the test-image |
Aleksey Shipilev |
Amazon |
(same) |
(same) |
| 2026/08/10 18:51 |
P3 |
hotspot/runtime |
JDK-8389840 |
Verifier is not setting flagThisUninit when uninitializedThis is on the stack |
Matias Saavedra Silva |
Oracle |
(same) |
(same) |
| 2026/08/10 18:34 |
P4 |
hotspot/test |
JDK-8388343 |
Reevaluate the enable-preview in memory compilation from VM arguments |
Chen Liang |
Oracle |
(same) |
(same) |
| 2026/08/10 18:26 |
P3 |
hotspot/runtime |
JDK-8388385 |
CDS dumping fails with circular JAR manifest Class-Path |
benshuai5d |
Independent |
(same) |
(same) |
| 2026/08/10 17:21 |
P4 |
hotspot/compiler |
JDK-8390069 |
compiler/codegen/ShiftByZero.java fails in release config |
Aleksey Shipilev |
Amazon |
(same) |
(same) |
| 2026/08/10 17:05 |
P4 |
infrastructure/build |
JDK-8380453 |
Add the hotspot compiler testlibrary to the test-image |
Manuel Hässig |
Oracle |
(same) |
(same) |
| 2026/08/10 15:32 |
P4 |
core-libs/java.net |
JDK-8383768 |
java/net/Socket/SocketReadInterruptTest.java failed with SocketTimeoutException: Read timed out |
Jaikiran Pai |
Oracle |
(same) |
(same) |
| 2026/08/10 13:22 |
P4 |
hotspot/jfr |
JDK-8331996 |
JFR: Add boolean check before loading event classes |
Robert Toyonaga |
Red Hat |
(same) |
(same) |
| 2026/08/10 12:30 |
P4 |
hotspot/gc |
JDK-8387973 |
CollectedHeap induced promotion failure handling should use Atomic |
Thomas Schatzl |
Oracle |
(same) |
(same) |
| 2026/08/10 11:16 |
P4 |
hotspot/compiler |
JDK-8389966 |
Remove dangling bootstrap compile reason name |
Timofei Pushkin |
Azul |
(same) |
(same) |
| 2026/08/10 08:56 |
P4 |
hotspot/gc |
JDK-8376296 |
ZGC: assert(can_align_up(size, alignment)) failed: precondition when setting -XX:MaxVirtMemFraction=1 |
Daniel Skantz |
Oracle |
(same) |
(same) |
| 2026/08/10 08:42 |
P4 |
client-libs/java.awt |
JDK-8389648 |
[TEST_BUG] java/awt/TextField/CaretPositionTest/CaretPositionTest.java fails in OL-9 |
Alexander Zvegintsev |
Oracle |
(same) |
(same) |
| 2026/08/10 07:41 |
P4 |
hotspot/compiler |
JDK-8389892 |
C2: VectorNode::Ideal modifies the node but returns nullptr |
Marc Chevalier |
Oracle |
(same) |
(same) |
| 2026/08/08 15:39 |
P4 |
core-libs/java.nio |
JDK-8387793 |
test/jdk/java/nio/file/DirectoryStream/SecureDS.doSetPermissions tests absolute paths |
bpeterson |
Unknown |
(same) |
(same) |
| 2026/08/08 14:12 |
P3 |
core-libs/java.lang.classfile |
JDK-8388362 |
Class-File API MethodHandleEntry symbolic accessors do not throw IllegalArgumentException for invalid REF_newInvokeSpecial data |
Chen Liang |
Oracle |
(same) |
(same) |
| 2026/08/08 14:00 |
P4 |
core-libs/java.lang |
JDK-8389466 |
Clarify Class::desiredAssertionStatus for primitive and array types |
Chen Liang |
Oracle |
(same) |
(same) |
| 2026/08/08 13:11 |
P4 |
hotspot/gc |
JDK-8388880 |
Shenandoah: Improve pinning performance |
pfontanilla |
Unknown |
(same) |
(same) |
| 2026/08/08 00:58 |
P4 |
core-libs/java.net |
JDK-8389617 |
Clean up the Http2TestServerConnection in httpclient test library and introduce a way to access the underlying exchange from a HttpTestExchange |
Jaikiran Pai |
Oracle |
(same) |
(same) |
| 2026/08/07 20:08 |
P1 |
hotspot/compiler |
JDK-8387908 |
[s390x] Port JEP 401 to s390 architecture |
Amit Kumar |
IBM |
(same) |
(same) |
| 2026/08/07 19:39 |
P3 |
core-libs/java.time |
JDK-8388214 |
(tz) Update Timezone Data to 2026c |
oumaiyma.intissar |
Oracle |
(same) |
(same) |
| 2026/08/07 18:44 |
P4 |
hotspot/test |
JDK-8337680 |
failure_handler does not handle repeated commands well |
shiv.shah |
Oracle |
(same) |
(same) |
| 2026/08/07 17:48 |
P2 |
hotspot/gc |
JDK-8389846 |
GenShen: ShenandoahScanRemembered::process_clusters may miss dirty cards when use write table |
Xiaolong Peng |
Amazon |
(same) |
(same) |
| 2026/08/07 17:21 |
P4 |
core-svc/debugger |
JDK-8382272 |
Update nsk/jdb tests to use ThreadWrapper |
shiv.shah |
Oracle |
(same) |
(same) |
| 2026/08/07 17:02 |
P2 |
hotspot/gc |
JDK-8389905 |
Shenandoah: SBSA::card_table uses own temp registers that clobber obj |
William Kemper |
Amazon |
(same) |
(same) |
| 2026/08/07 16:58 |
P4 |
core-libs/java.net |
JDK-8389953 |
Problemlist java/nio/channels/SocketChannel/OpenLeak.java and CloseDuringConnect.java on all versions of macos |
Jaikiran Pai |
Oracle |
(same) |
(same) |
| 2026/08/07 14:59 |
P4 |
tools/javac |
JDK-8388948 |
Javac crashes with NullPointerException in Types.intersect during method type inference of complex overlapping intersection bounds |
Vicente Arturo Romero Zaldivar |
Oracle |
(same) |
(same) |
| 2026/08/07 14:53 |
P3 |
hotspot/runtime |
JDK-8389554 |
ARM32: Unbreak non-preview mode after JEP 401 integration |
Aleksey Shipilev |
Amazon |
(same) |
(same) |
| 2026/08/07 14:17 |
P4 |
hotspot/gc |
JDK-8388169 |
Test gc/g1/TestCodeCacheUnloadDuringConcurrentMark.java failed: Expected a not-entrant target nmethod before concurrent mark |
Albert Yang |
Oracle |
(same) |
(same) |
| 2026/08/07 13:08 |
P4 |
hotspot/compiler |
JDK-8389734 |
[Valhalla] _c1_needs_stack_repair is useless and should be removed |
Frederic Parain |
Oracle |
(same) |
(same) |
| 2026/08/07 11:47 |
P4 |
client-libs/java.awt |
JDK-8364404 |
PanelRepaint.java should not be resizable |
jyothilekshmi.s |
Oracle |
(same) |
(same) |
| 2026/08/07 10:43 |
P4 |
hotspot/gc |
JDK-8387299 |
G1: Use num_regions naming consistently for region counts |
Ivan Walulya |
Oracle |
(same) |
(same) |
| 2026/08/07 08:38 |
P3 |
hotspot/compiler |
JDK-8386708 |
C1: hoisted StringUTF16.getChar before checkIndex, leads to SIGSEGV |
Manuel Hässig |
Oracle |
(same) |
(same) |
| 2026/08/07 07:59 |
P4 |
hotspot/svc-agent |
JDK-8389870 |
Object histogram in SA cannot identify FlatArrayKlass |
Yasumasa Suenaga |
NTT DATA |
(same) |
(same) |
| 2026/08/07 07:41 |
P3 |
hotspot/compiler |
JDK-8389379 |
[lworld] Calling convention mismatch when reaching stack argument limit |
Tobias Hartmann |
Oracle |
(same) |
(same) |
| 2026/08/07 07:05 |
P4 |
tools/launcher |
JDK-8388366 |
Launcher test stability regardless of the default locale |
zhangyinuo |
Independent |
(same) |
(same) |
| 2026/08/07 05:30 |
P3 |
client-libs/2d |
JDK-8386576 |
Calculating Area using a complex polygon creates spurious horizontal line segments |
Jayathirth D V |
Oracle |
(same) |
(same) |
| 2026/08/07 04:51 |
P4 |
hotspot/runtime |
JDK-8389806 |
[s390x] Parent reports exit status 1023 for child, even when child exited normally |
Amit Kumar |
IBM |
(same) |
(same) |
| 2026/08/07 02:02 |
P3 |
hotspot/compiler |
JDK-8389910 |
[BACKOUT] Regression >6% on Crypto-MLDSA.sign on x64 |
Mohamed Issa |
Intel |
(same) |
(same) |
| 2026/08/07 01:56 |
P4 |
hotspot/compiler |
JDK-8382523 |
Optimize Float16 to integral conversion operations for AVX512-FP16 targets |
Jatin Bhateja |
Intel |
(same) |
(same) |
| 2026/08/07 01:22 |
P4 |
hotspot/runtime |
JDK-8346476 |
Thread/TestAlwaysPreTouchStacks fails when run with specific JVM options |
shiv.shah |
Oracle |
(same) |
(same) |
| 2026/08/06 17:56 |
P4 |
client-libs/javax.swing |
JDK-8389903 |
ProblemList javax/swing/JMenu/PopupReferenceMemoryLeak.java on windows-x64 |
Daniel Daugherty |
Oracle |
(same) |
(same) |
| 2026/08/06 13:40 |
P4 |
hotspot/compiler |
JDK-8389581 |
RISC-V: building fails with clang toolchain |
Guoxiong Li |
Independent |
(same) |
(same) |
| 2026/08/06 12:05 |
P3 |
core-libs/java.nio |
JDK-8389112 |
(fs) BasicFileAttributes::isDirectory returns false for directory in OneDrive over SMB (win) |
Alan Bateman |
Oracle |
(same) |
(same) |
| 2026/08/06 09:38 |
P4 |
hotspot/compiler |
JDK-8389765 |
Remove unused rtmp2 temp register from long_to_maskLE8_avx |
Suchismith Roy |
IBM |
(same) |
(same) |
| 2026/08/06 07:24 |
P4 |
client-libs/javax.accessibility |
JDK-8389357 |
Avoid local initialized unused variables in jdk.accessibility |
Matthias Baesken |
SAP |
(same) |
(same) |
| 2026/08/06 06:46 |
P4 |
hotspot/compiler |
JDK-8386769 |
[lworld] C2 parts of JDK-8350865 - Part. 2 |
Marc Chevalier |
Oracle |
(same) |
(same) |
| 2026/08/06 06:29 |
P4 |
tools/javac |
JDK-8388279 |
Compiled code fails with verifier error (II) |
Jan Lahoda |
Oracle |
(same) |
(same) |
| 2026/08/06 04:41 |
P4 |
client-libs/java.awt |
JDK-8389589 |
[TEST_BUG] java/awt/FullScreen/SetFSWindow/FSFrame.java hides failure by swallowing exception |
Alexander Zvegintsev |
Oracle |
(same) |
(same) |
| 2026/08/05 23:24 |
P4 |
hotspot/runtime |
JDK-8389189 |
Ignore different AOTClassLinking option between AOT training and assembly |
Ioi Lam |
Oracle |
(same) |
(same) |
| 2026/08/05 21:14 |
P4 |
hotspot/runtime |
JDK-8353854 |
Change map_memory() signature to match other functions |
Suchismith Roy |
IBM |
(same) |
(same) |
| 2026/08/05 19:46 |
P4 |
hotspot/runtime |
JDK-8370493 |
[ubsan] aotMapLogger.cpp:864:44: runtime error: applying non-zero offset NNNNN to null pointer |
Matias Saavedra Silva |
Oracle |
(same) |
(same) |
| 2026/08/05 17:55 |
P4 |
hotspot/runtime |
JDK-8287010 |
Port TraceDeoptimization to UL |
Coleen Phillimore |
Oracle |
(same) |
(same) |
| 2026/08/05 17:39 |
P4 |
hotspot/jvmti |
JDK-8389611 |
vframeStreamCommon::skip_prefixed_method_and_wrappers: unsigned underflow in prefix length leads to out-of-bounds read |
devnexen |
Independent |
(same) |
(same) |
| 2026/08/05 16:00 |
P4 |
hotspot/compiler |
JDK-8388882 |
Disable automatic integer spills to floating point registers on Intel platforms |
Mohamed Issa |
Intel |
(same) |
(same) |
| 2026/08/05 15:32 |
P4 |
hotspot/svc-agent |
JDK-8388799 |
ClhsdbLongConstant should not assert a specific value for VM_Version::CPU_SHA |
shiv.shah |
Oracle |
(same) |
(same) |
| 2026/08/05 15:07 |
P3 |
hotspot/runtime |
JDK-8388631 |
Copy StackMapTable for the current frame |
Matias Saavedra Silva |
Oracle |
(same) |
(same) |
| 2026/08/05 15:03 |
P4 |
hotspot/gc |
JDK-8387957 |
G1: Investigate merging G1EdenRegions and G1SurvivorRegions |
Thomas Schatzl |
Oracle |
(same) |
(same) |
| 2026/08/05 14:19 |
P4 |
core-libs/java.lang.classfile |
JDK-8389705 |
RawBytecodeHelper doesn't check bounds passed to unsafe code |
Chen Liang |
Oracle |
(same) |
(same) |
| 2026/08/05 13:17 |
P4 |
hotspot/compiler |
JDK-8389512 |
[lworld] Stale acmp profile data causes repeated deoptimization |
Marc Chevalier |
Oracle |
(same) |
(same) |
| 2026/08/05 11:54 |
P4 |
infrastructure/build |
JDK-8385322 |
Provide configure flag to disable cds archive generation for NOCOOPS and _preview |
Matthias Baesken |
SAP |
(same) |
(same) |
| 2026/08/05 11:28 |
P4 |
core-libs |
JDK-8388427 |
Fix javadoc typos related to {@code} and {@linkplain} |
rybak.a.v |
Independent |
(same) |
(same) |
| 2026/08/05 09:47 |
P4 |
hotspot/gc |
JDK-8389128 |
G1: Avoid redundant card marks during remembered set rebuilding |
Albert Yang |
Oracle |
(same) |
(same) |
| 2026/08/05 09:07 |
P4 |
hotspot/runtime |
JDK-8293983 |
ValueTearing fails with "torn point NOT observed" |
Johan Sjölen |
Oracle |
(same) |
(same) |
| 2026/08/05 07:53 |
P4 |
core-libs |
JDK-8389455 |
Avoid local initialized unused variables in libjimage |
Matthias Baesken |
SAP |
(same) |
(same) |
| 2026/08/05 07:11 |
P4 |
tools/javac |
JDK-8388338 |
javac shares proxy initializer trees across constructors |
Jan Lahoda |
Oracle |
(same) |
(same) |
| 2026/08/05 06:00 |
P3 |
hotspot/compiler |
JDK-8385157 |
C2: RegionNode::optimize_trichotomy wrongly folds CmpI and CmpU (wrong result) |
Emanuel Peter |
Oracle |
(same) |
(same) |
| 2026/08/05 04:41 |
P4 |
core-libs |
JDK-8385616 |
[VectorAPI] Remove VectorOperators.OR fallback handling for floating point vectors |
Jatin Bhateja |
Intel |
(same) |
(same) |
| 2026/08/05 00:46 |
P4 |
core-libs/java.lang |
JDK-8388527 |
Add "indistinguishable" cross-reference to Double's discussion of equality |
Joe Darcy |
Oracle |
(same) |
(same) |
| 2026/08/04 21:31 |
P4 |
hotspot/runtime |
JDK-8388594 |
Clean up return statements with CHECK in them |
David Holmes |
Oracle |
(same) |
(same) |
| 2026/08/04 21:24 |
P4 |
hotspot/runtime |
JDK-8385593 |
Clarify the wording of UnsupportedClassVersionError |
David Holmes |
Oracle |
(same) |
(same) |
| 2026/08/04 20:55 |
P4 |
hotspot/compiler |
JDK-8382405 |
AArch64: Dubious non-saves of ptrue after runtime calls |
Chad Rakoczy |
Amazon |
(same) |
(same) |
| 2026/08/04 19:47 |
P3 |
hotspot/runtime |
JDK-8388480 |
System.arraycopy fails to partially copy nullable flat arrays |
Frederic Parain |
Oracle |
(same) |
(same) |
| 2026/08/04 18:17 |
P4 |
hotspot/runtime |
JDK-8253442 |
Bigapps SIGSEGV in DeadlockCycle::print_on_with |
Coleen Phillimore |
Oracle |
(same) |
(same) |
| 2026/08/04 16:30 |
P4 |
hotspot/compiler |
JDK-8389518 |
Should record dependency on -XX:+-ProfileExceptionHandlers flag |
Igor Veresov |
Oracle |
(same) |
(same) |
| 2026/08/04 16:28 |
P4 |
hotspot/compiler |
JDK-8388469 |
Error: assert(_init_deps.contains(ktd)) failed when running TestSetupAOTTest.java with -XX:+CICountOSR |
Igor Veresov |
Oracle |
(same) |
(same) |
| 2026/08/04 16:21 |
P4 |
hotspot/compiler |
JDK-8388848 |
[lworld] ConnectionGraph::process_call_arguments does not correctly handle wide arguments |
Tobias Hartmann |
Oracle |
(same) |
(same) |
| 2026/08/04 15:50 |
P3 |
hotspot/compiler |
JDK-8386687 |
Regression >6% on Crypto-MLDSA.sign on x64 |
Derek White |
Intel |
(same) |
(same) |
| 2026/08/04 15:41 |
P3 |
core-svc/java.lang.management |
JDK-8385163 |
JMX: Use recommended MessageDigest comparison method |
Kevin Walls |
Oracle |
(same) |
(same) |
| 2026/08/04 14:00 |
P4 |
hotspot/gc |
JDK-8388917 |
G1: "guarantee(variance() > -1.0) failed: variance should be >= 0" when running java -XX:G1NumCardsCostSampleThreshold=0 -XX:MetaspaceSize=1024K -version |
Albert Yang |
Oracle |
(same) |
(same) |
| 2026/08/04 12:43 |
P4 |
hotspot/compiler |
JDK-8388295 |
[lworld] C2: inline_unsafe_flat_access could dereference a null pointer |
Marc Chevalier |
Oracle |
(same) |
(same) |
| 2026/08/04 12:42 |
P4 |
hotspot/compiler |
JDK-8388302 |
[lworld] allocate_inline_types_impl could dereference a null pointer |
Marc Chevalier |
Oracle |
(same) |
(same) |
| 2026/08/04 12:33 |
P3 |
hotspot/compiler |
JDK-8389130 |
[lworld] Compiled frame walking is slow due to scalarized calling convention handling |
Marc Chevalier |
Oracle |
(same) |
(same) |
| 2026/08/04 12:13 |
P4 |
hotspot/runtime |
JDK-8388791 |
Refactor JavaClasses Throwable and StackTrace classes |
Coleen Phillimore |
Oracle |
(same) |
(same) |
| 2026/08/04 12:13 |
P4 |
hotspot/compiler |
JDK-8388460 |
RISC-V: Auto-enable Zcb extension features |
Gui Cao |
Independent |
(same) |
(same) |
| 2026/08/04 10:01 |
P4 |
core-svc/java.lang.management |
JDK-8386833 |
java/lang/management/MemoryMXBean/TestGetTotalGcCpuTime.java#Serial fails with "Some GC CPU time must have been reported" exception |
Kevin Walls |
Oracle |
(same) |
(same) |
| 2026/08/04 09:02 |
P4 |
client-libs/java.awt |
JDK-8389509 |
SetPrinterDevice check GlobalAlloc return value |
Matthias Baesken |
SAP |
(same) |
(same) |
| 2026/08/04 08:52 |
P4 |
core-svc/tools |
JDK-8341518 |
TestJcmdWithSideCar.java fails with 'sun.tools.jcmd.JCmd' missing from stdout/stderr |
Navi.Bereziuk |
Independent |
(same) |
(same) |
| 2026/08/04 05:10 |
P4 |
hotspot/runtime |
JDK-8389588 |
[s390x] Zero build is broken after JDK-8388561 |
Vladimir Petko |
Canonical |
(same) |
(same) |
| 2026/08/04 03:32 |
P4 |
client-libs/2d |
JDK-8388755 |
Use floating point argument for fillVertex in MTLRenderer |
Jayathirth D V |
Oracle |
(same) |
(same) |
| 2026/08/04 01:36 |
P5 |
core-libs/java.net |
JDK-8388386 |
Remove deprecated sun.net.www.http.HttpClient#resetProperties |
by1361092 |
Independent |
(same) |
(same) |
| 2026/08/03 23:06 |
P4 |
security-libs/javax.smartcardio |
JDK-8380391 |
Update java.smartcardio finalizer to use Cleaner |
Brent Christian |
Oracle |
(same) |
(same) |
| 2026/08/03 15:59 |
P4 |
hotspot/runtime |
JDK-8389259 |
Class::desiredAssertionStatus asserts with primitive or array class receiver |
Coleen Phillimore |
Oracle |
(same) |
(same) |
| 2026/08/03 15:19 |
P4 |
hotspot/compiler |
JDK-8382605 |
C2: second call of inline_incrementally doesn't happen with delayinline |
Guanqiang Han |
Independent |
(same) |
(same) |
| 2026/08/03 13:12 |
P3 |
hotspot/compiler |
JDK-8389354 |
[lworld] PhaseIdealLoop::move_flat_array_check_out_of_loop creates anti-dependence cycle |
Tobias Hartmann |
Oracle |
(same) |
(same) |
| 2026/08/03 13:07 |
P4 |
hotspot/compiler |
JDK-8388442 |
C2: LoadNKlassNode::Identity() may return a new node |
Guanqiang Han |
Independent |
(same) |
(same) |
| 2026/08/03 11:34 |
P4 |
hotspot/compiler |
JDK-8389089 |
[lworld] C1 should not initialize value class when accessing flat field or array |
Tobias Hartmann |
Oracle |
(same) |
(same) |
| 2026/08/03 11:33 |
P3 |
hotspot/compiler |
JDK-8388544 |
[lworld] Bad dominance assert in C2 when late-inlining through MH calls |
Tobias Hartmann |
Oracle |
(same) |
(same) |
| 2026/08/03 10:40 |
P3 |
hotspot/compiler |
JDK-8388256 |
[lworld] Clone of reference array is broken in C2 |
Tobias Hartmann |
Oracle |
(same) |
(same) |
| 2026/08/03 10:28 |
P4 |
hotspot/compiler |
JDK-8388361 |
[lworld] C2 hits node limit during scalarization in safepoints |
Tobias Hartmann |
Oracle |
(same) |
(same) |
| 2026/08/03 10:07 |
P4 |
hotspot/gc |
JDK-8388005 |
G1: Decrease parallelism in actual deferred code root update work |
Albert Yang |
Oracle |
(same) |
(same) |
| 2026/08/03 08:07 |
P4 |
hotspot/compiler |
JDK-8389139 |
[lworld] C1 should not reuse CodeEmitInfo for G1 pre-barriers of atomic flat fields |
Tobias Hartmann |
Oracle |
(same) |
(same) |
| 2026/08/03 08:07 |
P4 |
hotspot/gc |
JDK-8387860 |
G1: G1ConcurrentMark padding should use variables instead of types |
Thomas Schatzl |
Oracle |
(same) |
(same) |
| 2026/08/03 08:05 |
P4 |
hotspot/gc |
JDK-8387856 |
G1: Fix passing G1ParScanThreadState and worker_id in methods |
Thomas Schatzl |
Oracle |
(same) |
(same) |
| 2026/08/03 07:28 |
P4 |
hotspot/compiler |
JDK-8388018 |
[IR Framework] Be more lenient about system properties |
Marc Chevalier |
Oracle |
(same) |
(same) |
| 2026/08/03 07:09 |
P4 |
hotspot/compiler |
JDK-8388709 |
[lworld] replay parts of JDK-8350865 |
Marc Chevalier |
Oracle |
(same) |
(same) |
| 2026/08/03 07:07 |
P4 |
hotspot/compiler |
JDK-8388193 |
[lworld] C2's ClearArray keeps zero fill value alive in register |
Tobias Hartmann |
Oracle |
(same) |
(same) |
| 2026/08/03 07:06 |
P4 |
hotspot/compiler |
JDK-8389391 |
[lworld] Return buffer allocation for late-inlined MH calls should not initialize the class |
Tobias Hartmann |
Oracle |
(same) |
(same) |
| 2026/08/03 06:56 |
P4 |
hotspot/compiler |
JDK-8389234 |
[lworld] Bad cast for delayed access through abstract value class |
Tobias Hartmann |
Oracle |
(same) |
(same) |
| 2026/08/03 06:54 |
P2 |
hotspot/compiler |
JDK-8389341 |
[lworld] C2 Class.isAssignableFrom intrinsic returns false for identical array Class arguments |
Tobias Hartmann |
Oracle |
(same) |
(same) |
| 2026/08/03 06:53 |
P4 |
core-libs/java.nio |
JDK-8389537 |
(fs) Failure in querying attributes of a OneDrive folder over SMB (win) |
arane |
Unknown |
(same) |
(same) |
| 2026/08/03 06:48 |
P4 |
security-libs/javax.crypto:pkcs11 |
JDK-8389453 |
[unix] Avoid unused variables warnings in libj2pkcs11 and adjust malloc rv handling |
Matthias Baesken |
SAP |
(same) |
(same) |
| 2026/08/03 06:34 |
P4 |
hotspot/compiler |
JDK-8388441 |
[lworld] Expansion of substitutability test fails after macro expansion |
Tobias Hartmann |
Oracle |
(same) |
(same) |
| 2026/08/03 06:18 |
P4 |
hotspot/compiler |
JDK-8388192 |
[lworld] Some code is not guarded by Arguments::is_valhalla_enabled() |
Tobias Hartmann |
Oracle |
(same) |
(same) |
| 2026/08/03 06:17 |
P4 |
hotspot/compiler |
JDK-8346316 |
compiler/rangechecks/TestLongRangeCheck.java fails intermittently with DeoptimizeALot |
Christian Hagedorn |
Oracle |
(same) |
(same) |
| 2026/08/03 06:09 |
P4 |
hotspot/compiler |
JDK-8389088 |
[lworld] C2: assert(false) failed: empty program detected during loop optimization |
Christian Hagedorn |
Oracle |
(same) |
(same) |
| 2026/08/03 06:09 |
P4 |
hotspot/compiler |
JDK-8388007 |
[lworld] [Umbrella] Adressing remaining compiler review comments from the Valhalla PR |
Christian Hagedorn |
Oracle |
(same) |
(same) |
| 2026/08/03 05:46 |
P4 |
hotspot/compiler |
JDK-8389450 |
[lworld] Value class adapter generation leaks CodeCache BufferBlob |
Tobias Hartmann |
Oracle |
(same) |
(same) |
| 2026/08/03 05:45 |
P4 |
hotspot/compiler |
JDK-8389214 |
[lworld] StoreFlatNode with TOP value input not correctly handled by IGVN |
Tobias Hartmann |
Oracle |
(same) |
(same) |
| 2026/08/03 05:45 |
P4 |
hotspot/runtime |
JDK-8382879 |
AOT training run exits with 0 even if assembly subprocess fails |
Ioi Lam |
Oracle |
(same) |
(same) |
| 2026/08/03 05:43 |
P5 |
hotspot/compiler |
JDK-8389235 |
[lworld] Wrong reason for too_many_traps_or_recompiles check in Parse::speculate_non_flat_array |
Tobias Hartmann |
Oracle |
(same) |
(same) |
| 2026/08/03 05:40 |
P4 |
hotspot/compiler |
JDK-8388468 |
[lworld] TestIntrinsics intermittently fails due to unexpected substitutability |
Tobias Hartmann |
Oracle |
(same) |
(same) |
| 2026/08/03 05:40 |
P4 |
hotspot/compiler |
JDK-8388851 |
[lworld] Remove obsolete array store address recomputation |
Tobias Hartmann |
Oracle |
(same) |
(same) |
| 2026/08/03 05:38 |
P4 |
hotspot/compiler |
JDK-8388317 |
[lworld] LibraryCallKit::inline_unsafe_flat_access asserts on null literal |
Tobias Hartmann |
Oracle |
(same) |
(same) |
| 2026/08/02 03:54 |
P4 |
hotspot/jvmti |
JDK-8389384 |
JDK-6960970 broke cross compilation on slow-debug level |
Guoxiong Li |
Independent |
(same) |
(same) |
| 2026/08/01 07:05 |
P3 |
hotspot/runtime |
JDK-8389552 |
[s390]: Build fails due to missing CodeCache declaration in continuationEntry_s390.inline.hpp |
Guanqiang Han |
Independent |
(same) |
(same) |
| 2026/08/01 03:05 |
P4 |
hotspot/compiler |
JDK-8389312 |
RISC-V: vector_update_crc32 wrongly assumes undisturbed tail elements |
Gui Cao |
Independent |
(same) |
(same) |
| 2026/08/01 02:21 |
P4 |
tools/jlink |
JDK-8388400 |
Incorrect null check in jdk.internal.jrtfs.ExplodedImage$PathNode constructor |
Jaikiran Pai |
Oracle |
(same) |
(same) |
| 2026/08/01 02:13 |
P4 |
core-libs/java.net |
JDK-8389514 |
HttpClientImpl$SelectorManager.deregistrations collection is always empty resulting in dead code |
Jaikiran Pai |
Oracle |
(same) |
(same) |
| 2026/07/31 17:47 |
P4 |
hotspot/gc |
JDK-8389533 |
ProblemList gc/g1/TestCodeCacheUnloadDuringConcurrentMark.java in Xcomp mode |
Daniel Daugherty |
Oracle |
(same) |
(same) |
| 2026/07/31 17:20 |
P4 |
hotspot/runtime |
JDK-8382692 |
Use 'isb' instruction in SpinPause on windows-aarch64 |
Mat Carter |
Microsoft |
(same) |
(same) |
| 2026/07/31 12:49 |
P4 |
hotspot/runtime |
JDK-8354489 |
Some callers of VMError::report_and_die think it can return |
Sorna Sarathi |
IBM |
(same) |
(same) |
| 2026/07/31 11:29 |
P4 |
core-libs/java.net |
JDK-8389395 |
Use factory method to construct SequentialSchedulers |
Daniel Jelinski |
Oracle |
(same) |
(same) |
| 2026/07/31 11:10 |
P4 |
core-libs/java.net |
JDK-8389498 |
Enable HttpClient debug logging in java/net/httpclient/http2/H2GoAwayPromptConnectionClose.java test |
Jaikiran Pai |
Oracle |
(same) |
(same) |
| 2026/07/31 10:32 |
P4 |
core-libs/java.net |
JDK-8389392 |
Leftover policy files in java.net tests after Security Manager removal |
Jaikiran Pai |
Oracle |
(same) |
(same) |
| 2026/07/31 00:45 |
P4 |
specification |
JDK-8389220 |
Implement JEP 539: Strict Field Initialization in the JVM (Preview) |
David Simms |
Oracle |
(same) |
(same) |
| 2026/07/31 00:45 |
P4 |
specification |
JDK-8389219 |
Implement JEP 401: Value Objects (Preview) |
David Simms |
Oracle |
(same) |
(same) |
| 2026/07/30 15:49 |
P3 |
core-libs/java.net |
JDK-8385131 |
HTTP/2 connection not closed after receiving GOAWAY frame when no streams are active |
Jaikiran Pai |
Oracle |
(same) |
(same) |
| 2026/07/30 14:51 |
P4 |
core-svc/tools |
JDK-8386884 |
GC.heap_dump -parallel accepts values outside uint range and silently wraps |
Fairoz Matte |
Oracle |
(same) |
(same) |
| 2026/07/30 13:27 |
P4 |
core-libs/java.net |
JDK-8389323 |
Remove unused jdk.internal.httpclient.monitorFlowDelegate property |
Daniel Jelinski |
Oracle |
(same) |
(same) |
| 2026/07/30 11:47 |
P4 |
infrastructure/build |
JDK-8388030 |
Provide configure option to disable build of libjsound |
Matthias Baesken |
SAP |
(same) |
(same) |
| 2026/07/30 07:22 |
P4 |
tools/launcher |
JDK-8388991 |
Adjust relauncher.c to avoid unused variable and init STARTUPINFO as suggested |
Matthias Baesken |
SAP |
(same) |
(same) |
| 2026/07/30 07:19 |
P3 |
tools/jlink |
JDK-8375623 |
Excessive disk space usage of jpackage and jlink tests in debug builds after JDK-8373246 |
Arno Zeller |
SAP |
(same) |
(same) |
| 2026/07/30 07:17 |
P4 |
tools/jlink |
JDK-8387324 |
jlink --strip-debug should filter external debug symbols |
Arno Zeller |
SAP |
(same) |
(same) |
| 2026/07/30 05:43 |
P5 |
core-libs/java.lang.classfile |
JDK-8388415 |
Typo "sufficent" (instead of "sufficient") in package-info.java of java.lang.classfile.attribute package |
by1361092 |
Independent |
(same) |
(same) |
| 2026/07/30 03:59 |
P4 |
tools/javac |
JDK-8388698 |
Typo "docllint" instead of "doclint" in jdk.compiler module-summary.html |
by1361092 |
Independent |
(same) |
(same) |
| 2026/07/29 14:29 |
P4 |
hotspot/svc-agent |
JDK-8385136 |
SA cannot unwind the native frame which does not have DWARF |
Yasumasa Suenaga |
NTT DATA |
(same) |
(same) |
| 2026/07/29 14:11 |
P4 |
client-libs/java.awt |
JDK-8387670 |
Clean up subclassing and DefWindowProc |
Matthias Baesken |
SAP |
(same) |
(same) |
| 2026/07/29 08:18 |
P4 |
hotspot/runtime |
JDK-8387143 |
Test containers/docker/TestMemoryAwareness.java fails in testOOM |
Arno Zeller |
SAP |
(same) |
(same) |
| 2026/07/29 08:06 |
P4 |
security-libs/javax.crypto:pkcs11 |
JDK-8388872 |
Avoid unused variables warnings in libj2pkcs11 |
Matthias Baesken |
SAP |
(same) |
(same) |
| 2026/07/29 05:08 |
P4 |
client-libs/javax.swing |
JDK-8388486 |
javax/swing/JInternalFrame/8069348/bug8069348.java fails with Internal frame is not correctly dragged! |
Prasanta Sadhukhan |
Oracle |
(same) |
(same) |
| 2026/07/29 04:30 |
P2 |
hotspot/compiler |
JDK-8387145 |
C2 VectorAPI: bad definition of right_child_pred in Compile::compute_logic_cone |
Jatin Bhateja |
Intel |
(same) |
(same) |
| 2026/07/29 04:01 |
P3 |
hotspot/jvmti |
JDK-8387045 |
JDK with transformer agent hangs on shutdown |
David Holmes |
Oracle |
(same) |
(same) |
| 2026/07/28 18:32 |
P4 |
core-libs/java.util:i18n |
JDK-8388794 |
Short display name tests for zones with explicit DST offsets |
Naoto Sato |
Oracle |
(same) |
(same) |
| 2026/07/28 15:18 |
P4 |
tools/javadoc(tool) |
JDK-8387471 |
Reduce size of web fonts included in API documentation |
Hannes Wallnoefer |
Oracle |
(same) |
(same) |
| 2026/07/28 14:36 |
P4 |
hotspot/runtime |
JDK-8388158 |
Change CPU detection code beyond hardcoded CPU list |
Mat Carter |
Microsoft |
(same) |
(same) |
| 2026/07/28 09:18 |
P4 |
security-libs/javax.crypto:pkcs11 |
JDK-8388412 |
Update PKCS#11 Cryptographic Token Interface to v3.2 |
achmielewski |
Unknown |
(same) |
(same) |
| 2026/07/28 07:49 |
P4 |
hotspot/other |
JDK-8388923 |
Avoid local initialized unused variables in Hotspot |
Matthias Baesken |
SAP |
(same) |
(same) |
| 2026/07/28 07:34 |
P4 |
client-libs/2d |
JDK-8388842 |
VER_PLATFORM_WIN32_NT checks in WPrinterJob are obsolete |
Matthias Baesken |
SAP |
(same) |
(same) |
| 2026/07/28 06:40 |
P4 |
hotspot/gc |
JDK-8388425 |
[s390] Introduce interface for GC oop verification in the assembler |
hdhiman |
Unknown |
(same) |
(same) |
| 2026/07/28 02:03 |
P4 |
core-libs/java.io |
JDK-8387309 |
GetXSpace test fails on ReFS and removable Windows volumes |
arane |
Unknown |
(same) |
(same) |
| 2026/07/28 01:23 |
P4 |
client-libs/javax.swing |
JDK-8388485 |
javax/swing/JInternalFrame/Test6505027.java fails with Cannot invoke "Object.getClass()" because "" is null |
Prasanta Sadhukhan |
Oracle |
(same) |
(same) |
| 2026/07/27 20:31 |
P4 |
tools/javac |
JDK-8383920 |
Clean up calls to deprecated getStartPosition and getEndPosition methods |
Liam Miller-Cushon |
Google |
(same) |
(same) |
| 2026/07/27 16:22 |
P4 |
core-libs/java.sql |
JDK-8388810 |
Exceeding CachedRowSet max rows should only warn once |
Justin Lu |
Oracle |
(same) |
(same) |
| 2026/07/27 08:42 |
P4 |
hotspot/runtime |
JDK-8384807 |
Populate OMCache from C2 |
Fredrik Bredberg |
Oracle |
(same) |
(same) |
| 2026/07/27 02:47 |
P4 |
hotspot/compiler |
JDK-8388837 |
RISC-V: Track card addresses directly in G1 array post-write barrier loop |
Gui Cao |
Independent |
(same) |
(same) |
| 2026/07/27 01:54 |
P3 |
hotspot/runtime |
JDK-8388072 |
Linux/AArch64 PAC-RET: assert(top.pc() == *(address*)(sp - frame::sender_sp_ret_address_offset())) failed |
Hao Sun |
Nvidia |
(same) |
(same) |
| 2026/07/27 01:19 |
P4 |
client-libs/javax.swing |
JDK-8388849 |
javax/swing/JInternalFrame/8069348/bug8069348.java should ignore execution in non-Windows platform if sun.java2d.d3d=true |
Prasanta Sadhukhan |
Oracle |
(same) |
(same) |
| 2026/07/26 11:26 |
P4 |
hotspot/compiler |
JDK-8388459 |
RISC-V: Add specialized CMove patterns with zero operand |
Gui Cao |
Independent |
(same) |
(same) |
| 2026/07/26 06:13 |
P4 |
client-libs/2d |
JDK-8387645 |
Replace obsolete sun.java2d.noddraw property with sun.java2d.d3d |
Prasanta Sadhukhan |
Oracle |
(same) |
(same) |
| 2026/07/26 02:05 |
P4 |
tools/javac |
JDK-8388827 |
Unused Gen.CodeSizeOverflow |
aivy |
Unknown |
(same) |
(same) |
| 2026/07/25 07:54 |
P2 |
core-libs/java.util |
JDK-8387722 |
The race during initialization or lazy constants in and Map/Set |
Per-Ake Minborg |
Oracle |
(same) |
(same) |
| 2026/07/25 01:07 |
P4 |
hotspot/compiler |
JDK-8321012 |
RISC-V: C2 ExtractUB |
lilijuan |
Independent |
(same) |
(same) |
| 2026/07/24 20:31 |
P4 |
hotspot/compiler |
JDK-8364025 |
MinMaxVector clipping range benchmark highestInt/Long can overflow |
Galder Zamarreño |
IBM |
(same) |
(same) |
| 2026/07/24 18:09 |
P4 |
hotspot/runtime |
JDK-8387743 |
[aot] AOT tests fail intermittently with "incompatible CompressedOops::base()" |
Ashutosh Mehra |
Red Hat |
(same) |
(same) |
| 2026/07/24 17:28 |
P4 |
hotspot/gc |
JDK-8388809 |
Shenandoah: Control thread may observe incorrect cancellation reason |
William Kemper |
Amazon |
(same) |
(same) |
| 2026/07/24 14:27 |
P4 |
hotspot/compiler |
JDK-8388443 |
C2: Assertion in PhaseRegAlloc::reg2offset() is too strict |
Richard Reingruber |
SAP |
(same) |
(same) |
| 2026/07/24 09:44 |
P4 |
hotspot/compiler |
JDK-8388543 |
AArch64: VectorAPI: replace sve_dup+mov with fmovd in sve_vmask_fromlong |
erfang |
Unknown |
(same) |
(same) |
| 2026/07/24 08:11 |
P4 |
hotspot/runtime |
JDK-8388712 |
[s390x, ppc] runtime/CompressedOops/CompressedClassPointersEncodingScheme.java fails since JDK-8387652 |
Thomas Stuefe |
Red Hat |
(same) |
(same) |
| 2026/07/24 06:57 |
P4 |
hotspot/compiler |
JDK-8387708 |
C2: more explicit parameter names for CMove nodes |
Marc Chevalier |
Oracle |
(same) |
(same) |
| 2026/07/24 06:03 |
P4 |
hotspot/compiler |
JDK-8388170 |
[s390x] compiler/inlining/LateInlineQueueDrainTest.java#id0 fail due to invalid ret_addr_offset |
Vladimir Petko |
Canonical |
(same) |
(same) |
| 2026/07/24 05:06 |
P3 |
hotspot/runtime |
JDK-8388561 |
[s390x] Prevent accidental page table expansion |
Thomas Stuefe |
Red Hat |
(same) |
(same) |
| 2026/07/24 02:21 |
P4 |
hotspot/compiler |
JDK-8374184 |
RISC-V: implement GCM intrinsic with Zvkg and Zvkned extension |
Anjian Wen |
Independent |
(same) |
(same) |
| 2026/07/23 20:52 |
P4 |
hotspot/runtime |
JDK-8388883 |
Exclude CommandLineFlagComboNegative.java from test group hotspot_appcds_dynamic |
Ioi Lam |
Oracle |
(same) |
(same) |
| 2026/07/23 17:30 |
P4 |
hotspot/runtime |
JDK-8388841 |
Remove logging tag monitortable |
Fredrik Bredberg |
Oracle |
(same) |
(same) |
| 2026/07/23 16:14 |
P4 |
core-libs/java.text |
JDK-8388507 |
DecimalFormat Strict Parsing NaN and Grouping Size Zero Fixes |
Justin Lu |
Oracle |
(same) |
(same) |
| 2026/07/23 15:25 |
P3 |
hotspot/gc |
JDK-8382085 |
[shenandoah] Cannot transfer regions that are affiliated - assertion |
Kelvin Nilsen |
Amazon |
(same) |
(same) |
| 2026/07/23 14:10 |
P4 |
hotspot/compiler |
JDK-8388432 |
[IR Framework] Various clean-ups in preparation for skipping IR tests and IR rules |
Christian Hagedorn |
Oracle |
(same) |
(same) |
| 2026/07/23 14:09 |
P4 |
hotspot/compiler |
JDK-8388437 |
[IR Framework] Remove unused applyIfNot attribute in @IR |
Christian Hagedorn |
Oracle |
(same) |
(same) |
| 2026/07/23 11:55 |
P4 |
hotspot/gc |
JDK-8388756 |
Shenandoah: Re-learning at explicit GC request considered harmful |
Aleksey Shipilev |
Amazon |
(same) |
(same) |
| 2026/07/23 08:04 |
P3 |
client-libs/2d |
JDK-8387593 |
Using XOR mode to clear the content leaves some traces in metal |
Jayathirth D V |
Oracle |
(same) |
(same) |
| 2026/07/23 07:22 |
P4 |
client-libs/java.awt |
JDK-8387597 |
AwtTrayIcon::InitNID remove handling of ancient Windows versions |
Matthias Baesken |
SAP |
(same) |
(same) |
| 2026/07/23 00:19 |
P4 |
hotspot/runtime |
JDK-8388694 |
Refactor metaspace_pointers_do() operations for BSMAttributeEntries |
Ioi Lam |
Oracle |
(same) |
(same) |
| 2026/07/22 22:13 |
P4 |
hotspot/jvmti |
JDK-8384882 |
jvmti/IterateOverReachableObjects/iterreachobj002 fails with Not a valid malloc pointer |
Serguei Spitsyn |
Oracle |
(same) |
(same) |
| 2026/07/22 17:19 |
P4 |
hotspot/runtime |
JDK-8388695 |
Remove PrintRewrites |
Coleen Phillimore |
Oracle |
(same) |
(same) |
| 2026/07/22 16:25 |
P4 |
core-libs/java.lang |
JDK-8133167 |
String.toLowerCase() for sigma does not use Final_Sigma condition |
Naoto Sato |
Oracle |
(same) |
(same) |
| 2026/07/22 16:04 |
P2 |
hotspot/gc |
JDK-8388449 |
GenShen: Degenerated cycle could be skipped |
William Kemper |
Amazon |
(same) |
(same) |
| 2026/07/22 14:56 |
P3 |
client-libs/java.awt |
JDK-8381565 |
FileDialogDropTargetTest.java fails: Unexpected exit from test [exit code: -1073740771] |
Alexander Zvegintsev |
Oracle |
(same) |
(same) |
| 2026/07/22 14:28 |
P4 |
hotspot/compiler |
JDK-8387415 |
Unneeded check for bmi2 support for VectorCmpMasked opcode |
Guanqiang Han |
Independent |
(same) |
(same) |
| 2026/07/22 07:40 |
P4 |
core-libs/java.lang:reflect |
JDK-8388553 |
Proxy class generation fails when the jdk.proxy.ProxyGenerator.saveGeneratedFiles is set to true |
Jaikiran Pai |
Oracle |
(same) |
(same) |
| 2026/07/22 07:39 |
P4 |
core-libs/java.net |
JDK-8388697 |
Typo "maxiumum" instead of "maximum" in jdk.httpserver's module-info.java |
Jaikiran Pai |
Oracle |
(same) |
(same) |
| 2026/07/22 07:29 |
P4 |
hotspot/gc |
JDK-8388487 |
Shenandoah: Robust stack watermark epoch wraparound |
Aleksey Shipilev |
Amazon |
(same) |
(same) |
| 2026/07/22 07:21 |
P4 |
hotspot/svc |
JDK-8387876 |
Remove psapi lib |
Matthias Baesken |
SAP |
(same) |
(same) |
| 2026/07/22 06:52 |
P4 |
tools/launcher |
JDK-8387750 |
'java -XshowSettings' alone should not be an error |
Guanqiang Han |
Independent |
(same) |
(same) |
| 2026/07/22 06:45 |
P4 |
core-libs/java.net |
JDK-8388538 |
com/sun/net/httpserver/simpleserver/jwebserver/MaxRequestTimeTest.java does not test the maximum request time |
Daniel Jelinski |
Oracle |
(same) |
(same) |
| 2026/07/22 06:23 |
P4 |
hotspot/gc |
JDK-8388461 |
G1: Missing G1FromCardCache footprint |
Albert Yang |
Oracle |
(same) |
(same) |
| 2026/07/22 06:17 |
P3 |
hotspot/runtime |
JDK-8388463 |
Aarch64+Zero build is broken by JDK-8387652 |
Ioi Lam |
Oracle |
(same) |
(same) |
| 2026/07/22 03:32 |
P4 |
hotspot/compiler |
JDK-8387594 |
AArch64: Support vector integer division for SVE |
erfang |
Unknown |
(same) |
(same) |
| 2026/07/21 22:23 |
P3 |
hotspot/runtime |
JDK-8388457 |
parse_integer: typo in hex prefix detection causes out-of-bounds read and wrong base for negative hex |
devnexen |
Independent |
(same) |
(same) |
| 2026/07/21 20:12 |
P4 |
core-libs/java.sql |
JDK-8272194 |
java.sql.Date::toLocalDate() broken for dates before 1 A.D. |
sholto |
Unknown: @letterboxd.com |
(same) |
(same) |
| 2026/07/21 18:28 |
P4 |
client-libs/javax.swing |
JDK-8385367 |
JTextComponent#setDocument() can reattach old AccessibleContext |
Jeremy Wood |
Independent |
(same) |
(same) |
| 2026/07/21 12:52 |
P4 |
hotspot/compiler |
JDK-8388539 |
[TESTBUG] compiler/igvn/TestMaskedStoreIdealization.java fails on Release Builds |
Manuel Hässig |
Oracle |
(same) |
(same) |
| 2026/07/21 12:52 |
P4 |
hotspot/compiler |
JDK-8388523 |
C2: Test compiler/igvn/TestMaskedStoreIdealization.java failed |
Manuel Hässig |
Oracle |
(same) |
(same) |
| 2026/07/21 12:00 |
P5 |
core-libs/java.nio |
JDK-8388046 |
(fs) UnixFileSystem Flags.failIfUnableToCopyPosix and Flags.failIfUnableToCopyNonPosix no longer needed |
bpeterson |
Unknown |
(same) |
(same) |
| 2026/07/21 11:12 |
P3 |
security-libs/javax.net.ssl |
JDK-8386680 |
Specify how cipher suite matching is implemented in jdk.tls.disabledAlgorithms security property |
Sean Mullan |
Oracle |
(same) |
(same) |
| 2026/07/21 06:49 |
P4 |
hotspot/compiler |
JDK-8388477 |
Replace false with 0 in IntelJccErratum::compute_padding |
Albert Yang |
Oracle |
(same) |
(same) |
| 2026/07/21 06:13 |
P4 |
core-svc |
JDK-8386593 |
AArch64: serviceability/sa/TestJhsdbJstackMixedWithXComp.java fails on Ubuntu 26.04 |
Yasumasa Suenaga |
NTT DATA |
(same) |
(same) |
| 2026/07/20 18:13 |
P3 |
hotspot/jvmti |
JDK-8388464 |
New test serviceability/jvmti/GetLocalVariable/GetSetLocalSlotOverflow.java is failing with virtual threads |
devnexen |
Independent |
(same) |
(same) |
| 2026/07/20 18:13 |
P3 |
hotspot/runtime |
JDK-8386116 |
vm/jvmti/StopThread/stop001/stop00103/stop00103a.html trips assert(!java_lang_Thread::is_in_vthread_transition(vthread)) failed |
Patricio Chilano Mateo |
Oracle |
(same) |
(same) |
| 2026/07/20 15:36 |
P2 |
hotspot/compiler |
JDK-8387073 |
C2: StoreNode::Ideal wrongly optimizes away scalar store before masked vector store |
Manuel Hässig |
Oracle |
(same) |
(same) |
| 2026/07/20 15:18 |
P4 |
client-libs/2d |
JDK-8387375 |
Update package sun.font to use instanceof pattern variable |
Daniel Gredler |
Independent |
(same) |
(same) |
| 2026/07/20 13:35 |
P4 |
security-libs/javax.crypto |
JDK-8376599 |
Update Cipher/PBE/PBEKeyTest.java for non-ASCII characters |
Matthew Donovan |
Oracle |
(same) |
(same) |
| 2026/07/20 13:02 |
P3 |
tools/jshell |
JDK-8186876 |
JShell: access javadoc for user/library classes |
Jan Lahoda |
Oracle |
(same) |
(same) |
| 2026/07/20 13:00 |
P3 |
tools/javac |
JDK-8383563 |
Record pattern inference fails when inferred type arguments are same as formals |
Maurizio Cimadamore |
Oracle |
(same) |
(same) |
| 2026/07/20 12:40 |
P4 |
hotspot/compiler |
JDK-8388381 |
appcds/aotClassLinking/AddReads.java fails with assert(stub_id != StubId::NO_STUBID) failed: blob continuation_blob (stub gen) contains no stubs! when run with -XX:-VMContinuations |
Andrew Dinn |
Red Hat |
(same) |
(same) |
| 2026/07/20 12:20 |
P4 |
hotspot/compiler |
JDK-8388439 |
[s390x] LoadNKlass rule doesn't kill CC |
Amit Kumar |
IBM |
(same) |
(same) |
| 2026/07/20 11:58 |
P5 |
security-libs/javax.net.ssl |
JDK-8387874 |
Timeout when running test BulkCipherDisabledAlgorithms |
achmielewski |
Unknown |
(same) |
(same) |
| 2026/07/20 10:11 |
P4 |
tools/javac |
JDK-8387965 |
Incorrect line numbers for instanceof with pattern matching |
Jan Lahoda |
Oracle |
(same) |
(same) |
| 2026/07/20 08:33 |
P4 |
hotspot/compiler |
JDK-8388456 |
RISC-V: Add UseZvbb to RVA23U64Profile |
Gui Cao |
Independent |
(same) |
(same) |
| 2026/07/20 06:59 |
P4 |
tools/javac |
JDK-8387377 |
Compilation is very slow when --module-path contains many Automatic Modules and ALL-MODULE-PATH is used |
Jan Lahoda |
Oracle |
(same) |
(same) |
| 2026/07/20 06:55 |
P4 |
hotspot/gc |
JDK-8388312 |
ZGC: Diagnostic VM option `ZIndexDistributorStrategy` is not validated |
Guanqiang Han |
Independent |
(same) |
(same) |
| 2026/07/20 03:53 |
P3 |
tools/launcher |
JDK-8387977 |
The java manpage should describe the new main method variants |
Jan Lahoda |
Oracle |
(same) |
(same) |
| 2026/07/20 01:39 |
P4 |
core-libs/java.net |
JDK-8386595 |
Two java/net/MulticastSocket tests fail on machines with no ipv6 address other than loopback |
Arno Zeller |
SAP |
(same) |
(same) |
| 2026/07/18 09:16 |
P4 |
hotspot/compiler |
JDK-8388075 |
RISC-V: Auto-enable Zvbc extension features |
Gui Cao |
Independent |
(same) |
(same) |
| 2026/07/18 06:43 |
P4 |
hotspot/compiler |
JDK-8387210 |
PPC64: Remove postalloc_expand from EncodePKlass and DecodeNKlass nodes |
David Briemann |
SAP |
(same) |
(same) |
| 2026/07/17 15:51 |
P5 |
hotspot/compiler |
JDK-8388358 |
HotCodeHeap should throw warning when enabled without C2 |
Chad Rakoczy |
Amazon |
(same) |
(same) |
| 2026/07/17 15:02 |
P3 |
hotspot/compiler |
JDK-8388406 |
[BACKOUT] C2: crash in compiled code due to zero division because of widened CastII |
Roland Westrelin |
Red Hat |
(same) |
(same) |
| 2026/07/17 13:44 |
P4 |
hotspot/compiler |
JDK-8387652 |
[aarch64] Fallback mode for narrow klass decoding |
Thomas Stuefe |
Red Hat |
(same) |
(same) |
| 2026/07/17 13:18 |
P4 |
hotspot/compiler |
JDK-8388399 |
RISC-V: Enable vector FP16 conversions with Zvfhmin |
Dingli Zhang |
Independent |
(same) |
(same) |
| 2026/07/17 11:08 |
P4 |
hotspot/gc |
JDK-8388285 |
[s390] compP_reg_mem is missing the barrier_data() == 0 predicate |
hdhiman |
Unknown |
(same) |
(same) |
| 2026/07/17 08:44 |
P4 |
hotspot/gc |
JDK-8387467 |
ZGC: Use shared thread-local _nmethod_disarmed_guard_value |
ivyapril2005 |
Independent |
(same) |
(same) |
| 2026/07/17 07:07 |
P4 |
hotspot/compiler |
JDK-8387698 |
C2 VectorAPI: Float16Vector::indexInRange hits: fatal error: Not monotonic |
Jatin Bhateja |
Intel |
(same) |
(same) |
| 2026/07/17 07:05 |
P4 |
client-libs/javax.accessibility |
JDK-8387674 |
Remove isXP() function from jabswitch.cpp |
Matthias Baesken |
SAP |
(same) |
(same) |
| 2026/07/17 06:38 |
P4 |
core-libs/java.net |
JDK-8387598 |
sun.net.httpserver.maxReqTime and maxRspTime properties expect values in seconds |
Volkan Yazici |
Oracle |
(same) |
(same) |
| 2026/07/17 06:35 |
P4 |
hotspot/runtime |
JDK-8387701 |
TestAVXRegisterDump: guarantee(how == 0) failed: test guarantee |
Matthias Baesken |
SAP |
(same) |
(same) |
| 2026/07/17 05:55 |
P4 |
core-libs/java.text |
JDK-8387753 |
Improve SimpleDateFormat.set2DigitYearStart() documentation |
Volkan Yazici |
Oracle |
(same) |
(same) |
| 2026/07/17 05:02 |
P3 |
hotspot/jvmti |
JDK-8387718 |
JVMTI GetLocal/SetLocal: slot bounds check overflows for long/double slots |
devnexen |
Independent |
(same) |
(same) |
| 2026/07/17 04:14 |
P4 |
hotspot/gc |
JDK-8388284 |
[s390] resolve_jobject uses wrong branch condition after tmll |
hdhiman |
Unknown |
(same) |
(same) |
| 2026/07/17 02:19 |
P4 |
hotspot/runtime |
JDK-8388360 |
Dead sharedRuntime.cpp stub name code |
bpeterson |
Unknown |
(same) |
(same) |
| 2026/07/17 02:14 |
P4 |
hotspot/compiler |
JDK-8388186 |
java -XX:UseSSE=2 -XX:+EnableX86ECoreOpts -version crashes with assert(UseAVX > 0) failed: requires some form of AVX |
Guanqiang Han |
Independent |
(same) |
(same) |
| 2026/07/16 23:48 |
P4 |
security-libs/java.security |
JDK-8359758 |
O(n²) time complexity in sun.security.util.LocalizedMessage.getNonlocalized |
Mark Powers |
Oracle |
(same) |
(same) |
| 2026/07/16 18:55 |
P4 |
hotspot/runtime |
JDK-8387991 |
Optimize execution of runtime/Thread/TestSpinPause.java |
ivyapril2005 |
Independent |
(same) |
(same) |
| 2026/07/16 14:10 |
P3 |
security-libs/java.security |
JDK-8382269 |
keytool man page references to "JKS" need to be cleaned up |
dyama |
Unknown |
(same) |
(same) |
| 2026/07/16 10:22 |
P4 |
hotspot/compiler |
JDK-8370870 |
IGV: add simple regression tests for graph dumping |
ozanctn |
Amazon |
(same) |
(same) |
| 2026/07/16 00:48 |
P4 |
hotspot/runtime |
JDK-8387745 |
[aot] Several tests fail because a SoftReferenceKey cannot be archived |
Ashutosh Mehra |
Red Hat |
(same) |
(same) |
| 2026/07/15 21:21 |
P4 |
hotspot/compiler |
JDK-8388357 |
ProblemList compiler/vectorapi/VectorStoreMaskIdentityTest.java |
Vladimir Ivanov |
Oracle |
(same) |
(same) |
| 2026/07/15 19:16 |
P4 |
core-libs/java.lang.foreign |
JDK-8388347 |
Remove enablePreview from TestEnableNativeAccessJarManifest |
Chen Liang |
Oracle |
(same) |
(same) |
| 2026/07/15 17:46 |
P4 |
core-svc/debugger |
JDK-8387640 |
vmTestbase/nsk/jdi/EventRequestManager/threadStartRequests/thrstartreq001/TestDescription.java fails intermittently |
Chris Plummer |
Oracle |
(same) |
(same) |
| 2026/07/15 16:39 |
P4 |
hotspot/gc |
JDK-8387463 |
Shenandoah: Use direct oop_oop_iterate methods for known types in marking loops |
Aleksey Shipilev |
Amazon |
(same) |
(same) |
| 2026/07/15 16:18 |
P4 |
core-libs/java.util:i18n |
JDK-8387261 |
Locale.LanguageRange weight validation issues |
Justin Lu |
Oracle |
(same) |
(same) |
| 2026/07/15 16:15 |
P4 |
core-libs/java.lang |
JDK-8388183 |
Wrong example in documentation for String.toLowerCase() |
Naoto Sato |
Oracle |
(same) |
(same) |
| 2026/07/15 15:02 |
P3 |
hotspot/runtime |
JDK-8384557 |
Allow configuration of the JVM's temporary directory on Linux |
Coleen Phillimore |
Oracle |
(same) |
(same) |
| 2026/07/15 14:30 |
P4 |
hotspot/runtime |
JDK-8365575 |
AOT cache should include classes verified using "fail over" verification |
Matias Saavedra Silva |
Oracle |
(same) |
(same) |
| 2026/07/15 13:42 |
P3 |
hotspot/compiler |
JDK-8388080 |
Increase static size of some stubs for APX code |
Derek White |
Intel |
(same) |
(same) |
| 2026/07/15 13:37 |
P4 |
hotspot/runtime |
JDK-8386546 |
Fix race when reserving memory with NUMA interleaving on Windows |
Robert Toyonaga |
Red Hat |
(same) |
(same) |
| 2026/07/15 11:04 |
P3 |
hotspot/jfr |
JDK-8385957 |
JFR: Sensitive command-line arguments still in environment variable values |
Erik Gahlin |
Oracle |
(same) |
(same) |
| 2026/07/15 10:10 |
P4 |
hotspot/runtime |
JDK-8388188 |
NMT: Remove unused local variable in RegionIterator::next_committed |
Albert Yang |
Oracle |
(same) |
(same) |
| 2026/07/15 09:57 |
P3 |
hotspot/compiler |
JDK-8387149 |
C2: assert(regs[i] != regs[j]) failed: regs[2] and regs[3] are both: v24 |
ruben |
Unknown |
(same) |
(same) |
| 2026/07/15 09:25 |
P3 |
hotspot/compiler |
JDK-8380166 |
C2: crash in compiled code due to zero division because of widened CastII |
Roland Westrelin |
Red Hat |
(same) |
(same) |
| 2026/07/15 07:16 |
P4 |
core-libs/java.net |
JDK-8380549 |
HttpCookie.expiryDate2DeltaSeconds returns 0 on parse failure, causing immediate cookie expiration |
ehs208 |
Unknown: @naver.com |
(same) |
(same) |
| 2026/07/15 07:08 |
P3 |
hotspot/compiler |
JDK-8387328 |
C2: A Phi must not have a narrower Type than its inputs |
Quan Anh Mai |
Independent |
(same) |
(same) |
| 2026/07/15 06:36 |
P4 |
hotspot/compiler |
JDK-8387414 |
Insufficient feature gate in vm_version_x86 for UseKyberIntrinsics |
Daniel Skantz |
Oracle |
(same) |
(same) |
| 2026/07/15 04:17 |
P4 |
hotspot/runtime |
JDK-8388016 |
[s390x] Remove the alignment from stubGenerator |
hdhiman |
Unknown |
(same) |
(same) |
| 2026/07/14 23:41 |
P4 |
hotspot/gc |
JDK-8388058 |
Shenandoah: Refactor arraycopy_work |
William Kemper |
Amazon |
(same) |
(same) |
| 2026/07/14 20:46 |
P3 |
security-libs/java.security |
JDK-8376748 |
Emit runtime warnings for JCE algorithms that will be disabled |
Haimay Chao |
Oracle |
(same) |
(same) |
| 2026/07/14 19:14 |
P4 |
hotspot/compiler |
JDK-8387940 |
C2: Stress allocation elimination failures |
Vladimir Ivanov |
Oracle |
(same) |
(same) |
| 2026/07/14 18:42 |
P4 |
hotspot/gc |
JDK-8388173 |
Shenandoah: Overly strict assertion failure in CAS barrier |
William Kemper |
Amazon |
(same) |
(same) |
| 2026/07/14 17:58 |
P4 |
hotspot/gc |
JDK-8388139 |
Shenandoah: -XX:+VerifyOops fails on forwarded objects with COH |
Aleksey Shipilev |
Amazon |
(same) |
(same) |
| 2026/07/14 17:25 |
P4 |
hotspot/runtime |
JDK-8387048 |
NMTCommittedVirtualMemoryTracker.test_committed_virtualmemory_region_vm fails due to found_stack_top |
Albert Yang |
Oracle |
(same) |
(same) |
| 2026/07/14 16:47 |
P3 |
hotspot/compiler |
JDK-8386503 |
C2: assert(adr_type == nullptr || adr_type->isa_aryptr() != nullptr) failed: unexpected type-unsafe store |
Quan Anh Mai |
Independent |
(same) |
(same) |
| 2026/07/14 16:13 |
P3 |
hotspot/compiler |
JDK-8374783 |
C2 compilation asserts with "slice of address and input slice don't match" |
Vladimir Ivanov |
Oracle |
(same) |
(same) |
| 2026/07/14 14:47 |
P5 |
security-libs/java.security |
JDK-8358549 |
O(n²) time complexity in java.security.Provider.parseLegacy() method |
Mark Powers |
Oracle |
(same) |
(same) |
| 2026/07/14 13:29 |
P4 |
hotspot/runtime |
JDK-8387637 |
Dead code for upwards interpreter stacks |
bpeterson |
Unknown |
(same) |
(same) |
| 2026/07/14 12:57 |
P4 |
core-libs |
JDK-8386322 |
Float16Vector.toString should render lane values using Float16.toString |
Jatin Bhateja |
Intel |
(same) |
(same) |
| 2026/07/14 09:12 |
P4 |
tools/jlink |
JDK-8387188 |
JImageExtractTest.java test should deny APPEND_DATA ACL in `testExtractToReadOnlyDir` |
arane |
Unknown |
(same) |
(same) |
| 2026/07/13 18:04 |
P4 |
client-libs/java.awt |
JDK-8387675 |
IS_WINVISTA macro is obsolete |
Matthias Baesken |
SAP |
(same) |
(same) |
| 2026/07/13 17:51 |
P4 |
hotspot/compiler |
JDK-8373487 |
Out-of-bounds access in AlignmentGapAccess test |
Vladimir Ivanov |
Oracle |
(same) |
(same) |
| 2026/07/13 16:46 |
P4 |
tools |
JDK-8387985 |
sun/tools/jstat shell tests fail on platforms that do not support ParallelGC |
Elif Aslan |
Amazon |
(same) |
(same) |
| 2026/07/13 16:23 |
P4 |
core-libs/java.util:i18n |
JDK-8387455 |
Restrict legacy Locale compatibility handling to exact matches |
Justin Lu |
Oracle |
(same) |
(same) |
| 2026/07/13 13:36 |
P4 |
hotspot/compiler |
JDK-8388120 |
[s390x] c2: c_return_value is redundant |
ivyapril2005 |
Independent |
(same) |
(same) |
| 2026/07/13 12:32 |
P4 |
hotspot/runtime |
JDK-8388122 |
NMT: Remove unused comm_size variable from RegionsTree::visit_committed_regions |
Albert Yang |
Oracle |
(same) |
(same) |
| 2026/07/13 08:09 |
P4 |
hotspot/runtime |
JDK-8388117 |
[s390x] is_z_illtrap should recognise all forms |
Amit Kumar |
IBM |
(same) |
(same) |
| 2026/07/13 07:08 |
P4 |
infrastructure/build |
JDK-8387702 |
Linux/clang: enable linktime-gc on libjvm.so too, when it is configured |
Matthias Baesken |
SAP |
(same) |
(same) |
| 2026/07/13 04:31 |
P4 |
core-svc/tools |
JDK-8387996 |
Remove reference to -d64 from serviceability tool manpages |
ivyapril2005 |
Independent |
(same) |
(same) |
| 2026/07/13 01:50 |
P4 |
hotspot/compiler |
JDK-8388035 |
RISC-V: Auto-enable Zfa extension features |
zifeihan |
Unknown: @zthread.com |
(same) |
(same) |
| 2026/07/10 21:48 |
P4 |
core-libs/java.lang:reflect |
JDK-8382841 |
Revert annotation parsing changes from libgraal |
ivyapril2005 |
Independent |
(same) |
(same) |
| 2026/07/10 17:29 |
P4 |
hotspot/compiler |
JDK-8388008 |
AArch64: data race accessing CodeHeap::high in CodeCache::max_distance_to_non_nmethod |
Evgeny Astigeevich |
Amazon |
(same) |
(same) |
| 2026/07/10 16:43 |
P5 |
client-libs/java.awt |
JDK-8388001 |
Test java/awt/Frame/PackTwiceTest.java fails because the frame title is displayed as 'PackTwiceTest TestFrame' instead of 'TestFrame' |
Lawrence Andrews |
Oracle |
(same) |
(same) |
| 2026/07/10 14:33 |
P4 |
security-libs/javax.net.ssl |
JDK-8387578 |
Test sun/security/ssl/SSLSessionImpl/ResumeChecksServer.java failed: Existing session was used: FAIL |
Artur Barashev |
Oracle |
(same) |
(same) |
| 2026/07/10 14:27 |
P4 |
security-libs/javax.net.ssl |
JDK-8386953 |
sun/security/ssl/CertificateCompression/CompressedCertMsgCache.java failing |
Artur Barashev |
Oracle |
(same) |
(same) |
| 2026/07/10 07:07 |
P3 |
hotspot/runtime |
JDK-8387580 |
[S390x] OpenJDK build crashes with SIGSEGV in HashMap::resize() |
Vladimir Petko |
Canonical |
(same) |
(same) |
| 2026/07/10 06:36 |
P4 |
hotspot/gc |
JDK-8387742 |
Reclaim CodeCache nmethods more promptly |
Albert Yang |
Oracle |
(same) |
(same) |
| 2026/07/10 06:05 |
P4 |
hotspot/runtime |
JDK-8386586 |
[s390x] TestSyncOnValueBasedClassEvent.java fails due to incorrect branch |
Amit Kumar |
IBM |
(same) |
(same) |
| 2026/07/10 02:40 |
P4 |
hotspot/gc |
JDK-8387806 |
Shenandoah: Reduce allocation-path contention from ShenandoahAllocRate byte accounting |
Xiaolong Peng |
Amazon |
(same) |
(same) |
| 2026/07/09 22:34 |
P4 |
hotspot/gc |
JDK-8386872 |
Test gc/shenandoah/generational/TestOldGrowthTriggers still fails intermittently |
pfontanilla |
Unknown |
(same) |
(same) |
| 2026/07/09 16:59 |
P3 |
hotspot/compiler |
JDK-8382536 |
C2: sharpen_type_after_if: assert(val->find_edge(con) > 0) failed: mismatch |
Vladimir Ivanov |
Oracle |
(same) |
(same) |
| 2026/07/09 16:46 |
P4 |
hotspot/gc |
JDK-8387961 |
Shenandoah: Rework marked objects loop prefetch |
Aleksey Shipilev |
Amazon |
(same) |
(same) |
| 2026/07/09 16:28 |
P4 |
core-libs/java.util:i18n |
JDK-8387795 |
Remove hard coded set of locales in LocaleData |
Naoto Sato |
Oracle |
(same) |
(same) |
| 2026/07/09 16:02 |
P4 |
hotspot/runtime |
JDK-8387404 |
Make ClassLoaderData::oops_do inlineable |
Aleksey Shipilev |
Amazon |
(same) |
(same) |
| 2026/07/09 13:45 |
P4 |
hotspot/compiler |
JDK-8385945 |
Deprecate the CompilationMode flag |
Manuel Hässig |
Oracle |
(same) |
(same) |
| 2026/07/09 13:38 |
P4 |
hotspot/compiler |
JDK-8380035 |
compiler/intrinsics/TestReturnOopSetForJFRWriteCheckpoint.java crashes on s390x |
Amit Kumar |
IBM |
(same) |
(same) |
| 2026/07/09 13:38 |
P4 |
core-libs/java.util.concurrent |
JDK-8377034 |
Enable full JSR166TestCase.java test for s390x |
Amit Kumar |
IBM |
(same) |
(same) |
| 2026/07/09 13:38 |
P3 |
hotspot/compiler |
JDK-8335163 |
[s390x] test failure - PrintClasses.java |
Amit Kumar |
IBM |
(same) |
(same) |
| 2026/07/09 13:38 |
P4 |
hotspot/runtime |
JDK-8286300 |
Port JEP 425 to S390X |
Amit Kumar |
IBM |
(same) |
(same) |
| 2026/07/09 13:19 |
P3 |
hotspot/compiler |
JDK-8386475 |
C2 x64: -XX:-UseBMI2Instructions is broken for AVX-512 |
Ashutosh Mehra |
Red Hat |
(same) |
(same) |
| 2026/07/09 07:47 |
P4 |
hotspot/compiler |
JDK-8368180 |
RISC-V: Remove redundant ext_Zicboz.enable_feature() |
Dingli Zhang |
Independent |
(same) |
(same) |
| 2026/07/09 06:57 |
P4 |
core-libs/java.net |
JDK-8380967 |
Canceled HttpClient.sendAsync futures throw inconsistent exceptions |
bpeterson |
Unknown |
(same) |
(same) |
| 2026/07/09 04:49 |
P3 |
hotspot/compiler |
JDK-8387411 |
C2: assert((in_vt->isa_pvectmask() == nullptr) == (vt->isa_pvectmask() == nullptr)) failed: Both BVectMask, or both NVectMask, or both PVectMask |
Emanuel Peter |
Oracle |
(same) |
(same) |
| 2026/07/09 00:17 |
P4 |
hotspot/compiler |
JDK-8387937 |
C1: aarch64: two-arg add_debug_info_for_branch looks obsolete |
ivyapril2005 |
Independent |
(same) |
(same) |
| 2026/07/08 21:25 |
P4 |
hotspot/gc |
JDK-8387907 |
Shenandoah: Marking loop prefetch |
Aleksey Shipilev |
Amazon |
(same) |
(same) |
| 2026/07/08 18:05 |
P2 |
hotspot/compiler |
JDK-8378719 |
CompiledDirectCall::set_to_interpreted() fails with guarantee(chk == -1 || chk == 0) failed: Field too big for insn |
Boris Ulasevich |
BellSoft |
(same) |
(same) |
| 2026/07/08 16:14 |
P4 |
hotspot/gc |
JDK-8387707 |
Shenandoah: Simplify reserved queue handling in mark loop |
Aleksey Shipilev |
Amazon |
(same) |
(same) |
| 2026/07/08 15:24 |
P4 |
core-libs/java.lang.foreign |
JDK-8386848 |
testBool in java/foreign/normalize/TestNormalize.java fails on Zero VM with expected [true] but found [false] |
Jorn Vernee |
Oracle |
(same) |
(same) |
| 2026/07/08 07:54 |
P3 |
hotspot/gc |
JDK-8358342 |
G1: G1CodeRootSet performance breaks down on even moderate load |
Thomas Schatzl |
Oracle |
(same) |
(same) |
| 2026/07/08 06:50 |
P4 |
hotspot/gc |
JDK-8386705 |
Parallel: Allow NUMA with explicit huge pages and adaptive resizing |
Albert Yang |
Oracle |
(same) |
(same) |
| 2026/07/08 06:01 |
P4 |
hotspot/gc |
JDK-8387765 |
G1: Let G1HeapRegionType::_tag use the Atomic API |
Thomas Schatzl |
Oracle |
(same) |
(same) |
| 2026/07/08 06:01 |
P4 |
hotspot/gc |
JDK-8387754 |
G1: Let Eden/SurvivorRegions use Atomic instead of volatile |
Thomas Schatzl |
Oracle |
(same) |
(same) |
| 2026/07/08 05:44 |
P3 |
tools/javac |
JDK-8387865 |
ThisEscapeAnalyzer crashes for erroneous source code |
Jan Lahoda |
Oracle |
(same) |
(same) |
| 2026/07/07 20:23 |
P4 |
hotspot/gc |
JDK-8386512 |
Shenandoah: Add a diagnostic option to facilitate testing pinned regions |
pfontanilla |
Unknown |
(same) |
(same) |
| 2026/07/07 14:52 |
P4 |
hotspot/compiler |
JDK-8381809 |
Template Framework Library: add Float16Vector type |
Jatin Bhateja |
Intel |
(same) |
(same) |
| 2026/07/07 12:54 |
P4 |
hotspot/gc |
JDK-8387764 |
G1: Let G1CollectedHeap::_summary_bytes_used use the Atomic API |
Thomas Schatzl |
Oracle |
(same) |
(same) |
| 2026/07/07 12:54 |
P4 |
hotspot/gc |
JDK-8387490 |
G1: Dynamically creating worker threads exposes memory visibility race |
Thomas Schatzl |
Oracle |
(same) |
(same) |
| 2026/07/07 12:54 |
P4 |
hotspot/gc |
JDK-8387751 |
G1: Remove volatile from G1CollectorState::_initiate_conc_mark_if_possible |
Thomas Schatzl |
Oracle |
(same) |
(same) |
| 2026/07/07 12:53 |
P4 |
hotspot/gc |
JDK-8387760 |
G1: Let G1ConcurrentMark::_chunks_in_chunk_list use the Atomic API |
Thomas Schatzl |
Oracle |
(same) |
(same) |
| 2026/07/07 12:22 |
P3 |
hotspot/runtime |
JDK-8387757 |
Man pages still say CompactObjectHeaders is not default |
Coleen Phillimore |
Oracle |
(same) |
(same) |
| 2026/07/07 09:42 |
P4 |
hotspot/compiler |
JDK-8387747 |
Enable long vector multiply IR tests for RISC-V |
Dingli Zhang |
Independent |
(same) |
(same) |
| 2026/07/07 09:39 |
P4 |
hotspot/compiler |
JDK-8387758 |
Oop verification wrong in StubGenerator::generate_generic_copy |
Thomas Stuefe |
Red Hat |
(same) |
(same) |
| 2026/07/07 07:29 |
P4 |
hotspot/jfr |
JDK-8387697 |
Avoid using os::Linux::query_accurate_process_memory_info in JFR |
Matthias Baesken |
SAP |
(same) |
(same) |
| 2026/07/07 07:27 |
P4 |
hotspot/runtime |
JDK-8386592 |
Gtest os.trim_native_heap_vm sometimes fails in subtest os.trim_native_heap_vm |
Matthias Baesken |
SAP |
(same) |
(same) |
| 2026/07/07 07:22 |
P4 |
infrastructure/build |
JDK-8387403 |
BUILD_LIBJAVA remove special warning settings |
Matthias Baesken |
SAP |
(same) |
(same) |
| 2026/07/06 20:38 |
P4 |
hotspot/gc |
JDK-8387713 |
Shenandoah: Rework native card table barrier |
Aleksey Shipilev |
Amazon |
(same) |
(same) |
| 2026/07/06 15:44 |
P4 |
hotspot/compiler |
JDK-8387721 |
C2: Print Node barrier data |
Aleksey Shipilev |
Amazon |
(same) |
(same) |
| 2026/07/06 14:09 |
P4 |
hotspot/compiler |
JDK-8387638 |
Some compiler/vectorization/runner/* tests timed out in Driver mode |
Tobias Hartmann |
Oracle |
(same) |
(same) |
| 2026/07/06 08:58 |
P2 |
hotspot/gc |
JDK-8225186 |
G1: Compiler code cache requested GC deadlocks while WhiteBox has control |
Thomas Schatzl |
Oracle |
(same) |
(same) |
| 2026/07/06 08:31 |
P4 |
hotspot/gc |
JDK-8387581 |
Serial: Clean up startup allocation locking |
Albert Yang |
Oracle |
(same) |
(same) |
| 2026/07/06 08:15 |
P4 |
hotspot/compiler |
JDK-8387019 |
PPC64: Remove postalloc_expand from cmovI/cmovL bso_reg_conLvalue0 nodes |
David Briemann |
SAP |
(same) |
(same) |
| 2026/07/06 07:58 |
P4 |
hotspot/gc |
JDK-8387400 |
Force-inline Devirtualizer methods |
Aleksey Shipilev |
Amazon |
(same) |
(same) |
| 2026/07/06 05:45 |
P4 |
hotspot/compiler |
JDK-8387388 |
AArch64: Optimize reduceLanes MUL op with ext instruction |
erfang |
Unknown |
(same) |
(same) |
| 2026/07/06 05:41 |
P4 |
hotspot/compiler |
JDK-8383905 |
AArch64: Improve code generation for long vector multiply |
erfang |
Unknown |
(same) |
(same) |
| 2026/07/05 07:22 |
P4 |
core-libs/java.lang.classfile |
JDK-8386802 |
ClassFile Util.entryList should consider non-RandomAccess lists |
ivyapril2005 |
Independent |
(same) |
(same) |
| 2026/07/05 06:09 |
P4 |
client-libs/javax.swing |
JDK-8387693 |
Remove unused method |
Prasanta Sadhukhan |
Oracle |
(same) |
(same) |
| 2026/07/04 18:10 |
P4 |
core-libs/java.nio |
JDK-8387704 |
java/nio/file/DirectoryStream/SecureDS.java failing with AccessDeniedException |
bpeterson |
Unknown |
(same) |
(same) |
| 2026/07/04 04:53 |
P4 |
hotspot/compiler |
JDK-8387660 |
Oop verification is sometimes wrong |
Thomas Stuefe |
Red Hat |
(same) |
(same) |
| 2026/07/03 12:35 |
P4 |
client-libs/java.awt |
JDK-8387465 |
Remove isXP() function from WPathGraphics.java |
Matthias Baesken |
SAP |
(same) |
(same) |
| 2026/07/03 06:38 |
P5 |
hotspot/compiler |
JDK-8381880 |
Test compiler/c1/TestTooManyVirtualRegistersMain.java uses wrong class in CompileCommand |
Manuel Hässig |
Oracle |
(same) |
(same) |
| 2026/07/03 06:37 |
P4 |
hotspot/compiler |
JDK-8387078 |
RISC-V: x27 can be allocated in CompressedOops mode |
cg02554262 |
Alibaba |
(same) |
(same) |
| 2026/07/03 06:06 |
P4 |
hotspot/compiler |
JDK-8387622 |
Tests producing many small output writes are extremely slow on Windows |
Tobias Hartmann |
Oracle |
(same) |
(same) |
| 2026/07/03 04:33 |
P4 |
hotspot/svc |
JDK-8387625 |
Add "dt_socket" to `CheckedFeatures.notImplemented` for Windows/ARM64 |
arane |
Unknown |
(same) |
(same) |
| 2026/07/02 19:56 |
P4 |
core-svc/debugger |
JDK-8327967 |
vmTestbase/nsk/jdi/EventRequestManager/threadStartRequests/thrstartreq002/TestDescription.java fails intermittently |
Chris Plummer |
Oracle |
(same) |
(same) |
| 2026/07/02 14:41 |
P4 |
hotspot/runtime |
JDK-8387302 |
Disable reserved stack areas for critical sections on Windows AArch64 |
Saint Wesonga |
Microsoft |
(same) |
(same) |
| 2026/07/02 13:47 |
P4 |
client-libs/java.awt |
JDK-8387298 |
IS_WIN2000 and IS_WINXP macros are obsolete |
Matthias Baesken |
SAP |
(same) |
(same) |
| 2026/07/02 12:44 |
P4 |
hotspot/compiler |
JDK-8369020 |
Test compiler/intrinsics/TestLongUnsignedDivMod.java completed and timed out |
Srinivas Parasa |
Intel |
(same) |
(same) |
| 2026/07/02 12:44 |
P4 |
client-libs/javax.swing |
JDK-8386056 |
Test JFileChooser/HTMLFileName.java doesn't run in Nimbus and Motif |
Alexey Ivanov |
Oracle |
(same) |
(same) |
| 2026/07/02 11:51 |
P4 |
infrastructure/build |
JDK-8387596 |
DEVKIT_LIB_DIR is unused |
Matthias Baesken |
SAP |
(same) |
(same) |
| 2026/07/02 11:37 |
P4 |
hotspot/runtime |
JDK-8387633 |
Remove UnlockExperimentalVMOptions for COH in CDS build |
Coleen Phillimore |
Oracle |
(same) |
(same) |
| 2026/07/02 11:28 |
P4 |
hotspot/gc |
JDK-8387129 |
Parallel: Wrong TaskTerminator in ParallelScavengeRefProcProxyTask |
Albert Yang |
Oracle |
(same) |
(same) |
| 2026/07/02 09:32 |
P4 |
tools/jlink |
JDK-8386842 |
Preview files in root directory not recognized in system image |
dbalek |
Unknown |
(same) |
(same) |
| 2026/07/02 09:13 |
P4 |
core-libs/java.net |
JDK-8355412 |
com/sun/net/httpserver/Test9a.java failed on windows trying to delete file: java.nio.file.FileSystemException: The process cannot access the file because it is being used by another process |
Jaikiran Pai |
Oracle |
(same) |
(same) |
| 2026/07/02 08:11 |
P4 |
hotspot/compiler |
JDK-8386474 |
Aarch64: Correct static_assert((N & (N - 1)) == 0 |
Navi.Bereziuk |
Independent |
(same) |
(same) |
| 2026/07/02 05:35 |
P4 |
core-libs/java.nio |
JDK-8364322 |
(fs) fchmodat support for AT_SYMLINK_NOFOLLOW flag too pessimistic on Linux |
bpeterson |
Unknown |
(same) |
(same) |
| 2026/07/02 04:32 |
P3 |
core-libs/java.util.jar |
JDK-8385924 |
GZIPInputStream.read() behaves differently on some Java versions |
Jaikiran Pai |
Oracle |
(same) |
(same) |
| 2026/07/02 02:21 |
P4 |
core-libs/javax.naming |
JDK-8386807 |
com/sun/jndi/ldap/Connection.java references the wrong exception |
arane |
Unknown |
(same) |
(same) |
| 2026/07/01 20:32 |
P4 |
security-libs/javax.net.ssl |
JDK-8387124 |
Incomplete algorithm decomposition for TLS 1.3 cipher suites in SSLAlgorithmDecomposer |
achmielewski |
Unknown |
(same) |
(same) |
| 2026/07/01 12:44 |
P2 |
hotspot/gc |
JDK-8387265 |
G1: Shutdown during concurrent cycle leaves SATB queues in inconsistent state |
Thomas Schatzl |
Oracle |
(same) |
(same) |
| 2026/07/01 08:36 |
P4 |
hotspot/compiler |
JDK-8387081 |
AArch64: Refactor MacroAssembler::cmpxchg |
ruben |
Unknown |
(same) |
(same) |
| 2026/07/01 07:57 |
P2 |
hotspot/gc |
JDK-8386846 |
G1: Crash in ~ThreadTotalCPUTimeClosure inside G1ServiceThread during CDS abort |
Thomas Schatzl |
Oracle |
(same) |
(same) |
| 2026/07/01 07:17 |
P3 |
hotspot/compiler |
JDK-8387395 |
[REDO] C2: SIGSEGV in compiled code due to missing ctrl |
Quan Anh Mai |
Independent |
(same) |
(same) |
| 2026/07/01 06:02 |
P4 |
hotspot/gc |
JDK-8387387 |
Parallel: Clean up startup allocation locking |
Albert Yang |
Oracle |
(same) |
(same) |
| 2026/07/01 05:55 |
P4 |
hotspot/compiler |
JDK-8387334 |
IR Framework tests should run in jtreg driver mode |
Tobias Hartmann |
Oracle |
(same) |
(same) |
| 2026/07/01 02:34 |
P4 |
hotspot/runtime |
JDK-8387381 |
RISC-V: assert failed with fastdebug build on systems with different core types |
Gui Cao |
Independent |
(same) |
(same) |
| 2026/06/30 23:25 |
P4 |
core-svc/debugger |
JDK-8387560 |
ProblemList vmTestbase/nsk/jdi/EventRequestManager/threadStartRequests/thrstartreq002/TestDescription.java in virtual thread configs |
Daniel Daugherty |
Oracle |
(same) |
(same) |
| 2026/06/30 23:25 |
P4 |
hotspot/jvmti |
JDK-8387558 |
ProblemList vmTestbase/nsk/jvmti/unit/timers/JvmtiTest/TestDescription.java on windows |
Daniel Daugherty |
Oracle |
(same) |
(same) |
| 2026/06/30 23:25 |
P4 |
hotspot/jvmti |
JDK-8387557 |
ProblemList vmTestbase/nsk/jvmti/scenarios/capability/CM02/cm02t001/TestDescription.java in virtual thread configs |
Daniel Daugherty |
Oracle |
(same) |
(same) |
| 2026/06/30 23:25 |
P4 |
hotspot/jvmti |
JDK-8387554 |
ProblemList vmTestbase/nsk/jvmti/unit/functions/Dispose/JvmtiTest/TestDescription.java in virtual thread configs |
Daniel Daugherty |
Oracle |
(same) |
(same) |
| 2026/06/30 19:44 |
P4 |
hotspot/compiler |
JDK-8382135 |
AArch64: HotCodeCollectorMoveFunction.java fails intermittently |
Chad Rakoczy |
Amazon |
(same) |
(same) |
| 2026/06/30 18:07 |
P4 |
security-libs/java.security |
JDK-8387123 |
Remove LuxTrust Global Root CA |
Mark Powers |
Oracle |
(same) |
(same) |
| 2026/06/30 15:28 |
P4 |
hotspot/runtime |
JDK-8380750 |
Test runtime/cds/appcds/TestSerialGCWithCDS.java#id1 failed: StringIndexOutOfBoundsException |
Matias Saavedra Silva |
Oracle |
(same) |
(same) |
| 2026/06/30 14:21 |
P4 |
hotspot/compiler |
JDK-8387184 |
[PPC64] C1 logic operations should support generic constants |
Martin Doerr |
SAP |
(same) |
(same) |
| 2026/06/30 12:21 |
P4 |
hotspot/runtime |
JDK-8387258 |
Test jdk/jfr/event/runtime/TestResidentSetSizeEvent.java failed on Windows: The size should be less than or equal to peak |
Thomas Schatzl |
Oracle |
(same) |
(same) |
| 2026/06/30 09:34 |
P4 |
hotspot/gc |
JDK-8382213 |
Shenandoah: Drop weak root processing flags earlier |
Aleksey Shipilev |
Amazon |
(same) |
(same) |
| 2026/06/30 09:01 |
P4 |
hotspot/compiler |
JDK-8387393 |
Problemlist compiler/escapeAnalysis/TestBCEscapeAnalyzerOverflow.java on Windows AArch64 |
Aleksey Shipilev |
Amazon |
(same) |
(same) |
| 2026/06/30 09:01 |
P4 |
hotspot/gc |
JDK-8387391 |
hotspot_gc_shenandoah should include gtests |
Aleksey Shipilev |
Amazon |
(same) |
(same) |
| 2026/06/30 07:39 |
P4 |
hotspot/runtime |
JDK-8387262 |
Enum constant frame::pc_return_offset is always zero |
bpeterson |
Unknown |
(same) |
(same) |
| 2026/06/30 05:23 |
P4 |
hotspot/runtime |
JDK-8386685 |
CDS load on Windows/ARM64 using base address set to 0x5_0000_0000 causes a JVM crash |
arane |
Unknown |
(same) |
(same) |
| 2026/06/30 05:05 |
P3 |
hotspot/jvmti |
JDK-8379144 |
serviceability/jvmti/vthread/VThreadTest/VThreadTest.java timed out with --enable-preview |
Serguei Spitsyn |
Oracle |
(same) |
(same) |
| 2026/06/30 04:39 |
P4 |
hotspot/compiler |
JDK-8379327 |
128-bit multiplication uses two multiply instructions on x86_64 |
mreeves |
Unknown |
(same) |
(same) |
| 2026/06/29 21:52 |
P4 |
core-libs/java.lang.foreign |
JDK-8387406 |
ProblemList java/foreign/normalize/TestNormalize.java |
Jorn Vernee |
Oracle |
(same) |
(same) |
| 2026/06/29 21:50 |
P4 |
tools/javac |
JDK-8383882 |
javac: incremental compilation using --module misses classes |
Jorn Vernee |
Oracle |
(same) |
(same) |
| 2026/06/29 20:32 |
P4 |
hotspot/gc |
JDK-8386910 |
Shenandoah: remove redundant logging of free set status |
Kelvin Nilsen |
Amazon |
(same) |
(same) |
| 2026/06/29 20:15 |
P4 |
hotspot/runtime |
JDK-8386448 |
Enable dumping of AVX registers (YMM/ZMM and K registers) in JVM fatal error logs |
Srinivas Parasa |
Intel |
(same) |
(same) |
| 2026/06/29 19:11 |
P2 |
security-libs/javax.crypto |
JDK-8386911 |
Crypto benchmark regressions after JDK-8384353 |
Volodymyr Paprotski |
Intel |
(same) |
(same) |
| 2026/06/29 17:00 |
P4 |
hotspot/gc |
JDK-8387293 |
Shenandoah: Improve gc+stats logging for generational mode |
Aleksey Shipilev |
Amazon |
(same) |
(same) |
| 2026/06/29 16:45 |
P3 |
infrastructure/build |
JDK-8387315 |
Add macosx-aarch64 bootcycle build profiles |
Mikhailo Seledtsov |
Oracle |
(same) |
(same) |
| 2026/06/29 16:27 |
P4 |
core-libs/java.util:i18n |
JDK-8387259 |
Clarify extlang in Locale composition description |
Justin Lu |
Oracle |
(same) |
(same) |
| 2026/06/29 15:28 |
P4 |
core-libs/java.net |
JDK-8387273 |
Enhance httpserver logging to log when maxConnections is reached |
Kieran Farrell |
Oracle |
(same) |
(same) |
| 2026/06/29 14:45 |
P3 |
hotspot/compiler |
JDK-8386656 |
C2 AVX512: -XX:-UseCountTrailingZerosInstruction causes assert(UseCountTrailingZerosInstruction) failed: tzcnt instruction not supported |
Ashutosh Mehra |
Red Hat |
(same) |
(same) |
| 2026/06/29 14:26 |
P4 |
core-libs/java.net |
JDK-8386989 |
QuicEndpoint.ClosedConnection should not use QuicTimerQueue::offer |
Daniel Fuchs |
Oracle |
(same) |
(same) |
| 2026/06/29 14:18 |
P4 |
core-libs/java.net |
JDK-8386985 |
PacketSpaceManagerTest failed with AssertionError; A race condition may cause packetSent to mistakenly skip rescheduling of the transmitter task |
Daniel Fuchs |
Oracle |
(same) |
(same) |
| 2026/06/29 12:37 |
P3 |
tools/jpackage |
JDK-8387306 |
Replace InputStream#read(byte[]) with InputStream#readNBytes(int) in RtfConverter.isRtfFile() |
Alexey Semenyuk |
Oracle |
(same) |
(same) |
| 2026/06/29 11:44 |
P4 |
hotspot/compiler |
JDK-8387016 |
PPC64: Remove postalloc_expand from float/double compare nodes |
David Briemann |
SAP |
(same) |
(same) |
| 2026/06/29 10:49 |
P4 |
hotspot/gc |
JDK-8371720 |
G1: Move concurrent mark initialization to first concurrent start pause |
Thomas Schatzl |
Oracle |
(same) |
(same) |
| 2026/06/29 09:29 |
P4 |
hotspot/compiler |
JDK-8387197 |
C2: Improve klass_ptr_type in GraphKit::gen_instanceof() similarly to GraphKit::gen_checkcast() |
Guanqiang Han |
Independent |
(same) |
(same) |
| 2026/06/29 08:56 |
P3 |
hotspot/gc |
JDK-8387206 |
G1: Code root verification crashes because of stale table scanner |
Thomas Schatzl |
Oracle |
(same) |
(same) |
| 2026/06/29 08:52 |
P4 |
hotspot/gc |
JDK-8385903 |
G1: G1CollectionSet::_num_regions needs to be Atomic |
Thomas Schatzl |
Oracle |
(same) |
(same) |
| 2026/06/29 08:45 |
P4 |
hotspot/gc |
JDK-8387322 |
G1: G1CSetCandidateGroupList::_num_regions should be Atomic |
Thomas Schatzl |
Oracle |
(same) |
(same) |
| 2026/06/29 07:28 |
P4 |
hotspot/gc |
JDK-8387303 |
G1: Convert G1ConcurrentRefine::_num_threads_wanted to use the Atomic API |
Thomas Schatzl |
Oracle |
(same) |
(same) |
| 2026/06/29 06:50 |
P4 |
core-svc/java.lang.management |
JDK-8387142 |
BUILD_LIBMANAGEMENT_EXT remove special warning settings |
Matthias Baesken |
SAP |
(same) |
(same) |
| 2026/06/29 06:48 |
P3 |
infrastructure |
JDK-8386844 |
Update to use jtreg 8.3 |
Christian Stein |
Oracle |
(same) |
(same) |
| 2026/06/29 05:35 |
P4 |
hotspot/gc |
JDK-8386480 |
Parallel: Avoid Triggering GC Before VM Initialization Completes |
Albert Yang |
Oracle |
(same) |
(same) |
| 2026/06/29 05:00 |
P2 |
hotspot/compiler |
JDK-8387378 |
[BACKOUT] C2: SIGSEGV in compiled code due to missing ctrl |
David Holmes |
Oracle |
(same) |
(same) |
| 2026/06/29 03:32 |
P4 |
hotspot/compiler |
JDK-8378892 |
TestTrampoline fails on Windows AArch64 |
Saint Wesonga |
Microsoft |
(same) |
(same) |
| 2026/06/27 01:46 |
P4 |
hotspot/compiler |
JDK-8386163 |
C2 Vector API: assert(collect_unique_inputs(n, inputs) == 1) failed: not unary |
Jatin Bhateja |
Intel |
(same) |
(same) |
| 2026/06/26 15:12 |
P4 |
security-libs/java.security |
JDK-8377102 |
cacerts jlink plugin |
Sean Mullan |
Oracle |
(same) |
(same) |
| 2026/06/26 08:04 |
P3 |
hotspot/compiler |
JDK-8385420 |
C2: SIGSEGV in compiled code due to missing ctrl |
Quan Anh Mai |
Independent |
(same) |
(same) |
| 2026/06/26 07:04 |
P3 |
tools/javac |
JDK-8387215 |
On-demand attribution of a record constructor body causes javac to emit an invalid diagnostic |
dbalek |
Unknown |
(same) |
(same) |
| 2026/06/26 06:32 |
P5 |
core-libs/java.lang |
JDK-8365887 |
Outdated comments in String::decode |
ivyapril2005 |
Independent |
(same) |
(same) |
| 2026/06/26 06:17 |
P4 |
hotspot/gc |
JDK-8386292 |
Shenandoah: Simplify and strengthen C1 barriers |
Aleksey Shipilev |
Amazon |
(same) |
(same) |
| 2026/06/26 04:02 |
P4 |
core-libs |
JDK-8386255 |
Float16Vector NaN canonicalization for hashCode computation |
Jatin Bhateja |
Intel |
(same) |
(same) |
| 2026/06/25 21:52 |
P4 |
hotspot/gc |
JDK-8387260 |
Shenandoah: ShenandoahOldGeneration::_promoted_reserve should be atomic |
Xiaolong Peng |
Amazon |
(same) |
(same) |
| 2026/06/25 18:08 |
P4 |
core-libs/java.util:i18n |
JDK-8387253 |
Locale incorrectly accepts extlangs after non 2*3ALPHA lang |
Justin Lu |
Oracle |
(same) |
(same) |
| 2026/06/25 17:43 |
P4 |
hotspot/gc |
JDK-8385643 |
Shenandoah: Rework mark loop inlining |
Aleksey Shipilev |
Amazon |
(same) |
(same) |
| 2026/06/25 15:47 |
P4 |
core-libs/javax.script |
JDK-8387044 |
test/jdk/javax/script/CommonSetup.sh incorrectly sets isCygwin=true for MSys/MinGW |
arane |
Unknown |
(same) |
(same) |
| 2026/06/25 14:49 |
P4 |
hotspot/svc |
JDK-8387148 |
Linux perf map should record individual vtable trampolines |
bpeterson |
Unknown |
(same) |
(same) |
| 2026/06/25 14:06 |
P3 |
core-libs/java.lang.invoke |
JDK-8378796 |
java.lang.runtime bootstrap methods missing lookup validation |
Chen Liang |
Oracle |
(same) |
(same) |
| 2026/06/25 10:52 |
P5 |
hotspot/gc |
JDK-8385562 |
G1: Remove obsolete young_list prefix in identifiers used before JDK-8150721 |
Ivan Walulya |
Oracle |
(same) |
(same) |
| 2026/06/25 09:20 |
P4 |
hotspot/compiler |
JDK-8379816 |
C2: Possible integer overflow in BCEscapeAnalyzer::iterate_blocks |
devnexen |
Independent |
(same) |
(same) |
| 2026/06/25 08:30 |
P4 |
core-libs/java.util:collections |
JDK-6356745 |
(coll) Add PriorityQueue(Collection, Comparator) |
Liam Miller-Cushon |
Google |
(same) |
(same) |
| 2026/06/25 08:20 |
P5 |
security-libs/javax.crypto |
JDK-8385304 |
X25519 should utilize aarch64 intrinsics |
semery |
Unknown |
(same) |
(same) |
| 2026/06/25 07:36 |
P4 |
infrastructure/build |
JDK-8386081 |
Update --release 26 symbol information for JDK 27 build 27 |
Nizar Benalla |
Oracle |
(same) |
(same) |
| 2026/06/25 07:15 |
P3 |
hotspot/compiler |
JDK-8387015 |
C2: crash with "named projection 2 not found" from ArrayCopyNode::finish_transform() for clone |
Roland Westrelin |
Red Hat |
(same) |
(same) |
| 2026/06/24 18:14 |
P4 |
core-libs/java.util:i18n |
JDK-8387185 |
Locale does not respect numeric singletons |
Justin Lu |
Oracle |
(same) |
(same) |
| 2026/06/24 17:37 |
P4 |
hotspot/runtime |
JDK-8387214 |
TraceJavaAssertions is unused |
Coleen Phillimore |
Oracle |
(same) |
(same) |
| 2026/06/24 16:55 |
P4 |
hotspot/runtime |
JDK-8386922 |
Convert TraceRelocator to Unified Logging |
Coleen Phillimore |
Oracle |
(same) |
(same) |
| 2026/06/24 16:13 |
P4 |
tools/launcher |
JDK-8387025 |
Typo in java man page option --illegal-final-field-mutation=warn "performaed" |
Nizar Benalla |
Oracle |
(same) |
(same) |
| 2026/06/24 15:59 |
P3 |
client-libs/2d |
JDK-8041911 |
media sizes with width > height are not supported by the java printing api |
Philip Race |
Oracle |
(same) |
(same) |
| 2026/06/24 15:44 |
P2 |
client-libs/2d |
JDK-8386671 |
Raster factory methods fail to throw specified exceptions for invalid bandOffsets and bankIndices |
Philip Race |
Oracle |
(same) |
(same) |
| 2026/06/24 13:19 |
P3 |
hotspot/runtime |
JDK-8378049 |
test/hotspot/jtreg/runtime/NMT/NMTPrintMallocSiteOfCorruptedMemory.java failing on Windows |
Johan Sjölen |
Oracle |
(same) |
(same) |
| 2026/06/24 10:39 |
P4 |
infrastructure/build |
JDK-8387074 |
Remove duplicate handling of sparc in platform.m4 |
Matthias Baesken |
SAP |
(same) |
(same) |
| 2026/06/24 10:28 |
P4 |
hotspot/svc-agent |
JDK-8382338 |
Various serviceability agent tests fail on Linux x86_64 with LTO enabled |
Matthias Baesken |
SAP |
(same) |
(same) |
| 2026/06/24 10:21 |
P3 |
security-libs/javax.crypto |
JDK-8355216 |
Accelerate P-256 arithmetic on aarch64 |
ferenc.r.rakoczi |
Oracle |
(same) |
(same) |
| 2026/06/24 08:50 |
P4 |
hotspot/gc |
JDK-8381128 |
G1: Tighten accesses to TAMS/TARS |
Thomas Schatzl |
Oracle |
(same) |
(same) |
| 2026/06/24 08:48 |
P4 |
hotspot/gc |
JDK-8385893 |
G1: G1CollectedHeap::_old_marking_cycles_completed should be an Atomic |
Thomas Schatzl |
Oracle |
(same) |
(same) |
| 2026/06/24 08:21 |
P3 |
hotspot/compiler |
JDK-8387012 |
C2: PhaseVector::expand_vunbox_node should not inject the payload type into the load |
Quan Anh Mai |
Independent |
(same) |
(same) |
| 2026/06/24 06:57 |
P4 |
hotspot/gc |
JDK-8387047 |
Shenandoah: Purge SBS::resolve_forwarded |
Aleksey Shipilev |
Amazon |
(same) |
(same) |
| 2026/06/24 06:22 |
P4 |
hotspot/gc |
JDK-8387083 |
G1: Remove redundant NMT tagging from G1RegionToSpaceMapper |
Albert Yang |
Oracle |
(same) |
(same) |
| 2026/06/23 20:11 |
P4 |
hotspot/compiler |
JDK-8386852 |
Lower peak throughput with AOTCache |
Ashutosh Mehra |
Red Hat |
(same) |
(same) |
| 2026/06/23 18:12 |
P4 |
core-libs/java.lang |
JDK-8386965 |
Data race on java.lang.Class.reflectionFactory field |
Man Cao |
Google |
(same) |
(same) |
| 2026/06/23 18:12 |
P3 |
hotspot/gc |
JDK-8387042 |
Shenandoah: Build time regression with LBE |
Aleksey Shipilev |
Amazon |
(same) |
(same) |
| 2026/06/23 17:40 |
P4 |
hotspot/gc |
JDK-8386992 |
Shenandoah: Pad hot atomic counters to avoid false sharing on the allocation path |
Xiaolong Peng |
Amazon |
(same) |
(same) |
| 2026/06/23 17:32 |
P3 |
install/test |
JDK-8387002 |
Test ManualTests/JPackage/JPKG001/JPKG001_004: CommonLicenseTest fails on Windows because the license agreement text is not displayed |
Alexey Semenyuk |
Oracle |
(same) |
(same) |
| 2026/06/23 16:09 |
P4 |
core-libs/java.util:i18n |
JDK-8387041 |
Add a URL link to BCP 47 in the Locale class |
Naoto Sato |
Oracle |
(same) |
(same) |
| 2026/06/23 13:08 |
P4 |
hotspot/compiler |
JDK-8384847 |
Fix documentation typos around ML-KEM and ML-DSA intrinsic code for aarch64 |
Navi.Bereziuk |
Independent |
(same) |
(same) |
| 2026/06/23 12:33 |
P4 |
client-libs/javax.imageio |
JDK-8384512 |
BMPImageWriter uses integer division before Math.ceil causing incorrect calculation |
Jayathirth D V |
Oracle |
(same) |
(same) |
| 2026/06/23 12:08 |
P4 |
core-libs/java.lang |
JDK-8386960 |
BUILD_LIBVERIFY remove special warning settings |
Matthias Baesken |
SAP |
(same) |
(same) |
| 2026/06/23 11:58 |
P4 |
core-libs/java.util.jar |
JDK-8385891 |
Introduce a test for GZIPInputStream whose underlying stream is a blocking InputStream |
Jaikiran Pai |
Oracle |
(same) |
(same) |
| 2026/06/23 09:24 |
P4 |
core-libs/java.util.concurrent |
JDK-8386372 |
Add ConcurrentSkipListMap to map stress test |
Oli Gillespie |
Amazon |
(same) |
(same) |
| 2026/06/23 07:48 |
P3 |
tools/javac |
JDK-8173155 |
JavacTask should have close() method |
dbalek |
Unknown |
(same) |
(same) |
| 2026/06/23 07:31 |
P4 |
infrastructure/build |
JDK-8386878 |
[make] BUILD_LIBZIP_EXCLUDES seems to be unused |
Matthias Baesken |
SAP |
(same) |
(same) |
| 2026/06/23 06:17 |
P4 |
hotspot/compiler |
JDK-8386597 |
C2: TestTruncationWrapFuzzer.java for CountedLoop detection of subword truncated iv |
Emanuel Peter |
Oracle |
(same) |
(same) |
| 2026/06/23 04:37 |
P4 |
hotspot/svc |
JDK-8386325 |
The AttachListener does not do proper exception handling |
Serguei Spitsyn |
Oracle |
(same) |
(same) |
| 2026/06/23 04:10 |
P2 |
hotspot/compiler |
JDK-8386155 |
C2 Vector API: missing truncation in VectorNode::push_through_replicate |
Jatin Bhateja |
Intel |
(same) |
(same) |
| 2026/06/22 21:24 |
P3 |
hotspot/runtime |
JDK-8386562 |
JVM crashes when StackMapTable attribute is too long |
Ioi Lam |
Oracle |
(same) |
(same) |
| 2026/06/22 19:53 |
P4 |
infrastructure/docs |
JDK-8386865 |
Fix links in JDK 27 JavaDoc API documentation |
Hannes Wallnoefer |
Oracle |
(same) |
(same) |
| 2026/06/22 16:54 |
P3 |
globalization/translation |
JDK-8385927 |
JDK 27 RDP1 L10n resource files update |
Justin Lu |
Oracle |
(same) |
(same) |
| 2026/06/22 16:51 |
P3 |
hotspot/jfr |
JDK-8385574 |
JFR: Redaction should check file |
Erik Gahlin |
Oracle |
(same) |
(same) |
| 2026/06/22 13:53 |
P4 |
hotspot/compiler |
JDK-8387017 |
java/lang/instrument/GetObjectSizeIntrinsicsTest.java fails with Error evaluating expression: invalid boolean value: `null' for expression `vm.opt.VerifyOops' |
Manuel Hässig |
Oracle |
(same) |
(same) |
| 2026/06/22 12:41 |
P4 |
hotspot/svc-agent |
JDK-8386944 |
Warning message was not printed on PAC enabled AArch64 Linux |
Yasumasa Suenaga |
NTT DATA |
(same) |
(same) |
| 2026/06/22 11:46 |
P3 |
infrastructure/build |
JDK-8387013 |
Update GitHub Actions |
Christian Stein |
Oracle |
(same) |
(same) |
| 2026/06/22 10:35 |
P4 |
hotspot/compiler |
JDK-8386879 |
PPC64: or_unchecked in OrI instructs can emit unintended SMT priority hints |
David Briemann |
SAP |
(same) |
(same) |
| 2026/06/22 09:25 |
P4 |
hotspot/gc |
JDK-8379983 |
G1: Fix up friend class declarations |
ozanctn |
Amazon |
(same) |
(same) |
| 2026/06/22 08:17 |
P4 |
hotspot/compiler |
JDK-8376803 |
Jtreg test compiler/vectorization/TestVectorAlgorithms.java fails after JDK-8373026 |
Sorna Sarathi |
IBM |
(same) |
(same) |
| 2026/06/22 08:04 |
P4 |
hotspot/compiler |
JDK-8387003 |
Stale doc comment in TrustFinalFields.java after JDK-8376777 |
Joel Sikström |
Oracle |
(same) |
(same) |
| 2026/06/22 07:58 |
P4 |
hotspot/compiler |
JDK-8384251 |
Test java/lang/instrument/GetObjectSizeIntrinsicsTest.java crashed: fatal error: Not compilable at tier 1: CodeBuffer overflow |
Manuel Hässig |
Oracle |
(same) |
(same) |
| 2026/06/21 06:57 |
P4 |
hotspot/compiler |
JDK-8386945 |
RISC-V: Auto-enable Zvbb extension features |
Gui Cao |
Independent |
(same) |
(same) |
| 2026/06/21 03:25 |
P4 |
hotspot/gc |
JDK-8386986 |
Problemlist gc/stress/jfr/TestStressAllocationGCEventsWithShenandoah.java |
Rui Li |
Amazon |
(same) |
(same) |
| 2026/06/20 16:46 |
P3 |
hotspot/compiler |
JDK-8379555 |
Test compiler/igvn/ExpressionFuzzer.java crashed with -Xcomp: Not monotonic |
Quan Anh Mai |
Independent |
(same) |
(same) |
| 2026/06/19 23:20 |
P4 |
hotspot/gc |
JDK-8385594 |
Shenandoah: Remove legacy allocation methods from ShenandoahFreeSet |
Xiaolong Peng |
Amazon |
(same) |
(same) |
| 2026/06/19 19:10 |
P4 |
hotspot/gc |
JDK-8386798 |
Shenandoah: Missing load barrier when making assertions about mark bitmap |
William Kemper |
Amazon |
(same) |
(same) |
| 2026/06/19 07:16 |
P2 |
hotspot/gc |
JDK-8386958 |
Build failure due to incorrect copyright text in src/hotspot/share/gc/shenandoah/ files |
Jaikiran Pai |
Oracle |
(same) |
(same) |
| 2026/06/19 06:55 |
P3 |
hotspot/compiler |
JDK-8386591 |
C2: wrong result because of broken truncation check in CountedLoopConverter::TruncatedIncrement::build |
Emanuel Peter |
Oracle |
(same) |
(same) |
| 2026/06/19 01:32 |
P4 |
core-libs/java.nio.charsets |
JDK-8386810 |
Improve debuggability of test/jdk/sun/nio/cs/TestStringCodingUTF8.java |
Jaikiran Pai |
Oracle |
(same) |
(same) |
| 2026/06/18 21:48 |
P3 |
security-libs/javax.net.ssl |
JDK-8385978 |
Test javax/net/ssl/SSLSession/TestEnabledProtocols.java failed: java.security.cert.CertificateException: Unable to initialize, java.io.IOException: Too short |
Anthony Scarpino |
Oracle |
(same) |
(same) |
| 2026/06/18 21:26 |
P3 |
client-libs/javax.swing |
JDK-8386795 |
Swing specification needs caveats on L&F rendering behaviors |
Philip Race |
Oracle |
(same) |
(same) |
| 2026/06/18 18:29 |
P4 |
hotspot/gc |
JDK-8385596 |
Shenandoah: Introduce per-partition allocators with FreeSet API boundary |
Xiaolong Peng |
Amazon |
(same) |
(same) |
| 2026/06/18 18:29 |
P4 |
hotspot/gc |
JDK-8385592 |
Shenandoah: Introduce ShenandoahAllocator interface to encapsulate memory allocation |
Xiaolong Peng |
Amazon |
(same) |
(same) |
| 2026/06/18 17:16 |
P2 |
security-libs/javax.crypto |
JDK-8386466 |
DESedeKeySpec.isParityAdjusted spec permits 8-byte key but RI throws InvalidKeyException |
semery |
Unknown |
(same) |
(same) |
| 2026/06/18 17:16 |
P2 |
security-libs/javax.crypto |
JDK-8386473 |
DESKeySpec and DESedeKeySpec may throw InvalidKeyException instead of ArrayIndexOutOfBoundsException for Integer.MIN_VALUE offset |
semery |
Unknown |
(same) |
(same) |
| 2026/06/18 16:12 |
P4 |
client-libs/javax.accessibility |
JDK-8381236 |
VoiceOver Fails to Identify Component After Switching Windows |
Jeremy Wood |
Independent |
(same) |
(same) |
| 2026/06/18 16:07 |
P3 |
security-libs/java.security |
JDK-8386681 |
Remove RawKeySpec |
Weijun Wang |
Oracle |
(same) |
(same) |
| 2026/06/18 16:06 |
P4 |
hotspot/gc |
JDK-8386604 |
GenShen: _do_old_gc_bootstrap could become stuck after a full GC |
pfon |
Amazon |
(same) |
(same) |
| 2026/06/18 13:39 |
P3 |
core-libs/javax.naming |
JDK-8154193 |
Move jdk.naming.rmi module to platform class loader |
Jaikiran Pai |
Oracle |
(same) |
(same) |
| 2026/06/18 10:34 |
P3 |
core-libs/java.util.concurrent |
JDK-8386085 |
Livelock in AbstractQueuedSynchronizer.cleanQueue() when multiple threads do tryAcquire() with a short timeout and no permits available |
Viktor Klang |
Oracle |
(same) |
(same) |
| 2026/06/18 09:53 |
P4 |
hotspot/compiler |
JDK-8386762 |
C2: Allow inlining cold methods |
Aleksey Shipilev |
Amazon |
(same) |
(same) |
| 2026/06/18 08:28 |
P4 |
hotspot/gc |
JDK-8386247 |
G1: Cleanup naming and type use of G1CollectionSet class members and methods |
Thomas Schatzl |
Oracle |
(same) |
(same) |
| 2026/06/18 07:17 |
P5 |
infrastructure/build |
JDK-8385987 |
CheckReleaseFile.java fails for the build using the source code without .git |
maeda.otoya |
Fujitsu |
(same) |
(same) |
| 2026/06/18 04:12 |
P2 |
hotspot/compiler |
JDK-8385833 |
C2 Vector API: assert(false) failed: infinite loop in PhaseIterGVN::transform_old |
Jatin Bhateja |
Intel |
(same) |
(same) |
| 2026/06/18 03:24 |
P5 |
client-libs/2d |
JDK-8386109 |
Add missing @Override annotations in "javax.print.*" packages |
Sergey Bylokhov |
Amazon |
(same) |
(same) |
| 2026/06/17 19:22 |
P3 |
client-libs/java.awt |
JDK-8384287 |
java/awt/TextArea/TextAreaCRLFAutoDetectManualTest.java fails after JDK-8340987 |
Manukumar V S |
Oracle |
(same) |
(same) |
| 2026/06/17 16:29 |
P4 |
tools/launcher |
JDK-8385024 |
`JLI_Open()` doesn't correctly handle paths longer than MAXPATH on Windows |
arane |
Unknown |
(same) |
(same) |
| 2026/06/17 16:28 |
P4 |
infrastructure/build |
JDK-8386805 |
Drop ICF optimization from MSVC compilation flags |
arane |
Unknown |
(same) |
(same) |
| 2026/06/17 14:13 |
P4 |
hotspot/test |
JDK-8386107 |
arm32: libSuspendInCritical jtreg library fails to link |
Boris Ulasevich |
BellSoft |
(same) |
(same) |
| 2026/06/17 14:12 |
P3 |
tools/jpackage |
JDK-8386609 |
WinL10nTest.java does not respect locale for WixType |
Alexey Semenyuk |
Oracle |
(same) |
(same) |
| 2026/06/17 13:04 |
P2 |
hotspot/compiler |
JDK-8386831 |
Build fails due to bad copyright header in test/hotspot/jtreg/compiler/onSpinWait/TestOnSpinWaitPPC64.java |
Jaikiran Pai |
Oracle |
(same) |
(same) |
| 2026/06/17 11:47 |
P4 |
hotspot/compiler |
JDK-8386808 |
AArch64: Sync aarch64_vector.ad with aarch64_vector_ad.m4 after JDK-8370691 |
erfang |
Unknown |
(same) |
(same) |
| 2026/06/17 09:03 |
P4 |
hotspot/compiler |
JDK-8386637 |
PPC64: Implement Thread.onSpinWait() intrinsic and SpinPause() using SMT priority hints |
David Briemann |
SAP |
(same) |
(same) |
| 2026/06/17 08:23 |
P4 |
hotspot/runtime |
JDK-8386659 |
PPC: cleanup dtrace leftovers part 2 |
David Briemann |
SAP |
(same) |
(same) |
| 2026/06/17 08:20 |
P4 |
hotspot/compiler |
JDK-8386669 |
AArch64: Distinguish ldr and ldrw literal instructions in NativeInstruction |
Joel Sikström |
Oracle |
(same) |
(same) |
| 2026/06/17 07:54 |
P3 |
core-libs/java.lang.classfile |
JDK-8386700 |
Class-File API: StackMapGenerator.setLocalsFromArg leaves stale locals, generating invalid stack maps |
Adam Sotona |
Oracle |
(same) |
(same) |
| 2026/06/17 06:30 |
P4 |
hotspot/compiler |
JDK-8382052 |
VectorAPI: Optimize the lanewise BITWISE_BLEND for AArch64 |
erfang |
Unknown |
(same) |
(same) |
| 2026/06/17 00:33 |
P4 |
hotspot/jvmti |
JDK-8383879 |
assert(_cur_stack_depth == num_frames) failed: cur_stack_depth out of sync _cur_stack_depth: 9 num_frames: 10 |
Leonid Mesnik |
Oracle |
(same) |
(same) |
| 2026/06/16 21:05 |
P4 |
hotspot/gc |
JDK-8386547 |
Shenandoah: remove unused variables in Freeset reserve_regions |
Rui Li |
Amazon |
(same) |
(same) |
| 2026/06/16 21:03 |
P4 |
hotspot/gc |
JDK-8382335 |
gc/stress/jfr/TestStressAllocationGCEventsWithShenandoah.java intermittently fails with OOME |
Rui Li |
Amazon |
(same) |
(same) |
| 2026/06/16 17:42 |
P3 |
hotspot/runtime |
JDK-8385661 |
jvmti/vthread/ThreadStateTest/ThreadStateTest.java triggers assert(f.pc() == _chunk->pc()) failed |
Patricio Chilano Mateo |
Oracle |
(same) |
(same) |
| 2026/06/16 17:13 |
P4 |
core-libs/java.net |
JDK-8385906 |
DirPermissionDenied.java uses chmod instead of Java APIs for changing permissions |
arane |
Unknown |
(same) |
(same) |
| 2026/06/16 16:00 |
P4 |
hotspot/gc |
JDK-8386288 |
GenShen: assert(region->get_top_before_promote() == nullptr) failed: Cannot add region scheduled for in-place-promotion to the collection set |
pfon |
Amazon |
(same) |
(same) |
| 2026/06/16 13:46 |
P4 |
hotspot/gc |
JDK-8386707 |
[BACKOUT] ZGC: Incorrect object undo in relocation race for relocation workers |
Joel Sikström |
Oracle |
(same) |
(same) |
| 2026/06/16 12:58 |
P4 |
hotspot/compiler |
JDK-8385746 |
S390: Improve receiver type profiling reliability |
Amit Kumar |
IBM |
(same) |
(same) |
| 2026/06/16 11:52 |
P4 |
tools/jlink |
JDK-8386334 |
JdepsTask keeps --system files open |
dusan.balek |
Oracle |
(same) |
(same) |
| 2026/06/16 06:52 |
P4 |
tools/javac |
JDK-8386654 |
Test tools/javac/SystemFilesClosed.java fails on systems without lsof |
dusan.balek |
Oracle |
(same) |
(same) |
| 2026/06/16 06:47 |
P3 |
hotspot/compiler |
JDK-8375694 |
C2: Dead loop constructed with CastPP in late inlining |
Roland Westrelin |
Red Hat |
(same) |
(same) |
| 2026/06/16 00:52 |
P4 |
infrastructure/build |
JDK-8386625 |
Devkit could not be built on glibc 2.43+ |
Yasumasa Suenaga |
NTT DATA |
(same) |
(same) |
| 2026/06/15 20:08 |
P3 |
hotspot/compiler |
JDK-8385651 |
HotCodeSampler crashes with JFR enabled |
Chad Rakoczy |
Amazon |
(same) |
(same) |
| 2026/06/15 19:45 |
P4 |
hotspot/gc |
JDK-8386683 |
GenShen: assert(starts_object(card_index)) failed: Can't get last start because no object starts here |
William Kemper |
Amazon |
(same) |
(same) |
| 2026/06/15 18:21 |
P4 |
hotspot/compiler |
JDK-8385119 |
Unify boolean value normalization |
Vladimir Ivanov |
Oracle |
(same) |
(same) |
| 2026/06/15 16:30 |
P4 |
hotspot/svc-agent |
JDK-8386124 |
Test serviceability/sa/TestG1HeapRegion.java failed: Address of G1HeapRegion does not match |
Chris Plummer |
Oracle |
(same) |
(same) |
| 2026/06/15 14:55 |
P4 |
client-libs/javax.swing |
JDK-8382063 |
Jtreg test javax/swing/SwingWorker/TestDoneBeforeDoInBackground.java fails |
Arno Zeller |
SAP |
(same) |
(same) |
| 2026/06/15 13:14 |
P3 |
hotspot/gc |
JDK-8386332 |
G1: Cleanup pause incorrectly updates old gen MemoryPoolMXBean.getCollectionUsage() |
Thomas Schatzl |
Oracle |
(same) |
(same) |
| 2026/06/15 12:34 |
P3 |
hotspot/jfr |
JDK-8386485 |
JFR: RecordingFile::write overwrites original file |
Erik Gahlin |
Oracle |
(same) |
(same) |
| 2026/06/15 12:01 |
P4 |
hotspot/compiler |
JDK-8384963 |
C2: Incorrect uint constant match mishandles negative values in vectors |
Jatin Bhateja |
Intel |
(same) |
(same) |
| 2026/06/15 10:10 |
P4 |
hotspot/gc |
JDK-8385873 |
G1: G1ConcurrentRefineSweepTask::_sweep_completed should be Atomic |
Thomas Schatzl |
Oracle |
(same) |
(same) |
| 2026/06/15 07:56 |
P3 |
hotspot/compiler |
JDK-8385855 |
C2: IfNode::filtered_int_type should only allow CmpI |
Emanuel Peter |
Oracle |
(same) |
(same) |
| 2026/06/15 07:27 |
P4 |
tools/jconsole |
JDK-8385817 |
Headless jdk still contains bin/jconsole |
Matthias Baesken |
SAP |
(same) |
(same) |
| 2026/06/15 07:08 |
P3 |
hotspot/compiler |
JDK-8386482 |
C2 CountedLoopConverter::filtered_type_from_dominators: assert(_base == Int) failed: Not an Int |
Emanuel Peter |
Oracle |
(same) |
(same) |
| 2026/06/13 13:02 |
P3 |
tools/javadoc(tool) |
JDK-8386589 |
Permitting a preview subclass should not produce a preview note |
Chen Liang |
Oracle |
(same) |
(same) |
| 2026/06/12 21:30 |
P4 |
hotspot/gc |
JDK-8380390 |
Shenandoah: Missing store barrier when resetting bitmaps |
William Kemper |
Amazon |
(same) |
(same) |
| 2026/06/12 20:55 |
P4 |
hotspot/gc |
JDK-8385732 |
Shenandoah: Penalize triggering heuristics for out-of-cycle degenerated |
Kelvin Nilsen |
Amazon |
(same) |
(same) |
| 2026/06/12 19:39 |
P4 |
hotspot/compiler |
JDK-8386460 |
Report AOT code loading failure before log of AOT code cache content |
Vladimir Kozlov |
Oracle |
(same) |
(same) |
| 2026/06/12 18:25 |
P4 |
tools/javac |
JDK-8386601 |
Rename LANGUAGE_MODEL preview feature to PREVIEW_SUPPORT |
Chen Liang |
Oracle |
(same) |
(same) |
| 2026/06/12 18:00 |
P3 |
hotspot/gc |
JDK-8382627 |
Shenandoah: assert(old_reserve_result + young_reserve_result <= old_available + young_available) failed |
Kelvin Nilsen |
Amazon |
(same) |
(same) |
| 2026/06/12 17:08 |
P3 |
security-libs/javax.net.ssl |
JDK-8386600 |
Fix comparison checks in DHasKEM |
Haimay Chao |
Oracle |
(same) |
(same) |
| 2026/06/12 17:05 |
P3 |
security-libs/javax.net.ssl |
JDK-8301626 |
Capture Named Group information in TLSHandshakeEvent |
Sean Mullan |
Oracle |
(same) |
(same) |
| 2026/06/12 15:08 |
P4 |
hotspot/runtime |
JDK-8386476 |
NMT: Large page reservation not attributed to the correct memory tag |
Albert Yang |
Oracle |
(same) |
(same) |
| 2026/06/12 10:46 |
P4 |
hotspot/jfr |
JDK-8385892 |
TestResidentSetSizeEvent fails with RuntimeException: Should be non-zero: expected 0 > 0 |
Matthias Baesken |
SAP |
(same) |
(same) |
| 2026/06/12 08:56 |
P4 |
hotspot/gc |
JDK-8385899 |
G1: G1ConcurrentMarkThread::_state should be Atomic |
Thomas Schatzl |
Oracle |
(same) |
(same) |
| 2026/06/12 08:56 |
P4 |
hotspot/runtime |
JDK-8386344 |
runtime/StackGuardPages/TestStackGuardPages build failure after JDK-8303612 |
Harald Eilertsen |
Independent |
(same) |
(same) |
| 2026/06/12 08:53 |
P4 |
hotspot/gc |
JDK-8385901 |
G1: G1FullGCPrepareTask::_has_free_compaction_targets should be Atomic |
Thomas Schatzl |
Oracle |
(same) |
(same) |
| 2026/06/12 06:27 |
P4 |
tools/jlink |
JDK-8357249 |
Compiler task keeps --system files open |
dusan.balek |
Oracle |
(same) |
(same) |
| 2026/06/12 05:26 |
P2 |
infrastructure/build |
JDK-8386551 |
Windows build broken because of MSys2/Make update |
arane |
Unknown |
(same) |
(same) |
| 2026/06/11 22:52 |
P4 |
hotspot/gc |
JDK-8386204 |
GenShen: Bootstrap cycles are misidentified in logs |
pfon |
Amazon |
(same) |
(same) |
| 2026/06/11 18:26 |
P4 |
core-libs/java.time |
JDK-8386328 |
TemporalField.adjustInto Javadoc incorrectly uses 1-argument method signatures |
Naoto Sato |
Oracle |
(same) |
(same) |
| 2026/06/11 17:41 |
P4 |
hotspot/gc |
JDK-8386312 |
Shenandoah: Incorrect assertion in ShenandoahAllocRate uses is_locked() instead of owned_by_self() |
Xiaolong Peng |
Amazon |
(same) |
(same) |
| 2026/06/11 17:22 |
P4 |
client-libs/javax.sound |
JDK-8386273 |
Some javax/sound/sampled tests fail on systems with high CPU core number and running with high concurrency |
Philip Race |
Oracle |
(same) |
(same) |
| 2026/06/11 16:35 |
P4 |
hotspot/gc |
JDK-8386202 |
Genshen: Regulator thread reporting hiccup times proportional to safepoint times |
pfon |
Amazon |
(same) |
(same) |
| 2026/06/11 09:18 |
P4 |
hotspot/jfr |
JDK-8386345 |
Remove redundant @requires from TestGarbageCollectionEventWithZMinor |
Goetz Lindenmaier |
SAP |
(same) |
(same) |
| 2026/06/11 08:03 |
P4 |
infrastructure/build |
JDK-8385123 |
Remove 32-bit x86 support for Linux devkits |
Yasumasa Suenaga |
NTT DATA |
(same) |
(same) |
| 2026/06/11 07:46 |
P4 |
hotspot/runtime |
JDK-8386456 |
Comments at the declaration of frame::frame_alignment are incorrect on some platforms |
Richard Reingruber |
SAP |
(same) |
(same) |
| 2026/06/11 06:43 |
P4 |
hotspot/runtime |
JDK-8386331 |
Skip runtime/StackGuardPages/TestStackGuardPagesNative with static JDK |
Aleksey Shipilev |
Amazon |
(same) |
(same) |
| 2026/06/11 04:29 |
P4 |
hotspot/compiler |
JDK-8385588 |
Tune APX support in C2 backend |
Derek White |
Intel |
(same) |
(same) |
| 2026/06/11 03:03 |
P4 |
hotspot/compiler |
JDK-8370691 |
Add new Float16Vector type and enable intrinsification of vector operations supported by auto-vectorizer |
Jatin Bhateja |
Intel |
(same) |
(same) |
| 2026/06/10 17:35 |
P3 |
security-libs/java.security |
JDK-8383608 |
Make BinaryEncodable non-exhaustive |
Anthony Scarpino |
Oracle |
(same) |
(same) |
| 2026/06/10 17:22 |
P4 |
core-libs/java.util:i18n |
JDK-8380993 |
[REDO] Incorrect Interpretation of POSIX TZ Environment Variable on AIX |
srutjay1 |
IBM |
(same) |
(same) |
| 2026/06/10 16:29 |
P4 |
hotspot/gc |
JDK-8386323 |
Remove unused MemoryPool allocation availability state |
Albert Yang |
Oracle |
(same) |
(same) |
| 2026/06/10 16:27 |
P4 |
hotspot/runtime |
JDK-8385427 |
Make unified logging checks in tests tolerant of added spaces |
Navi.Bereziuk |
Independent |
(same) |
(same) |
| 2026/06/10 10:13 |
P5 |
hotspot/gc |
JDK-8386252 |
Shenandoah: Polish LRB argument preparation |
Aleksey Shipilev |
Amazon |
(same) |
(same) |
| 2026/06/10 08:43 |
P4 |
hotspot/compiler |
JDK-8386161 |
RISC-V: Auto-enable Zvkn/Zvkg extension features |
Gui Cao |
Independent |
(same) |
(same) |
| 2026/06/10 08:18 |
P4 |
hotspot/gc |
JDK-8386254 |
Parallel: Adjust Pointers should use stripes in young spaces |
Ivan Walulya |
Oracle |
(same) |
(same) |
| 2026/06/10 06:55 |
P4 |
hotspot/gc |
JDK-8386098 |
Add empty MemRegion precondition to CardTable methods |
Albert Yang |
Oracle |
(same) |
(same) |
| 2026/06/09 23:00 |
P4 |
hotspot/compiler |
JDK-8349563 |
Improve AbsNode::Value() for integer types |
Jasmine Karthikeyan |
Independent |
(same) |
(same) |
| 2026/06/09 19:22 |
P5 |
hotspot/gc |
JDK-8385961 |
Shenandoah: incorrect assert ordering in ShenandoahFreeSet::allocate_contiguous non-humongous path |
Xiaolong Peng |
Amazon |
(same) |
(same) |
| 2026/06/09 17:35 |
P5 |
security-libs/javax.net.ssl |
JDK-8386203 |
Use CRC32C checksum instead of Adler32 for stateless session ticket |
Artur Barashev |
Oracle |
(same) |
(same) |
| 2026/06/09 16:28 |
P4 |
core-libs/java.text |
JDK-8386200 |
ListFormat incorrectly escapes single quotes |
Justin Lu |
Oracle |
(same) |
(same) |
| 2026/06/09 16:00 |
P4 |
client-libs/java.awt |
JDK-8291470 |
Description change for mouseMoved method in java.awt.event.MouseMotionAdapter |
Alexey Ivanov |
Oracle |
(same) |
(same) |
| 2026/06/09 12:56 |
P4 |
core-svc/javax.management |
JDK-8385839 |
JMX config file correction |
Kevin Walls |
Oracle |
(same) |
(same) |
| 2026/06/09 09:12 |
P4 |
hotspot/runtime |
JDK-8386150 |
VtablesTest.java fails when main thread is a Virtual Thread |
Amit Kumar |
IBM |
(same) |
(same) |
| 2026/06/09 09:09 |
P4 |
hotspot/gc |
JDK-8385989 |
Remove mention of obsoleted/removed ParallelRefProcEnabled in documentation |
Thomas Schatzl |
Oracle |
(same) |
(same) |
| 2026/06/09 09:06 |
P4 |
infrastructure/other |
JDK-8385950 |
Git: add ignore revisions file |
Manuel Hässig |
Oracle |
(same) |
(same) |
| 2026/06/09 07:25 |
P4 |
hotspot/gc |
JDK-8385454 |
Provide more NUMA related information in hsinfo/hserr files |
Matthias Baesken |
SAP |
(same) |
(same) |
| 2026/06/09 05:14 |
P4 |
hotspot/compiler |
JDK-8385166 |
PPC: C2: c_return_value and return_value should not set 2nd OptoRegPair for Op_RegI |
Richard Reingruber |
SAP |
(same) |
(same) |
| 2026/06/08 22:01 |
P4 |
hotspot/runtime |
JDK-8384844 |
Remove expired flags in JDK 28 |
David Holmes |
Oracle |
(same) |
(same) |
| 2026/06/08 21:21 |
P4 |
hotspot/gc |
JDK-8385933 |
GenShen: Remove ShenandoahAgingCyclePeriod |
pfon |
Amazon |
(same) |
(same) |
| 2026/06/08 19:15 |
P3 |
hotspot/runtime |
JDK-8385806 |
Assert failed when running Skynet.java with continuation trace logging enabled |
Patricio Chilano Mateo |
Oracle |
(same) |
(same) |
| 2026/06/08 16:35 |
P3 |
hotspot/runtime |
JDK-8385655 |
Timeout in java/lang/Thread/virtual/KlassInit.java |
Patricio Chilano Mateo |
Oracle |
(same) |
(same) |
| 2026/06/08 16:28 |
P4 |
core-libs/java.text |
JDK-8385834 |
Tighten ListFormat.getInstance(String[]) behavior for invalid placeholders |
Naoto Sato |
Oracle |
(same) |
(same) |
| 2026/06/08 16:09 |
P4 |
hotspot/jvmti |
JDK-8386138 |
Problem-list JvmtiGetAllModulesTest.java |
Christian Stein |
Oracle |
(same) |
(same) |
| 2026/06/08 15:45 |
P5 |
hotspot/gc |
JDK-8385975 |
Shenandoah: remove leftover ShenandoahPacer declarations in ShenandoahHeap |
Xiaolong Peng |
Amazon |
(same) |
(same) |
| 2026/06/08 14:17 |
P3 |
core-libs/java.util.concurrent |
JDK-8385830 |
ForkJoinTask#get may swallow caller thread's interrupt flag |
Viktor Klang |
Oracle |
(same) |
(same) |
| 2026/06/08 12:51 |
P3 |
security-libs/javax.net.ssl |
JDK-8374454 |
Test sun/security/ssl/CipherSuite/DisabledCipherSuitesNotNegotiated.java from JDK-8356544 shows intermittent timeouts |
Matthew Donovan |
Oracle |
(same) |
(same) |
| 2026/06/08 11:05 |
P4 |
tools/javadoc(tool) |
JDK-8385506 |
Fix some remaining CSS issues |
Hannes Wallnoefer |
Oracle |
(same) |
(same) |
| 2026/06/08 11:00 |
P4 |
tools/javadoc(tool) |
JDK-8383906 |
Target highlight in member details is too aggressive |
Hannes Wallnoefer |
Oracle |
(same) |
(same) |
| 2026/06/08 10:57 |
P4 |
tools/javadoc(tool) |
JDK-8384065 |
Improve wrapping of link labels in the table of contents |
Hannes Wallnoefer |
Oracle |
(same) |
(same) |
| 2026/06/08 09:46 |
P4 |
hotspot/runtime |
JDK-8386130 |
TestPrintMethodData.java failing with VirtualThread as main thread |
Amit Kumar |
IBM |
(same) |
(same) |
| 2026/06/08 08:55 |
P4 |
hotspot/runtime |
JDK-8303612 |
runtime/StackGuardPages/TestStackGuardPagesNative.java fails with exit code 139 |
Johan Sjölen |
Oracle |
(same) |
(same) |
| 2026/06/08 08:48 |
P4 |
core-svc/tools |
JDK-8385964 |
AttachProvider docs update: 'doors' to 'socket' |
Kevin Walls |
Oracle |
(same) |
(same) |
| 2026/06/08 07:39 |
P4 |
hotspot/runtime |
JDK-8385991 |
Use StringTable's statistics method in Dictionary |
Johan Sjölen |
Oracle |
(same) |
(same) |
| 2026/06/06 05:31 |
P4 |
hotspot/runtime |
JDK-8385586 |
Fix race in Windows map_or_reserve_memory_aligned using VirtualAlloc2 and MapViewOfFile3 |
Robert Toyonaga |
Red Hat |
(same) |
(same) |
| 2026/06/06 02:28 |
P4 |
infrastructure/build |
JDK-8385988 |
Linux devkits does not work with dnf5 |
Yasumasa Suenaga |
NTT DATA |
(same) |
(same) |
| 2026/06/06 01:37 |
P4 |
core-libs/java.net |
JDK-8383248 |
Reduce buffer allocations for HTTP headers instead of allocating 16KB per request |
253344819+raneashay |
Independent |
(same) |
(same) |
| 2026/06/05 19:05 |
P4 |
client-libs/javax.accessibility |
JDK-8385302 |
Open source accessibility AWT tests |
Lawrence Andrews |
Oracle |
(same) |
(same) |
| 2026/06/05 17:35 |
P4 |
infrastructure/release_eng |
JDK-8386082 |
Rectify JDK 28 GA date to 2027-03-23 |
Nizar Benalla |
Oracle |
(same) |
(same) |
| 2026/06/05 16:41 |
P4 |
hotspot/svc-agent |
JDK-8385723 |
Intermittent failure of serviceability/sa/ClhsdbInspect.java |
Chris Plummer |
Oracle |
(same) |
(same) |
| 2026/06/05 16:34 |
P4 |
infrastructure |
JDK-8384848 |
Update JCov for class file version 72 |
Aleksandre Iline |
Oracle |
(same) |
(same) |
| 2026/06/05 16:20 |
P5 |
security-libs/javax.crypto |
JDK-8371305 |
X25519 should utilize x86 intrinsics |
semery |
Unknown |
(same) |
(same) |
| 2026/06/05 14:59 |
P4 |
hotspot/gc |
JDK-8385728 |
Serial: Check empty MemRegion in maintain_old_to_young_invariant |
Albert Yang |
Oracle |
(same) |
(same) |
| 2026/06/05 13:05 |
P4 |
hotspot/compiler |
JDK-8381766 |
AArch64: extend MacroAssembler increment/decrement/and/or to use 24-bit immediate operands |
Andrew Haley |
Red Hat |
(same) |
(same) |
| 2026/06/05 07:33 |
P3 |
hotspot/gc |
JDK-8385369 |
G1: Concurrent Cleanup For Next Mark accesses uncommitted bitmaps after region uncommit |
Thomas Schatzl |
Oracle |
(same) |
(same) |
| 2026/06/05 05:44 |
P4 |
hotspot/compiler |
JDK-8381618 |
VectorExpressionFuzzer.java: enable test for all platforms |
Emanuel Peter |
Oracle |
(same) |
(same) |
| 2026/06/05 00:10 |
P3 |
tools/jlink |
JDK-8385355 |
NullPointerException in jdk.tools.jlink.internal.ImageResourcesTree after JDK-8377070 |
Xueming Shen |
Oracle |
(same) |
(same) |
| 2026/06/04 23:07 |
P4 |
infrastructure/build |
JDK-8385660 |
Audit and remove unnecessary lint categories from $DISABLED_WARNINGS |
Archie Cobbs |
Independent |
(same) |
(same) |
| 2026/06/04 20:43 |
P4 |
tools/javac |
JDK-8385974 |
Update symbol information for jdk-28+0 |
Chen Liang |
Oracle |
(same) |
(same) |
| 2026/06/04 19:36 |
P4 |
hotspot/compiler |
JDK-8384606 |
HotCodeHeap tests require C2 |
Chad Rakoczy |
Amazon |
(same) |
(same) |
| 2026/06/04 19:09 |
P3 |
client-libs/2d |
JDK-8385100 |
Null pointer dereference in java.desktop/windows/classes/sun/print/Win32PrintJob.java:606 and other PrintJob implementations |
Philip Race |
Oracle |
(same) |
(same) |
| 2026/06/04 16:06 |
P4 |
tools/javac |
JDK-8384842 |
Add source 28 and target 28 to javac |
Nizar Benalla |
Oracle |
(same) |
(same) |
| 2026/06/04 16:06 |
P4 |
core-libs/javax.lang.model |
JDK-8384838 |
Add SourceVersion.RELEASE_28 |
Nizar Benalla |
Oracle |
(same) |
(same) |
| 2026/06/04 16:06 |
P4 |
core-libs/java.lang:reflect |
JDK-8384833 |
Start of release updates for JDK 28 |
Nizar Benalla |
Oracle |
(same) |
(same) |
| 2026/05/29 16:03 |
P3 |
hotspot/compiler |
JDK-8383767 |
C2: assert(curr_ctrl->in(0)->Opcode() == Op_If) failed: unexpected node MemBarStoreStore |
Anton Seoane Ampudia |
Oracle |
(same) |
(same) |
| 2026/04/23 06:17 |
P4 |
hotspot/compiler |
JDK-8381362 |
C2: assert(_late_inlines.length() == 0 || IncrementalInlineMH || IncrementalInlineVirtual) failed: not empty |
Damon Fenacci |
Oracle |
(same) |
(same) |