PUSHES REPORT: 8u102

This report shows who pushed the backports to the given release. This usually shows who did the backporting, testing, and review work.

Report generated: Mon Nov 08 19:26:42 CET 2021

Distribution by priority

Count Priority
3 P1
49 P2
64 P3
41 P4
1 P5

Distribution by components

Count Component
158 100% Total
56 35.4% security-libs
22 13.9% security-libs/java.security
13 8.2% security-libs/javax.crypto
9 5.7% security-libs/javax.net.ssl
8 5.1% security-libs/javax.security
2 1.3% security-libs/javax.xml.crypto
2 1.3% security-libs/javax.crypto:pkcs11
32 20.3% hotspot
13 8.2% hotspot/compiler
9 5.7% hotspot/gc
6 3.8% hotspot/runtime
3 1.9% hotspot/jvmti
1 0.6% hotspot/svc
30 19.0% core-libs
6 3.8% core-libs/java.net
5 3.2% core-libs/jdk.nashorn
5 3.2% core-libs
2 1.3% core-libs/java.lang.invoke
2 1.3% core-libs/javax.naming
2 1.3% core-libs/java.lang
1 0.6% core-libs/java.rmi
1 0.6% core-libs/java.util
1 0.6% core-libs/java.nio
1 0.6% core-libs/java.util.logging
1 0.6% core-libs/java.util:collections
1 0.6% core-libs/java.text
1 0.6% core-libs/java.util:i18n
1 0.6% core-libs/java.util.jar
16 10.1% client-libs
5 3.2% client-libs/2d
5 3.2% client-libs/javax.swing
4 2.5% client-libs/java.awt
1 0.6% client-libs
1 0.6% client-libs/javax.accessibility
10 6.3% core-svc
5 3.2% core-svc/debugger
3 1.9% core-svc/java.lang.management
1 0.6% core-svc/tools
1 0.6% core-svc/javax.management
8 5.1% xml
4 2.5% xml/jaxp
3 1.9% xml/jaxb
1 0.6% xml/javax.xml.parsers
5 3.2% tools
4 2.5% tools/javac
1 0.6% tools
1 0.6% other-libs
1 0.6% other-libs/corba

Distribution by affiliation

Count Committer
158 100% Total
77 48.7% Oracle
18 11.4% Sean Coffey
9 5.7% Alexander Potochkin
9 5.7% Aleksej Efimov
8 5.1% Andreas Eriksson
5 3.2% Robert Mckenna
5 3.2% Poonam Bajaj Parhar
4 2.5% Kevin Walls
3 1.9% Mikhail Cherkasov
3 1.9% David Buck
2 1.3% Sundararajan Athijegannathan
2 1.3% Tobias Hartmann
2 1.3% Anton Litvinov
2 1.3% Maurizio Cimadamore
1 0.6% Daniel Fuchs
1 0.6% Vincent Ryan
1 0.6% Vladimir Ivanov
1 0.6% Alexey Ivanov
1 0.6% Dmitry Markov
43 27.2% Azul
43 27.2% Konstantin Shefov
14 8.9% Independent
10 6.3% Abhijit Saha
3 1.9% Michael Haupt
1 0.6% Dmitriy Samersoff
11 7.0% Google
11 7.0% Ivan Gerasimov
5 3.2% Red Hat
2 1.3% Omair Majid
1 0.6% Aleksey Shipilev
1 0.6% Andrew Hughes
1 0.6% Roland Westrelin
4 2.5% BellSoft
4 2.5% Alexandr Scherbatiy
3 1.9% DataDog
3 1.9% Jaroslav Bachorík
1 0.6% Amazon
1 0.6% Sergey Bylokhov

Chronological push log:

Days Ago Committer Affiliation Bug Summary
2026 Sean Coffey Oracle JDK-8154807 Improve exception messages in URLPermission
2026 Andreas Eriksson Oracle JDK-8154422 assert(_exits.control()->is_top() || !_gvn.type(ret_phi)->empty()) failed: return value must be well defined
2026 Andreas Eriksson Oracle JDK-8154421 C2 can not handle returns with incompatible interface arrays
2026 Andreas Eriksson Oracle JDK-8149721 Use of Solaris/SPARC M7 libadimalloc.so can generate unknown signal in hs_err file
2027 Andreas Eriksson Oracle JDK-8153641 assert(thread_state == _thread_in_native) failed: Assumed thread_in_native while heap dump
2027 Alexander Potochkin Oracle JDK-8154868 Additional tests for MAC algorithms
2027 Alexander Potochkin Oracle JDK-8154866 Test PKCS8Test.java fails
2027 Alexander Potochkin Oracle JDK-8146118 PKCS basic tests
2027 Alexander Potochkin Oracle JDK-8154862 More MessageDigest tests
2027 Alexander Potochkin Oracle JDK-8154858 Need new tests for X509V3 certificates
2028 Vladimir Ivanov Oracle JDK-8152759 Compiler runtime entries don't hold Klass* from being GCed
2028 Michael Haupt Independent JDK-8154583 Remove sun.invoke.anon classes, or move / co-locate them with tests
2028 Robert Mckenna Oracle JDK-8154062 DateFormatSymbols triggers this.clone() in the constructor
2028 Abhijit Saha Independent JDK-8154643 Lambda method names are unnecessarily unstable
2028 Abhijit Saha Independent JDK-8154639 [TEST_BUG] jdb has succeded to read an unreadable file
2028 Abhijit Saha Independent JDK-8154638 [TEST_BUG]: com/sun/jdi/JdbReadTwiceTest.sh fails when run under root
2028 Abhijit Saha Independent JDK-8154637 [TEST_BUG] Tab characters in test/com/sun/jdi files
2028 Abhijit Saha Independent JDK-8154634 [TEST_BUG] javax/security/auth/SubjectDomainCombiner/Optimize.java should use 4-args ProtectionDomain constructor
2028 Abhijit Saha Independent JDK-8154632 [TEST_BUG] ClientJSSEServerJSSE.java failing again
2028 Abhijit Saha Independent JDK-8154627 Text Overlapping on Dot Matrix Printers
2028 Abhijit Saha Independent JDK-8154625 [Parfait] JNI exception pending in fontpath.c:1300
2028 Abhijit Saha Independent JDK-8154622 Scrollbar thumb disappears with Nimbus L&F
2030 Sean Coffey Oracle JDK-8154425 NullpointerException at LdapReferralException.getReferralContext
2033 Alexey Ivanov Oracle JDK-8154232 Windows - With LCD antialiasing, some glyphs are not rendered correctly
2033 Sean Coffey Oracle JDK-8154282 Include sun.arch.data.model as a property that can be queried by jtreg
2033 Sean Coffey Oracle JDK-8154281 RestrictTestMaxCachedBufferSize.java to 64-bit platforms
2033 Sean Coffey Oracle JDK-8153975 (bf) Allow users to bound the size of buffers cached in the per-thread buffer caches
2034 Alexander Potochkin Oracle JDK-8154246 Need new tests for AES cipher
2034 Alexander Potochkin Oracle JDK-8154245 Additional tests for CertPath API
2034 Alexander Potochkin Oracle JDK-8154244 Additional negative tests for XML signature processing
2034 Alexander Potochkin Oracle JDK-8154242 ProcessTool.createJavaProcessBuilder() needs new addTestVmAndJavaOptions argument
2036 Ivan Gerasimov Google JDK-8150500 Use final restricted flag
2036 Sean Coffey Oracle JDK-8154092 [TESTBUG] javax/security/auth/Subject/doAs/NestedActions.java fails if extra VM options are given
2036 Sean Coffey Oracle JDK-8154091 Privilege tests with JAAS Subject.doAs
2036 Dmitriy Samersoff Independent JDK-8154019 [BACKOUT] JDWP: Memory Leak: GlobalRefs never deleted when processing invokeMethod command
2037 Konstantin Shefov Azul JDK-8153977 Tests for RSA keys and key specifications
2037 Konstantin Shefov Azul JDK-8152466 More Signature tests
2037 Alexandr Scherbatiy BellSoft JDK-8153962 VS2010 ThemeReader.cpp(758) : error C3861: 'round': identifier not found
2037 Alexandr Scherbatiy BellSoft JDK-8153961 [hidpi] JLabel font is twice bigger than JTextArea font on Windows 7,HiDPI, Windows L&F
2037 Alexandr Scherbatiy BellSoft JDK-8153960 [hidpi] JFileChooser does not scale properly on Windows with HiDPI display and Windows L&F
2037 Alexandr Scherbatiy BellSoft JDK-8153959 Text size is twice bigger under Windows L&F on Win 8.1 with HiDPI display
2037 Sean Coffey Oracle JDK-8153714 LdapCtx.processReturnCode() throwing Null Pointer Exception
2041 Sean Coffey Oracle JDK-8153726 Improve exception messaging for RSAClientKeyExchange
2042 Ivan Gerasimov Google JDK-8153338 MSCAPI keystore should accept Certificate[] in setEntry()
2042 Ivan Gerasimov Google JDK-8153336 MSCAPI provider does not create unique alias names
2043 Poonam Bajaj Parhar Oracle JDK-8150661 gc/ergonomics/TestDynamicNumberOfGCThreads.java failed with java.lang.RuntimeException: 'new_active_workers' missing from stdout/stderr
2044 Sean Coffey Oracle JDK-8151731 Add new jtreg keywords to jdk 8
2045 Ivan Gerasimov Google JDK-8152548 Delayed provider selection broken in RSA client key exchange.
2046 Robert Mckenna Oracle JDK-8151131 Hashtable deserialization reconstitutes table with wrong capacity
2047 Aleksej Efimov Oracle JDK-8153296 Unmarshaller unmarshalls XML element which doesn't have the expected namespace
2047 Dmitry Markov Oracle JDK-8153255 Some Monospaced logical fonts have a different width
2047 Kevin Walls Oracle JDK-8150518 G1 GC crashes at G1CollectedHeap::do_collection_pause_at_safepoint(double)
2049 Andreas Eriksson Oracle JDK-8151113 Check for the validity of oop before printing it in verify_remembered_set
2049 Andrew Hughes Red Hat JDK-8153048 JDWP: Memory Leak: GlobalRefs never deleted when processing invokeMethod command
2050 Sean Coffey Oracle JDK-8146123 Implement tests for new functionality provided in JEP 166
2050 Sean Coffey Oracle JDK-8142944 Remove requirement that AKID and SKID have to match when building certificate chain
2050 David Buck Oracle JDK-8152643 Javac compiles method reference that allows results in an IllegalAccessError
2050 Aleksej Efimov Oracle JDK-8152943 Schemagen fails with StackOverflowError if element references containing class
2051 Aleksej Efimov Oracle JDK-8151843 XALAN: ERROR: 'No more DTM IDs are available' when transforming with lots of temporary result trees
2053 Abhijit Saha Independent JDK-8150896 Java Access Bridge, getAccessibleStatesStringFromContext doesn't wrap the call to getAccessibleRole
2054 Robert Mckenna Oracle JDK-8152766 NetworkInterface.getNetworkInterfaces() triggers intermittent test failures
2055 Aleksej Efimov Oracle JDK-8152414 JAXB marshaller fails with ClassCastException on classes generated by xjc
2058 Konstantin Shefov Azul JDK-8152328 LoginContext tests to cover JDK-4703361
2058 Konstantin Shefov Azul JDK-8152326 Permission tests for "setFactory"
2058 Konstantin Shefov Azul JDK-8152324 Additional SASL client-server tests
2058 Konstantin Shefov Azul JDK-8152323 Tests for syntax checking of JAAS configuration file
2058 Konstantin Shefov Azul JDK-8152322 Implement tests for SecretKeyFactory
2058 Konstantin Shefov Azul JDK-8152321 Need new regressions tests for MessageDigest with DigestIOStream
2058 Konstantin Shefov Azul JDK-8152319 Implement tests for converting PKCS12 keystores
2058 Konstantin Shefov Azul JDK-8152318 Tests for PKCS12 read operations
2058 Konstantin Shefov Azul JDK-8152317 Tests for PKCS12 write operations
2058 Konstantin Shefov Azul JDK-8152316 Tests for JAAS callbacks
2061 Ivan Gerasimov Google JDK-8152098 Fix 8151522 caused test compiler/intrinsics/squaretolen/TestSquareToLen.java to fail
2061 Omair Majid Red Hat JDK-8151519 Find and load default.sf2 as the default soundbank on Linux
2062 Konstantin Shefov Azul JDK-8145420 JVM/TI test ex03t001 fails assertion
2062 Konstantin Shefov Azul JDK-8152096 Tests for SealedObject
2062 Konstantin Shefov Azul JDK-8152095 Additional tests for signature algorithm OIDs and transformation string
2062 Konstantin Shefov Azul JDK-8152094 Implement reliability test for DH algorithm
2062 Konstantin Shefov Azul JDK-8152093 Tests for AEAD ciphers
2062 Konstantin Shefov Azul JDK-8152092 Tests added in JDK-8048604 fail to compile
2062 Konstantin Shefov Azul JDK-8152091 Tests for strong crypto ciphers
2062 Sean Coffey Oracle JDK-8151535 TESTBUG: java/lang/invoke/AccessControlTest.java should be modified to run with JTREG 4.1 b13
2063 Sean Coffey Oracle JDK-8151574 [TEST_BUG] jdk/test/sample fails with "effective library path is outside the test suite"
2063 Poonam Bajaj Parhar Oracle JDK-8151948 ParallelGCThreads is not calculated correctly
2064 Konstantin Shefov Azul JDK-8145422 ReferenceType.isStatic() returns true for arrays
2068 Konstantin Shefov Azul JDK-8151718 Test doPrivileged with accomplice
2068 Konstantin Shefov Azul JDK-8151717 Need new regressions tests for buffer handling for PBE algorithms
2070 Mikhail Cherkasov Oracle JDK-8151554 Disable 8130150 and 8081778 intrinsics by default
2070 Mikhail Cherkasov Oracle JDK-8150152 Implement BigInteger.montgomeryMultiply intrinsic
2071 Andreas Eriksson Oracle JDK-8151294 com/sun/jdi/RedefineAddPrivateMethod.sh fails intermittently
2071 Kevin Walls Oracle JDK-8150927 libjvm crash due to stack overflow in executables with 32k tbss/tdata
2075 Andreas Eriksson Oracle JDK-8141632 heapDumper.cpp: assert(length_in_bytes > 0) failed: nothing to copy
2075 Kevin Walls Oracle JDK-8147606 Fix initializations before ShouldNotReachHere() etc. and enable -Wuninitialized on linux.
2075 Konstantin Shefov Azul JDK-8151197 [TEST_BUG] Need to backport fix for test/javax/net/ssl/TLS/TestJSSE.java
2075 Konstantin Shefov Azul JDK-8151279 Tests for key wrap and unwrap operations
2075 Konstantin Shefov Azul JDK-8151278 Test key generation of DES and DESEDE
2075 Konstantin Shefov Azul JDK-8151277 javax/net/ssl/TLS/TestJSSE.java failed on Mac
2075 Konstantin Shefov Azul JDK-8151275 A typo in CipherTestUtils test
2075 Konstantin Shefov Azul JDK-8151274 Need new tests for java client server communications with various TLS/SSL combinations
2075 Konstantin Shefov Azul JDK-8151273 JAAS login/logout tests with LoginContext
2075 Konstantin Shefov Azul JDK-8151272 javax/net/ssl/TLS/TLSClientPropertyTest.java needs to be updated for JDK-8061210
2075 Konstantin Shefov Azul JDK-8151271 New tests for TLS property jdk.tls.client.protocols
2075 Konstantin Shefov Azul JDK-8145814 Need new regression tests for PBE keys
2075 Ivan Gerasimov Google JDK-8151027 Capacity of StringBuilder should not get close to Integer.MAX_VALUE unless necessary
2076 Daniel Fuchs Oracle JDK-8151139 Missing @since Javadoc tag in Logger.log(Level, Supplier)
2076 Sergey Bylokhov Amazon JDK-8151109 [macosx] JScrollPane jitters up/down during trackpad scrolling on MacOS/Aqua
2077 Maurizio Cimadamore Oracle JDK-8151012 java.lang.VerifyError: Bad local variable type - local final String
2077 Andreas Eriksson Oracle JDK-8150716 JVM crash after debugger hotswap with lambdas
2077 Konstantin Shefov Azul JDK-8145770 [TESTBUG] test/runtime/NMT/VirtualAllocCommitUncommitRecommit.java fails on Solaris Sparc due to incorrect page size being used
2079 Roland Westrelin Red Hat JDK-8150852 range check CastII nodes should not be split through Phi
2079 Konstantin Shefov Azul JDK-8145763 [TESTBUG] Conflicting GC combinations in jdk tests
2079 Aleksej Efimov Oracle JDK-8150835 JCK: api/xsl/conf/copy/copy19 test failure
2079 Aleksej Efimov Oracle JDK-8150834 enabling validate-annotations feature for xsd schema with annotation causes NPE
2082 Konstantin Shefov Azul JDK-8138989 Refactor jps utility tests
2083 Kevin Walls Oracle JDK-8150211 get_ctrl_no_update() code is wrong
2083 Sundararajan Athijegannathan Oracle JDK-8150640 jdk.nashorn.api.scripting spec. adjustments, clarifications
2090 Konstantin Shefov Azul JDK-8150177 New permission tests for JEP 140
2090 David Buck Oracle JDK-8149347 G1: guarantee fails with UseDynamicNumberOfGCThreads
2090 Mikhail Cherkasov Oracle JDK-8150164 DataFlavorComparator transitivity exception
2090 Konstantin Shefov Azul JDK-8150157 SecureRandom default provider tests
2090 Sean Coffey Oracle JDK-8146763 ORB destroy() leaks filedescriptors after unsuccessful connection
2091 Vincent Ryan Oracle JDK-8149822 PKCS12KeyStore cannot extract AES Secret Keys
2091 Poonam Bajaj Parhar Oracle JDK-8149752 Provide more granular levels for GC verification
2091 Ivan Gerasimov Google JDK-8135259 InetAddress.getAllByName only reports "unknown error" instead of actual cause
2091 Konstantin Shefov Azul JDK-8150037 java/net/SocketPermission/SocketPermissionTest.java fails intermittently
2091 Konstantin Shefov Azul JDK-8150036 Add SocketPermission tests for legacy socket types
2091 Ivan Gerasimov Google JDK-8150024 Use Intel x64 CPU instructions for RSA acceleration
2092 Poonam Bajaj Parhar Oracle JDK-8149719 Remove PICL warning message
2092 Tobias Hartmann Oracle JDK-8149473 MethodHandle inlining with long/double arguments is broken in C2
2093 Michael Haupt Independent JDK-8149817 fix testng.jar delivery in Nashorn build.xml
2093 Jaroslav Bachorík DataDog JDK-8149809 JMXInterfaceBindingTest is failing intermittently for IPv6 addresses
2093 Jaroslav Bachorík DataDog JDK-8149808 JMXInterfaceBindingTest is failing intermittently
2093 Jaroslav Bachorík DataDog JDK-8148845 Allow specifying an address to bind JMX remote connector
2094 Aleksej Efimov Oracle JDK-8149659 (tz) Support tzdata2016a
2096 Konstantin Shefov Azul JDK-8145997 [TEST_BUG] Test SoftReference and OOM behavior
2096 Konstantin Shefov Azul JDK-8145761 ThreadMXBean/Locks.java failed, blocked on wrong object.
2097 Sean Coffey Oracle JDK-8149029 Secure validation of XML based digital signature always enabled when checking wrapping attacks
2097 Omair Majid Red Hat JDK-8149609 setWMClass fails to null-terminate WM_CLASS string
2098 Ivan Gerasimov Google JDK-8057151 sun.rmi.transport.DGCAckHandler leaks memory
2099 Michael Haupt Independent JDK-8149443 JSON.parse(JSON.stringify([])).push(10) creates an array containing two elements
2103 Robert Mckenna Oracle JDK-8149132 Thread spinning on WeakHashMap.getEntry() with concurrent use of nashorn
2103 Aleksej Efimov Oracle JDK-8145030 Supplementary characters are rejected in comments
2103 Aleksej Efimov Oracle JDK-8149113 Suppress not recognized property/feature warning messages from SAXParser
2104 Sundararajan Athijegannathan Oracle JDK-8149032 Call site profiling fails on braces-wrapped anonymous function
2105 Konstantin Shefov Azul JDK-8148954 [Newtest][TEST_BUG] New stress test for changing the coarseness level of G1 remembered set
2105 Anton Litvinov Oracle JDK-8148959 javax.swing.TimerQueue: timer fires late when another timer starts
2106 Anton Litvinov Oracle JDK-8148173 AWT components are not drawn after removal and addition to a container
2106 Sean Coffey Oracle JDK-8148035 URLConnection.guessContentTypeFromStream returns image/jpg for some JPEG images
2106 Aleksey Shipilev Red Hat JDK-8148842 Thread.getName() instantiates Strings
2106 Poonam Bajaj Parhar Oracle JDK-8148806 Add the facility to verify remembered sets for G1
2107 Sean Coffey Oracle JDK-8145851 Add support to jarsigner for specifying timestamp hash algorithm
2110 Konstantin Shefov Azul JDK-8145768 [TESTBUG] sun/tools/native2ascii/NativeErrors.java fails: Process exit code was 0, but error was expected.
2111 Robert Mckenna Oracle JDK-8144988 Unexpected timezone returned after parsing a date
2111 David Buck Oracle JDK-8145401 [TEST_BUG] compiler/loopopts/CountedLoopProblem.java got OOME
2112 Tobias Hartmann Oracle JDK-8147548 need comprehensive fix for unconstrained ConvI2L with narrowed type
2112 Maurizio Cimadamore Oracle JDK-8148152 Inference: NodeNotFoundException thrown with deep generic method call chain
2113 Ivan Gerasimov Google JDK-8148201 Add test for JDK-8049321
2113 Ivan Gerasimov Google JDK-8145842 Support SHA224withDSA and SHA256withDSA in the SunJSSE provider

No changesets log

JDK-8182548 Release Note: Set 32 or 64 bit JRE requirements in a JNLP file
JDK-8179702 Release Note: 32/64-bit interoperability in Java Web Start
JDK-8177825 Release Note: Ability to limit the capacity of buffers that can be held in the temporary buffer cache
JDK-8175380 Release Note: .oracle_jre_usage folder no longer created in C:\Users\myName
JDK-8173678 Release Note: With UseG1GC, specifying -XX:ParallelGCThreads=0 is no longer allowed
JDK-8171401 Release Note: Fixed memory leak when Java objects are passed into JavaScript
JDK-8166780 Threads may do significant work out of the non-shared overflow buffer
JDK-8166779 InetAddress.isReachable returns true for non existing IP addresses
JDK-8166084 Avoid repeated "Please insert a smart card" popup windows
JDK-8165778 Release Note: Modify requirements on Authority Key Identifier extension field during X509 certificate chain building
JDK-8164414 Release Note: New system property for the remote JMX connector
JDK-8164161 [macosx] Press "To Back" button on the Dialog,the Dialog moves behind the Frame
JDK-8164158 Release Note: Support SHA224withDSA and SHA256withDSA in the SunJSSE provider
JDK-8163296 Release Note: Internal package sun.invoke.anon has been removed
JDK-8162937 LDAP "follow" throws ClassCastException with Java 8
JDK-8162936 [macosx] Chinese Comma cannot be entered using Pinyin Input Method on OS X
JDK-8162935 Make handling of 3rd party providers more stable
JDK-8162934 [macosx] java 7 and 8 JDialogs on multiscreen jump to parent frame on focus
JDK-8160585 On Mac Install Run javawslauncher.app to register protocol handler with Launch Services
JDK-8160584 Partially initialized string object created by C2's string concat optimization may escape
JDK-8160582 Change JavawsLauncher.app to use NSTask or execv
JDK-8160581 Add a URL scheme handler to reliably launch .jnlp files - Mac registration part
JDK-8160579 Desktop shortcut is not updated after JNLP is changed in deployment cache
JDK-8159661 JEditorPane.createEditorKitForContentType throws NPE after 6882559
JDK-8159660 new JEditorPane("text/plain","") fails for null context class loader
JDK-8159659 Math.pow yields different results upon repeated calls
JDK-8158945 Release Note: Fix to resolve "Unable to process PreMasterSecret, may be too big" issue
JDK-8158944 Release Note: Improved exception handling for bad LDAP referral replies
JDK-8158941 Release Note: Removed PICL warning message
JDK-8158940 Release Note: Providing more granular levels for GC verification
JDK-8158936 Release Note: Implemented performance improvements for BigInteger.montgomeryMultiply
JDK-8158935 Release Note: New property jdk.lang.processReaperUseDefaultStackSize
JDK-8158844 (tz) Support tzdata2016d
JDK-8158841 Webstart loads JARs from MANIFEST.MF after loading the jars from resources-tag
JDK-8158835 Application started using javaws now starts in {java.home} rather than current directory
JDK-8158834 System property 'user.dir' now set to 'java.home' value rather than user's working directory
JDK-8158716 Personalized Windows Font Size is not taken into account in Java8u102
JDK-8158241 [TreeTableView] graphic property of TreeItem is still visible after collapsing tree
JDK-8157640 Add new IdenTrust roots
JDK-8157639 Add new DTrust roots
JDK-8157617 Test gc/ergonomics/TestDynamicNumberOfGCThreads.java fails
JDK-8157056 XMLStreamWriter produces invalid XML for surrogate pairs on OutputStreamWriter
JDK-8157051 Intermittent crash when disposing MediaPlayer
JDK-8157047 Intermittent hang in GSTMedia.gstDispose
JDK-8155870 [TEST BUG] Test SSLSession/SessionCacheSizeTests socket accept timed out
JDK-8155869 [TEST BUG] test SessionCacheSizeTests.java timeout
JDK-8155868 Test SessionTimeOutTests fails intermittently
JDK-8155867 Test SessionTimeOutTests can be timeout
JDK-8155569 [TEST_BUG] test/closed/security/infra/java/security/cert/CertPathValidator/certification/ValidatePathWithParams.java needs modification
JDK-8155565 Remove "UTN - DATACorp SGC" Root CA Certificate
JDK-8155534 Deployment Toolkit should recognize IE Metro for Windows 8 and provide appropriate default response
JDK-8155531 Race Condition can cause CacheEntry.getJarSigningData() to return null.
JDK-8154950 [Mac] SecurityException when constructing WebView from JFXPanel application
JDK-8154912 JVM crash while using JavaFW WebView and colgroup/cols html feature
JDK-8154886 JavaScript2Java Bridge: A char value cannot be set from JavaScript
JDK-8154803 Update license text in javadoc footer for FX API docs
JDK-8154798 Update copyright header for files modified in 2016
JDK-8154699 Add new QuoVadis roots
JDK-8154698 Add new DigiCert roots
JDK-8154685 Updating Java in MAC OS X 10.11 fails with color picker pop with the final dialog
JDK-8154672 JRE 8u65 installer doesn't work on Windows Server
JDK-8154662 Javaws checks jar files twice if JVM needs to be restarted
JDK-8154654 AddRemoveTest tests fail as second request to jnlp not getting to server, but resource requests going through fine
JDK-8154651 _releaseObject called from wrong thread
JDK-8154645 Test jnlp_file/applicationDesc/index.html\#args is failing
JDK-8154644 Regression in Applet startup time with Internet Explorer on 8u60 and 8u65-b14
JDK-8154490 Webkit: Conversion from string literal loses const qualifier
JDK-8154378 Provide media support for libav version 55 and 56
JDK-8154310 Replace sun.net.www.ParseUtil#decode with public API
JDK-8154198 Defer image decoding until WebCore requests ImageFrame
JDK-8154032 JFXMedia Player EventQueueThread does not always terminate
JDK-8154024 Upgrade production compilers on Windows to Visual Studio 2013 SP4
JDK-8153857 Crash in ResourceLoader::releaseResources()
JDK-8153785 Call JavaScriptCore GC whenever JVM GC happens
JDK-8153329 JavaFX CSS is applied redundantly leading to significant performance degradation
JDK-8153311 [TEST BUG] SceneGraphTests can't be run with aurora
JDK-8153233 Validation of new behaviour for JS callback memory leak
JDK-8153226 URL Scheme handler problem
JDK-8152914 Crash in RuntimeObject::put when object passed to JSObject::setMember is GCed
JDK-8152735 JavaFX Gradle build script fails with Gradle 2.12
JDK-8151741 WebView leaks memory when containing object acts as javascript callback handler
JDK-8151578 Cleanup whitespace after fix for JDK-8149537
JDK-8151577 JavaFX WebView performance regression when inserting html via javascript
JDK-8151437 Need to make improvement to access temporary dir
JDK-8151326 Some WebNode tests crash JVM
JDK-8151316 [Dialog] ButtonType text not updated when Locale changes
JDK-8151309 JavaFX Application Performance Issue
JDK-8151148 [TEST BUG] Fix imports for com.sun.javafx.Utils
JDK-8151050 Cleanup whitespace in WebView.java after fix for JDK-8147851
JDK-8151035 jvm crash at javafx com.sun.webkit.WebPage.twkPrePaint
JDK-8150979 Spinner throws a ClassCastException under Linux
JDK-8150977 JRE crash in com.sun.webkit.network.URLLoader.twkDidFinishLoading
JDK-8150780 Repeated offer and remove on ConcurrentLinkedQueue lead to an OutOfMemoryError
JDK-8150549 WebView crashes on Yahoo login page
JDK-8150286 make checkrepo executable bit optional
JDK-8150184 [TEST] Unit tests for JFXPanel with security manager don't detect errors
JDK-8150062 cannot relaunch to alternate architecture
JDK-8150061 Platform.getInstalledJREList() returns only the jres of the current arch on windows.
JDK-8150060 Uninstaller Error occurs while trying to uninstall apps imported by 32 bit JWS on 64 bit systems
JDK-8150059 64 bit only app may have problems when initially launched with 32 bit javaws
JDK-8150058 re enable secure launcher for cross platform launches.
JDK-8150057 Provide a way to specify JRE data model requirements in JNLP file
JDK-8149551 checkrepo should suggest -a
JDK-8149414 Several fast/regions/webkit-* tests fail
JDK-8149063 Allow relaunch between 32 / 64 bit versions in Java Web Start when you have latest versions of both
JDK-8149057 Better exception messaging in Ucrypto code
JDK-8148848 sun.security.mscapi.KeyStore might load incomplete data
JDK-8148811 Add regression test for JDK-8136495
JDK-8148807 Remove SHA224 from the default support list if SunMSCAPI enabled
JDK-8148451 Slider: snapToTicks not honoured on changing to true
JDK-8134300 .oracle_jre_usage folder must not be created in C:\Users\myName

Committer push log

Aleksej Efimov, Oracle

Bug Summary
JDK-8149659 (tz) Support tzdata2016a
JDK-8150834 enabling validate-annotations feature for xsd schema with annotation causes NPE
JDK-8152414 JAXB marshaller fails with ClassCastException on classes generated by xjc
JDK-8150835 JCK: api/xsl/conf/copy/copy19 test failure
JDK-8152943 Schemagen fails with StackOverflowError if element references containing class
JDK-8145030 Supplementary characters are rejected in comments
JDK-8149113 Suppress not recognized property/feature warning messages from SAXParser
JDK-8153296 Unmarshaller unmarshalls XML element which doesn't have the expected namespace
JDK-8151843 XALAN: ERROR: 'No more DTM IDs are available' when transforming with lots of temporary result trees

Andreas Eriksson, Oracle

Bug Summary
JDK-8154422 assert(_exits.control()->is_top() || !_gvn.type(ret_phi)->empty()) failed: return value must be well defined
JDK-8153641 assert(thread_state == _thread_in_native) failed: Assumed thread_in_native while heap dump
JDK-8154421 C2 can not handle returns with incompatible interface arrays
JDK-8151113 Check for the validity of oop before printing it in verify_remembered_set
JDK-8151294 com/sun/jdi/RedefineAddPrivateMethod.sh fails intermittently
JDK-8141632 heapDumper.cpp: assert(length_in_bytes > 0) failed: nothing to copy
JDK-8150716 JVM crash after debugger hotswap with lambdas
JDK-8149721 Use of Solaris/SPARC M7 libadimalloc.so can generate unknown signal in hs_err file

Alexey Ivanov, Oracle

Bug Summary
JDK-8154232 Windows - With LCD antialiasing, some glyphs are not rendered correctly

Alexander Potochkin, Oracle

Bug Summary
JDK-8154244 Additional negative tests for XML signature processing
JDK-8154245 Additional tests for CertPath API
JDK-8154868 Additional tests for MAC algorithms
JDK-8154862 More MessageDigest tests
JDK-8154246 Need new tests for AES cipher
JDK-8154858 Need new tests for X509V3 certificates
JDK-8146118 PKCS basic tests
JDK-8154242 ProcessTool.createJavaProcessBuilder() needs new addTestVmAndJavaOptions argument
JDK-8154866 Test PKCS8Test.java fails

Alexandr Scherbatiy, BellSoft

Bug Summary
JDK-8153960 [hidpi] JFileChooser does not scale properly on Windows with HiDPI display and Windows L&F
JDK-8153961 [hidpi] JLabel font is twice bigger than JTextArea font on Windows 7,HiDPI, Windows L&F
JDK-8153959 Text size is twice bigger under Windows L&F on Win 8.1 with HiDPI display
JDK-8153962 VS2010 ThemeReader.cpp(758) : error C3861: 'round': identifier not found

Anton Litvinov, Oracle

Bug Summary
JDK-8148173 AWT components are not drawn after removal and addition to a container
JDK-8148959 javax.swing.TimerQueue: timer fires late when another timer starts

Andrew Hughes, Red Hat

Bug Summary
JDK-8153048 JDWP: Memory Leak: GlobalRefs never deleted when processing invokeMethod command

Abhijit Saha, Independent

Bug Summary
JDK-8154625 [Parfait] JNI exception pending in fontpath.c:1300
JDK-8154632 [TEST_BUG] ClientJSSEServerJSSE.java failing again
JDK-8154634 [TEST_BUG] javax/security/auth/SubjectDomainCombiner/Optimize.java should use 4-args ProtectionDomain constructor
JDK-8154639 [TEST_BUG] jdb has succeded to read an unreadable file
JDK-8154637 [TEST_BUG] Tab characters in test/com/sun/jdi files
JDK-8154638 [TEST_BUG]: com/sun/jdi/JdbReadTwiceTest.sh fails when run under root
JDK-8150896 Java Access Bridge, getAccessibleStatesStringFromContext doesn't wrap the call to getAccessibleRole
JDK-8154643 Lambda method names are unnecessarily unstable
JDK-8154622 Scrollbar thumb disappears with Nimbus L&F
JDK-8154627 Text Overlapping on Dot Matrix Printers

Sean Coffey, Oracle

Bug Summary
JDK-8153975 (bf) Allow users to bound the size of buffers cached in the per-thread buffer caches
JDK-8151574 [TEST_BUG] jdk/test/sample fails with "effective library path is outside the test suite"
JDK-8154092 [TESTBUG] javax/security/auth/Subject/doAs/NestedActions.java fails if extra VM options are given
JDK-8151731 Add new jtreg keywords to jdk 8
JDK-8145851 Add support to jarsigner for specifying timestamp hash algorithm
JDK-8146123 Implement tests for new functionality provided in JEP 166
JDK-8154807 Improve exception messages in URLPermission
JDK-8153726 Improve exception messaging for RSAClientKeyExchange
JDK-8154282 Include sun.arch.data.model as a property that can be queried by jtreg
JDK-8153714 LdapCtx.processReturnCode() throwing Null Pointer Exception
JDK-8154425 NullpointerException at LdapReferralException.getReferralContext
JDK-8146763 ORB destroy() leaks filedescriptors after unsuccessful connection
JDK-8154091 Privilege tests with JAAS Subject.doAs
JDK-8142944 Remove requirement that AKID and SKID have to match when building certificate chain
JDK-8154281 RestrictTestMaxCachedBufferSize.java to 64-bit platforms
JDK-8149029 Secure validation of XML based digital signature always enabled when checking wrapping attacks
JDK-8151535 TESTBUG: java/lang/invoke/AccessControlTest.java should be modified to run with JTREG 4.1 b13
JDK-8148035 URLConnection.guessContentTypeFromStream returns image/jpg for some JPEG images

David Buck, Oracle

Bug Summary
JDK-8145401 [TEST_BUG] compiler/loopopts/CountedLoopProblem.java got OOME
JDK-8149347 G1: guarantee fails with UseDynamicNumberOfGCThreads
JDK-8152643 Javac compiles method reference that allows results in an IllegalAccessError

Daniel Fuchs, Oracle

Bug Summary
JDK-8151139 Missing @since Javadoc tag in Logger.log(Level, Supplier)

Dmitry Markov, Oracle

Bug Summary
JDK-8153255 Some Monospaced logical fonts have a different width

Dmitriy Samersoff, Independent

Bug Summary
JDK-8154019 [BACKOUT] JDWP: Memory Leak: GlobalRefs never deleted when processing invokeMethod command

Ivan Gerasimov, Google

Bug Summary
JDK-8148201 Add test for JDK-8049321
JDK-8151027 Capacity of StringBuilder should not get close to Integer.MAX_VALUE unless necessary
JDK-8152548 Delayed provider selection broken in RSA client key exchange.
JDK-8152098 Fix 8151522 caused test compiler/intrinsics/squaretolen/TestSquareToLen.java to fail
JDK-8135259 InetAddress.getAllByName only reports "unknown error" instead of actual cause
JDK-8153338 MSCAPI keystore should accept Certificate[] in setEntry()
JDK-8153336 MSCAPI provider does not create unique alias names
JDK-8057151 sun.rmi.transport.DGCAckHandler leaks memory
JDK-8145842 Support SHA224withDSA and SHA256withDSA in the SunJSSE provider
JDK-8150500 Use final restricted flag
JDK-8150024 Use Intel x64 CPU instructions for RSA acceleration

Jaroslav Bachorík, DataDog

Bug Summary
JDK-8148845 Allow specifying an address to bind JMX remote connector
JDK-8149808 JMXInterfaceBindingTest is failing intermittently
JDK-8149809 JMXInterfaceBindingTest is failing intermittently for IPv6 addresses

Kevin Walls, Oracle

Bug Summary
JDK-8147606 Fix initializations before ShouldNotReachHere() etc. and enable -Wuninitialized on linux.
JDK-8150518 G1 GC crashes at G1CollectedHeap::do_collection_pause_at_safepoint(double)
JDK-8150211 get_ctrl_no_update() code is wrong
JDK-8150927 libjvm crash due to stack overflow in executables with 32k tbss/tdata

Konstantin Shefov, Azul

Bug Summary
JDK-8148954 [Newtest][TEST_BUG] New stress test for changing the coarseness level of G1 remembered set
JDK-8151197 [TEST_BUG] Need to backport fix for test/javax/net/ssl/TLS/TestJSSE.java
JDK-8145997 [TEST_BUG] Test SoftReference and OOM behavior
JDK-8145763 [TESTBUG] Conflicting GC combinations in jdk tests
JDK-8145768 [TESTBUG] sun/tools/native2ascii/NativeErrors.java fails: Process exit code was 0, but error was expected.
JDK-8145770 [TESTBUG] test/runtime/NMT/VirtualAllocCommitUncommitRecommit.java fails on Solaris Sparc due to incorrect page size being used
JDK-8151275 A typo in CipherTestUtils test
JDK-8150036 Add SocketPermission tests for legacy socket types
JDK-8152324 Additional SASL client-server tests
JDK-8152095 Additional tests for signature algorithm OIDs and transformation string
JDK-8152094 Implement reliability test for DH algorithm
JDK-8152319 Implement tests for converting PKCS12 keystores
JDK-8152322 Implement tests for SecretKeyFactory
JDK-8151273 JAAS login/logout tests with LoginContext
JDK-8150037 java/net/SocketPermission/SocketPermissionTest.java fails intermittently
JDK-8151277 javax/net/ssl/TLS/TestJSSE.java failed on Mac
JDK-8151272 javax/net/ssl/TLS/TLSClientPropertyTest.java needs to be updated for JDK-8061210
JDK-8145420 JVM/TI test ex03t001 fails assertion
JDK-8152328 LoginContext tests to cover JDK-4703361
JDK-8152466 More Signature tests
JDK-8145814 Need new regression tests for PBE keys
JDK-8151717 Need new regressions tests for buffer handling for PBE algorithms
JDK-8152321 Need new regressions tests for MessageDigest with DigestIOStream
JDK-8151274 Need new tests for java client server communications with various TLS/SSL combinations
JDK-8150177 New permission tests for JEP 140
JDK-8151271 New tests for TLS property jdk.tls.client.protocols
JDK-8152326 Permission tests for "setFactory"
JDK-8138989 Refactor jps utility tests
JDK-8145422 ReferenceType.isStatic() returns true for arrays
JDK-8150157 SecureRandom default provider tests
JDK-8151718 Test doPrivileged with accomplice
JDK-8151278 Test key generation of DES and DESEDE
JDK-8152092 Tests added in JDK-8048604 fail to compile
JDK-8152093 Tests for AEAD ciphers
JDK-8152316 Tests for JAAS callbacks
JDK-8151279 Tests for key wrap and unwrap operations
JDK-8152318 Tests for PKCS12 read operations
JDK-8152317 Tests for PKCS12 write operations
JDK-8153977 Tests for RSA keys and key specifications
JDK-8152096 Tests for SealedObject
JDK-8152091 Tests for strong crypto ciphers
JDK-8152323 Tests for syntax checking of JAAS configuration file
JDK-8145761 ThreadMXBean/Locks.java failed, blocked on wrong object.

Mikhail Cherkasov, Oracle

Bug Summary
JDK-8150164 DataFlavorComparator transitivity exception
JDK-8151554 Disable 8130150 and 8081778 intrinsics by default
JDK-8150152 Implement BigInteger.montgomeryMultiply intrinsic

Maurizio Cimadamore, Oracle

Bug Summary
JDK-8148152 Inference: NodeNotFoundException thrown with deep generic method call chain
JDK-8151012 java.lang.VerifyError: Bad local variable type - local final String

Michael Haupt, Independent

Bug Summary
JDK-8149817 fix testng.jar delivery in Nashorn build.xml
JDK-8149443 JSON.parse(JSON.stringify([])).push(10) creates an array containing two elements
JDK-8154583 Remove sun.invoke.anon classes, or move / co-locate them with tests

Omair Majid, Red Hat

Bug Summary
JDK-8151519 Find and load default.sf2 as the default soundbank on Linux
JDK-8149609 setWMClass fails to null-terminate WM_CLASS string

Poonam Bajaj Parhar, Oracle

Bug Summary
JDK-8148806 Add the facility to verify remembered sets for G1
JDK-8150661 gc/ergonomics/TestDynamicNumberOfGCThreads.java failed with java.lang.RuntimeException: 'new_active_workers' missing from stdout/stderr
JDK-8151948 ParallelGCThreads is not calculated correctly
JDK-8149752 Provide more granular levels for GC verification
JDK-8149719 Remove PICL warning message

Robert Mckenna, Oracle

Bug Summary
JDK-8154062 DateFormatSymbols triggers this.clone() in the constructor
JDK-8151131 Hashtable deserialization reconstitutes table with wrong capacity
JDK-8152766 NetworkInterface.getNetworkInterfaces() triggers intermittent test failures
JDK-8149132 Thread spinning on WeakHashMap.getEntry() with concurrent use of nashorn
JDK-8144988 Unexpected timezone returned after parsing a date

Roland Westrelin, Red Hat

Bug Summary
JDK-8150852 range check CastII nodes should not be split through Phi

Sergey Bylokhov, Amazon

Bug Summary
JDK-8151109 [macosx] JScrollPane jitters up/down during trackpad scrolling on MacOS/Aqua

Aleksey Shipilev, Red Hat

Bug Summary
JDK-8148842 Thread.getName() instantiates Strings

Sundararajan Athijegannathan, Oracle

Bug Summary
JDK-8149032 Call site profiling fails on braces-wrapped anonymous function
JDK-8150640 jdk.nashorn.api.scripting spec. adjustments, clarifications

Tobias Hartmann, Oracle

Bug Summary
JDK-8149473 MethodHandle inlining with long/double arguments is broken in C2
JDK-8147548 need comprehensive fix for unconstrained ConvI2L with narrowed type

Vincent Ryan, Oracle

Bug Summary
JDK-8149822 PKCS12KeyStore cannot extract AES Secret Keys

Vladimir Ivanov, Oracle

Bug Summary
JDK-8152759 Compiler runtime entries don't hold Klass* from being GCed