PUSHES REPORT: 8u152

This report shows who pushed the backports to the given release. This usually shows who did the backporting, testing, and review work.

Report generated: Mon Nov 08 19:35:26 CET 2021

Distribution by priority

Count Priority
5 P1
87 P2
124 P3
64 P4
3 P5

Distribution by components

Count Component
283 100% Total
76 26.9% client-libs
32 11.3% client-libs/java.awt
22 7.8% client-libs/2d
11 3.9% client-libs/javax.swing
7 2.5% client-libs/javax.accessibility
1 0.4% client-libs
1 0.4% client-libs/javax.sound
1 0.4% client-libs/java.beans
1 0.4% client-libs/java.awt:i18n
75 26.5% core-libs
19 6.7% core-libs/java.net
10 3.5% core-libs/java.time
9 3.2% core-libs/jdk.nashorn
6 2.1% core-libs/java.util:i18n
6 2.1% core-libs/javax.naming
6 2.1% core-libs/java.lang
3 1.1% core-libs/java.util.concurrent
3 1.1% core-libs/java.nio
3 1.1% core-libs/java.io
2 0.7% core-libs/java.rmi
2 0.7% core-libs
1 0.4% core-libs/java.io:serialization
1 0.4% core-libs/java.util
1 0.4% core-libs/java.util.regex
1 0.4% core-libs/java.util:collections
1 0.4% core-libs/java.lang:reflect
1 0.4% core-libs/java.util.jar
70 24.7% hotspot
39 13.8% hotspot/compiler
14 4.9% hotspot/runtime
9 3.2% hotspot/gc
4 1.4% hotspot/jvmti
2 0.7% hotspot/svc
1 0.4% hotspot/svc-agent
1 0.4% hotspot/test
40 14.1% security-libs
15 5.3% security-libs/java.security
12 4.2% security-libs/javax.net.ssl
3 1.1% security-libs/javax.smartcardio
3 1.1% security-libs/javax.crypto
3 1.1% security-libs/org.ietf.jgss:krb5
2 0.7% security-libs/javax.security
1 0.4% security-libs/javax.xml.crypto
1 0.4% security-libs
9 3.2% xml
3 1.1% xml/jax-ws
2 0.7% xml/jaxp
2 0.7% xml
1 0.4% xml/javax.xml.transform
1 0.4% xml/org.w3c.dom
4 1.4% core-svc
2 0.7% core-svc/debugger
1 0.4% core-svc
1 0.4% core-svc/java.lang.management
3 1.1% other-libs
1 0.4% other-libs
1 0.4% other-libs/other
1 0.4% other-libs/corba
3 1.1% tools
2 0.7% tools/javac
1 0.4% tools
2 0.7% infrastructure
1 0.4% infrastructure/build
1 0.4% infrastructure/licensing
1 0.4% deploy
1 0.4% deploy/webstart

Distribution by affiliation

Count Committer
283 100% Total
203 71.7% Oracle
24 8.5% Mikhail Cherkasov
23 8.1% Robert Mckenna
22 7.8% Sean Coffey
14 4.9% Dmitry Markov
14 4.9% Kevin Walls
13 4.6% Tobias Hartmann
12 4.2% Philip Race
11 3.9% David Buck
10 3.5% Aleksej Efimov
7 2.5% David Holmes
6 2.1% Brent Christian
5 1.8% Hannes Wallnoefer
5 1.8% Zoltan Majo
4 1.4% Poonam Bajaj Parhar
4 1.4% Vladimir Kozlov
4 1.4% Naoto Sato
4 1.4% Anton Litvinov
3 1.1% Alexey Ivanov
3 1.1% Alexander Zvegintsev
2 0.7% Coleen Phillimore
2 0.7% Roger Riggs
2 0.7% Serguei Spitsyn
1 0.4% David Dehaven
1 0.4% Igor Ignatyev
1 0.4% Maurizio Cimadamore
1 0.4% Sundararajan Athijegannathan
1 0.4% Anthony Scarpino
1 0.4% Mandy Chung
1 0.4% Tim Bell
1 0.4% Thomas Schatzl
1 0.4% Vladimir Ivanov
32 11.3% Independent
29 10.2% Abhijit Saha
3 1.1% Attila Szegedi
23 8.1% Google
22 7.8% Ivan Gerasimov
1 0.4% Martin Buchholz
7 2.5% SAP
4 1.4% Christoph Langer
3 1.1% Goetz Lindenmaier
6 2.1% Amazon
4 1.4% Volker Simonis
2 0.7% Sergey Bylokhov
5 1.8% Azul
5 1.8% Vladimir Kempik
4 1.4% JetBrains
4 1.4% Anton Tarasov
2 0.7% BellSoft
2 0.7% Alexandr Scherbatiy
1 0.4% Red Hat
1 0.4% Andrew Hughes

Chronological push log:

Days Ago Committer Affiliation Bug Summary
1602 Poonam Bajaj Parhar Oracle JDK-8182567 OOM ERRORS + SERVICE-THREAD TAKES A PROCESSOR TO 100%
1603 Aleksej Efimov Oracle JDK-8172297 In java 8, the marshalling with JAX-WS does not escape carriage return
1612 Robert Mckenna Oracle JDK-8181891 Regression since 8u60: System.getenv doesn't return env var set in JNI code
1615 Sean Coffey Oracle JDK-8181205 JRE fails to load/register security providers when started from UNC pathname
1615 Kevin Walls Oracle JDK-8181726 missing LNT entry for finally block
1616 Anton Litvinov Oracle JDK-8181656 [macos] javafx.print.PrinterJob.showPrintDialog() hangs on macOS
1620 David Holmes Oracle JDK-8181462 PPC64: "mbind: Invalid argument" when -XX:+UseNUMA is used
1621 Martin Buchholz Google JDK-8181429 ConcurrentSkipListSet.clear() can leave the Set in an invalid state
1621 Aleksej Efimov Oracle JDK-8181426 After updating to Java8u131, the bind to rmiregistry is rejected by registryFilter even though registryFilter is set
1621 Robert Mckenna Oracle JDK-8181379 Correctly handle exception in TCPChannel.createConnection
1621 Robert Mckenna Oracle JDK-8181378 sun.rmi.transport.tcp.TCPChannel.createConnection close connection on timeout
1623 Zoltan Majo Oracle JDK-8180934 PutfieldError failed with UnsupportedClassVersionError
1623 Tobias Hartmann Oracle JDK-8181040 Null pointer dereference of CodeCache::find_blob() result
1623 Tobias Hartmann Oracle JDK-8181039 Null pointer dereference in InitializeNode::complete_stores
1623 Tobias Hartmann Oracle JDK-8181038 Null pointer dereference in LoadNode::Identity()
1623 Tobias Hartmann Oracle JDK-8181037 Null pointer dereference in Matcher::xform()
1623 Tobias Hartmann Oracle JDK-8181036 Null pointer dereferences of ConstMethod::method()
1623 Tobias Hartmann Oracle JDK-8181035 Null pointer dereference in Matcher::ReduceInst()
1624 Robert Mckenna Oracle JDK-8173664 Typo in https://java.net/downloads/heap-snapshot/hprof-binary-format.html
1628 Sean Coffey Oracle JDK-8178539 NPE hit with java.security.debug=provider
1629 Tobias Hartmann Oracle JDK-8180937 compiler/dependencies/MonomorphicObjectCall/TestMonomorphicObjectCall.java fails product
1631 Thomas Schatzl Oracle JDK-8180748 Interned string and symbol table leak memory during parallel unlinking
1636 David Holmes Oracle JDK-8180497 Class java.util.concurrent.ThreadLocalRandom fails to Initialize when using SecurityManager
1636 Alexey Ivanov Oracle JDK-8180481 NullPointerException from JComboBox and JList when Accessibility enabled
1637 Ivan Gerasimov Google JDK-8180440 Need to terminate server process if client runs into problems
1638 Philip Race Oracle JDK-8180379 JFileChooser with Windows look and feel crashes on win 10
1641 Alexander Zvegintsev Oracle JDK-8180287 [macos] JComboBox doesn't display popup in mixed JavaFX Swing Application on 8u131 and Mac OS 10.12
1645 Dmitry Markov Oracle JDK-8179888 Java "1.8.0_112" on Windows 10 displays different characters for EUDCs from ones created in eudcedit.exe.
1652 David Holmes Oracle JDK-8179469 HotSpot VM fails to start when AggressiveHeap is set
1654 Mikhail Cherkasov Oracle JDK-8167474 [macosx] JMenuItems in JPopupMenu are not accessible
1655 Brent Christian Oracle JDK-8176329 jdeps to detect MR jar file and output a warning
1655 Christoph Langer SAP JDK-8179406 InetAddress.getLocalHost crash
1657 David Buck Oracle JDK-8179306 Crash in ClassLoaderData/JNIHandleBlock::oops_do during concurrent marking
1663 David Buck Oracle JDK-8176150 Exception "Duplicate field name&signature in class file" should report the name and signature of the field
1664 Abhijit Saha Independent JDK-8178938 FtpURLConnection connection leak on FileNotFoundException
1664 Abhijit Saha Independent JDK-8178934 The new menu can't be shown on the menubar after clicking the "Add" button.
1664 Abhijit Saha Independent JDK-8178933 IME Composition Window is displayed at incorrect location
1664 Abhijit Saha Independent JDK-8178932 Resizing dialog which is JWindow parent makes JVM crash
1664 Abhijit Saha Independent JDK-8178931 closed/java/awt/MenuBar/MenuBarStress1/MenuBarStress1.java hangs on win 64 bit with jdk8
1669 Mikhail Cherkasov Oracle JDK-8178807 NPE in AccessBridge while editing JList model
1670 Sean Coffey Oracle JDK-8178721 Use stronger algorithms and keys for JSSE testing
1671 Mikhail Cherkasov Oracle JDK-8178540 javax.swing.text.html.parser.Parser parseScript ignores a character after comment end
1672 Vladimir Kempik Azul JDK-8176313 C1: NPE is thrown instead of LinkageError when accessing inaccessible field on NULL receiver
1672 Aleksej Efimov Oracle JDK-8177964 (tz) Support tzdata2017b
1673 Naoto Sato Oracle JDK-8178389 Overstatement of universality of Era.getDisplayName() implementation
1673 Naoto Sato Oracle JDK-8178388 Wrong display name for supplemental Japanese era
1673 Naoto Sato Oracle JDK-8177779 JapaneseEra.getDisplayName doesn't return names if it's an additional era
1673 Naoto Sato Oracle JDK-8177776 Create an equivalent test case for JDK9's SupplementalJapaneseEraTest
1676 David Buck Oracle JDK-8178280 Weblogic12medrec assert(handler_address == SharedRuntime::compute_compiled_exc_handler(nm, pc, exception, force_unwind, true)) failed: Must be the same
1676 David Buck Oracle JDK-8178279 nmethod's exception cache not multi-thread safe
1679 Kevin Walls Oracle JDK-8168475 Add a new CPU family (S_family) for SPARC S7 and above processors
1680 Kevin Walls Oracle JDK-8168473 java in ldoms, with cpu-arch=generic has problems
1680 Anton Litvinov Oracle JDK-8177053 [macosx] PrintRequestAttributeSet breaks page size set using PageFormat
1680 Anton Litvinov Oracle JDK-8177954 [macosx] PrinterJob's native Print Dialog does not reflect specified Copies or Page Ranges
1683 Kevin Walls Oracle JDK-8177887 expose L1_data_cache_line_size for diagnostic/sanity checks
1683 Kevin Walls Oracle JDK-8177817 Remove assertions in 8u that were removed by 8056124 in 9.
1683 Kevin Walls Oracle JDK-8176104 Use new API to get cache line sizes
1684 Dmitry Markov Oracle JDK-8177769 [macosx] Sometimes NSWindow.isZoomed hangs
1684 Philip Race Oracle JDK-8177824 [macosx] The print test crashed with Nimbus L&F
1684 Kevin Walls Oracle JDK-8177783 remove legacy code in SPARC's VM_Version::platform_features
1685 Hannes Wallnoefer Oracle JDK-8177774 JSObject property access is broken for numeric keys outside the int range
1685 Tobias Hartmann Oracle JDK-8177762 Range check dependent CastII/ConvI2L is prematurely eliminated
1685 Brent Christian Oracle JDK-8177734 [JCP] [Mac]Cannot launch JCP on Mac os with language set to "Chinese, Simplified" while region is not China
1685 Brent Christian Oracle JDK-8177733 Locale issues with Mac 10.12
1685 Brent Christian Oracle JDK-8177732 System.getProperty("os.version") returns incorrect version number on Mac
1685 Brent Christian Oracle JDK-8177731 System.getProperty("os.version") returns "Unknown" on Mac
1685 Brent Christian Oracle JDK-8177730 (props) "No Java runtime present, requesting install" when creating VM from JNI [macosx]
1686 Robert Mckenna Oracle JDK-8177726 MAWT: Java should be more careful manipulating NLSPATH, XFILESEARCHPATH env variables
1686 Robert Mckenna Oracle JDK-8177725 Stop changing user environment variables related to /usr/dt
1691 Ivan Gerasimov Google JDK-8169056 StringIndexOutOfBoundsException in Pattern.compile with CANON_EQ flag
1691 Anthony Scarpino Oracle JDK-8176536 Improved algorithm constraints checking
1696 Philip Race Oracle JDK-8177067 JDK support for JavaFX modal print dialogs
1697 Ivan Gerasimov Google JDK-8176897 Failed to load RSA private key from pkcs12
1697 Philip Race Oracle JDK-8177050 PrinterJob.pageDialog() with DialogSelectionType.NATIVE returns a PageFormat when cancelled.
1697 Philip Race Oracle JDK-8177049 Stack overflow on Linux using DialogTypeSelection.NATIVE
1699 Roger Riggs Oracle JDK-8176787 Wrap FileInputStream's native skip and available methods
1700 Dmitry Markov Oracle JDK-8176727 IllegalArgumentException in java.awt.image.ReplicateScaleFilter
1704 Aleksej Efimov Oracle JDK-8176438 (tz) Support tzdata2017a
1704 Tobias Hartmann Oracle JDK-8176496 [TESTBUG] 8174164 fix missed the test
1704 Tobias Hartmann Oracle JDK-8176495 SafePointNode::_replaced_nodes breaks with irreducible loops
1705 Vladimir Ivanov Oracle JDK-8176451 C1 value numbering handling of Unsafe.get*Volatile is incorrect
1706 Dmitry Markov Oracle JDK-8176364 lookupDefaultPrintService returns null on Solaris 11 when default printer is set using lpoptions command
1712 Mikhail Cherkasov Oracle JDK-8176090 Performance problems in dialogs with large tables when JAB activated
1714 Mandy Chung Oracle JDK-8174729 Race Condition in java.lang.reflect.WeakCache
1718 Kevin Walls Oracle JDK-8175821 [REDO] MemberNameTable doesn't purge stale entries
1718 Alexandr Scherbatiy BellSoft JDK-8175809 [macosx] Fast precise scrolling and DeltaAccumulator fix for macOS Sierra 10.12.2
1722 Dmitry Markov Oracle JDK-8175276 The copyright section in the test/java/awt/font/TextLayout/DiacriticsDrawingTest.java should be updated
1722 Dmitry Markov Oracle JDK-8175009 [macosx] Wrong rendering of diacritics on macOS
1725 Dmitry Markov Oracle JDK-8174858 Text is displayed in bold when fonts are installed into symlinked folder
1725 Alexander Zvegintsev Oracle JDK-8175181 Make tracking SecondaryLoop.enter/exit methods easier
1727 Poonam Bajaj Parhar Oracle JDK-8175034 hs_err improvement: Add event logging for class redefinition to the hs_err file
1727 David Holmes Oracle JDK-8174987 SA does not work if executable is DSO
1732 Philip Race Oracle JDK-8174751 CUPS Printing is broken with Ubuntu 16.10 (CUPS 2.2)
1732 Sean Coffey Oracle JDK-8171151 JDK8u ProblemList.txt Updates
1733 Robert Mckenna Oracle JDK-8174265 (fs) WatchService hangs on GetOverlappedResult and locks directory (win)
1734 Sean Coffey Oracle JDK-8174032 IllegalArgumentException: jdk.tls.namedGroups
1735 Mikhail Cherkasov Oracle JDK-8174097 Menu is activated after using mnemonic Alt/Key combination
1735 Vladimir Kempik Azul JDK-8172976 Infinite loop in handle_wrong_method in jmod
1740 Sean Coffey Oracle JDK-8173688 performance regression in com/sun/crypto/provider/OutputFeedback.java
1740 Robert Mckenna Oracle JDK-8173832 tools/pack200/Pack200Test.java fails on Win32: Could not reserve enough space
1740 David Buck Oracle JDK-8173816 Crash in klassItable::initialize_itable_for_interface when running SelectionResolution InvokeInterfaceICCE.java
1741 Sean Coffey Oracle JDK-8173265 TsacertOptionTest.java intermittently fails on Mac
1749 Anton Litvinov Oracle JDK-8172980 Two "Direct Clip" threads are created to play the same "AudioClip" object, what makes clip sound corrupted
1754 Philip Race Oracle JDK-8173077 [macosx] LinearGradientPaint and RadialGradientPaint are not printed on OS X.
1754 Philip Race Oracle JDK-8173076 [macosx] Printing a shape filled with a texture doesn't work under Mac OS X
1755 Abhijit Saha Independent JDK-8172946 Certificates not being blocked by jdk.tls.disabledAlgorithms property
1755 Abhijit Saha Independent JDK-8172943 Verifying ECDSA signatures permits trailing bytes
1755 Abhijit Saha Independent JDK-8172934 Chrome interop regression with JDK-8148516
1755 Abhijit Saha Independent JDK-8169180 Improve extensibility of ObjectInputFilter information passed to the filter
1755 Abhijit Saha Independent JDK-8169164 Apply algorithm constraints to timestamped code
1755 Abhijit Saha Independent JDK-8169153 [macosx] Remove all references to GC from native OBJ-C code
1755 Abhijit Saha Independent JDK-8169151 Add security property to configure XML Signature secure validation mode
1755 Abhijit Saha Independent JDK-8169149 Add algorithm constraint that specifies the restriction date
1755 Abhijit Saha Independent JDK-8169147 Increase the minimum strength of EC keys
1755 Abhijit Saha Independent JDK-8169144 Add mechanism to allow non default root CAs to be not subject to algorithm restrictions
1755 Abhijit Saha Independent JDK-8169142 LDAP "follow" throws ClassCastException with Java 8
1755 Abhijit Saha Independent JDK-8169141 [macosx] Chinese Comma cannot be entered using Pinyin Input Method on OS X
1755 Abhijit Saha Independent JDK-8169140 Make handling of 3rd party providers more stable
1755 Abhijit Saha Independent JDK-8169139 [macosx] java 7 and 8 JDialogs on multiscreen jump to parent frame on focus
1757 Sean Coffey Oracle JDK-8172039 java/util/concurrent/locks/ReentrantLock/CancelledLockLoops.java test failed with 'Completed != 2'
1757 Sean Coffey Oracle JDK-8172034 ProblemList.txt needs to be updated as 7041639 closed
1757 Sean Coffey Oracle JDK-8171950 com/sun/net/httpserver/bugs/6725892/Test.java fails intermittently
1758 Serguei Spitsyn Oracle JDK-8172823 need more workarounds for suspend equivalent condition issue
1760 Dmitry Markov Oracle JDK-8172790 [PIT] on Windows, failure of java/awt/Dialog/DialogAboveFrame/DialogAboveFrameTest.java
1761 Aleksej Efimov Oracle JDK-8172673 SAXParseException when sending soap message
1762 Hannes Wallnoefer Oracle JDK-8172667 SparseArrayData should not grow its underlying dense array data
1762 Hannes Wallnoefer Oracle JDK-8172654 Missing checks in sparse array shift() implementation
1762 Tobias Hartmann Oracle JDK-8164293 HotSpot leaking memory in long-running requests
1762 Christoph Langer SAP JDK-8172578 SocketInputStream.socketRead0 can hang even with soTimeout set
1764 Robert Mckenna Oracle JDK-8172436 Deadlock in com.sun.jndi.ldap.pool.Connections
1767 David Holmes Oracle JDK-8172318 [linux] Experimental support for cgroup memory limits in container (ie Docker) environments
1768 Maurizio Cimadamore Oracle JDK-8172291 Polymorhic signature method check crashes javac
1768 Volker Simonis Amazon JDK-8172053 (ppc64) Downport of 8170153 breaks build on linux/ppc64 (big endian)
1768 Vladimir Kozlov Oracle JDK-8172257 C2: anti dependence missed because store hidden by membar
1778 Attila Szegedi Independent JDK-8172021 Can't unambiguously select between fixed arity signatures [(java.util.Collection), (java.util.Map)]
1784 Aleksej Efimov Oracle JDK-8162941 Publishing two webservices on same port fails with "java.net.BindException: Address already in use"
1784 Zoltan Majo Oracle JDK-8171502 Scanning method file for initialized final field updates can fail for non-existent fields
1784 Zoltan Majo Oracle JDK-8171154 assert(c == Bytecodes::_putfield) failed: must be putfield
1784 Zoltan Majo Oracle JDK-8161987 Compilers accept modification of final fields outside initializer methods
1784 David Holmes Oracle JDK-8171481 G1 crashes if active_processor_count changes during startup
1784 David Holmes Oracle JDK-8171480 Cache initial active_processor_count
1785 Volker Simonis Amazon JDK-8170873 PPC64/aarch64: Poor StrictMath performance due to non-optimized compilation
1785 Christoph Langer SAP JDK-8171436 java.lang.VerifyError: (class: GregorSamsa, method: template$dot$0$outline$1 signature: (LGregorSamsa$48;)V) Register 10 contains wrong type
1788 Ivan Gerasimov Google JDK-8171360 Update OS detection code to recognize Windows Server 2016
1790 Mikhail Cherkasov Oracle JDK-8171223 Double icons with JMenuItem setHorizontalTextPosition on Win 10
1790 Mikhail Cherkasov Oracle JDK-8171222 Deleting a file from either the open or save java.awt.FileDialog hangs.
1791 Aleksej Efimov Oracle JDK-8170711 (tz) Support tzdata2016j
1791 Volker Simonis Amazon JDK-8171153 CMS: Crash in CardTableModRefBSForCTRS::process_chunk_boundaries
1795 Dmitry Markov Oracle JDK-8170652 [macosx] Activating a JDialog puts to back another dialog
1795 Dmitry Markov Oracle JDK-8170907 [macosx] Cursor management unification
1796 Roger Riggs Oracle JDK-8168645 ReflectionFactory support for IIOP and custom serialization
1802 David Buck Oracle JDK-8170665 unexpected profiling mismatch in c1 generated code
1802 Sundararajan Athijegannathan Oracle JDK-8170658 JSObject call() is passed undefined for the argument 'thiz'
1802 Attila Szegedi Independent JDK-8170628 >>>=0 generates invalid bytecode for BaseNode LHS
1803 Mikhail Cherkasov Oracle JDK-8161940 [macosx] JList, VO can't access non-visible list items
1803 Sean Coffey Oracle JDK-8165241 Currency update needed for ISO 4217 Amendment #162.
1803 Sean Coffey Oracle JDK-8165240 Currency update needed for ISO 4217 Amendment #161
1803 Mikhail Cherkasov Oracle JDK-8154884 [macosx] Custom Swing text components need to allow standard accessibility
1803 Dmitry Markov Oracle JDK-8169498 Diacritics input works incorrectly on Windows if Spanish (Latin American) keyboard layout is used
1804 Ivan Gerasimov Google JDK-8169868 Modify sun/security/smartcardio manual regression tests so that they do not just fail if no cardreader found
1804 Ivan Gerasimov Google JDK-8170278 ticket renewal won't happen with debugging turned on
1810 Kevin Walls Oracle JDK-8169622 [REDO] failed: no mismatched stores, except on raw memory: StoreB StoreI
1810 Kevin Walls Oracle JDK-8168523 C2: Handle "wide" aliases for unsafe accesses
1810 Kevin Walls Oracle JDK-8168522 C2: opaque unsafe access triggers an assert
1810 Kevin Walls Oracle JDK-8153218 C2: Type speculation produces mismatched unsafe accesses
1810 Anton Tarasov JetBrains JDK-8170286 AwtFrame::WmShowWindow() may steal focus
1812 Christoph Langer SAP JDK-8169865 Downport minor fixes in java.net native code from JDK 9 to JDK 8
1813 David Buck Oracle JDK-8168123 Crash in HotSpot with jvm.dll+0x42b48 ciObjectFactory::create_new_metadata
1815 David Buck Oracle JDK-8170041 Mac OS: Unexpected JavaLaunchHelper message displaying
1817 David Buck Oracle JDK-8169902 C2 compilation fails with SIGSEGV
1818 David Dehaven Oracle JDK-8169779 With JDK 1.7 text field does not obtain focus when using mnemonic Alt/Key combin
1818 Serguei Spitsyn Oracle JDK-8169744 jdb returns invalid argument count if first parameter to Arrays.asList is null
1819 Ivan Gerasimov Google JDK-8169537 (tz) Support tzdata2016i
1820 Attila Szegedi Independent JDK-8169647 "Bad local variable type" in ES6 Nashorn when reassigning a `let` within a `try`
1823 Robert Mckenna Oracle JDK-8169601 [macosx] Delete unused class NSPrintinfo
1823 Robert Mckenna Oracle JDK-8169600 Make XSL generated namespace prefixes local to transformation process
1823 Sergey Bylokhov Amazon JDK-8169560 [macosx] Various memory leaks in jdk9
1824 Sean Coffey Oracle JDK-8157561 Ship the unlimited policy files in JDK Updates
1825 Sean Coffey Oracle JDK-8169444 RSAClientKeyExchange debug info is incorrect
1825 Mikhail Cherkasov Oracle JDK-8169485 JVM crash at sun.java2d.windows.GDIBlitLoops.nativeBlit
1830 Dmitry Markov Oracle JDK-8169254 [PIT] Exception running java/awt/event/KeyEvent/KeyChar/KeyCharTest.java
1830 Dmitry Markov Oracle JDK-8169253 VK_OEM_102 dead key detected as VK_UNDEFINED
1836 Poonam Bajaj Parhar Oracle JDK-8154312 nmethod::oops_do_marking_epilogue always runs verification code
1836 Poonam Bajaj Parhar Oracle JDK-8168920 Instance field load is replaced by wrong data Phi
1840 Philip Race Oracle JDK-8168693 [macosx] Delete unused class NSPrintinfo
1840 Ivan Gerasimov Google JDK-8168485 automatic discovery of LDAP servers with Kerberos authentication
1844 Robert Mckenna Oracle JDK-8168482 jarsigner -verbose -verify should print the algorithms used to sign the jar
1844 Ivan Gerasimov Google JDK-8167592 Add MD5 to signed JAR restrictions
1845 Goetz Lindenmaier SAP JDK-8168413 Further improvements for Unix NetworkInterface native implementation
1846 Hannes Wallnoefer Oracle JDK-8168310 Nested object literal property maps not reset in optimistic recompilation
1846 Abhijit Saha Independent JDK-8168203 OutputAnalyzer's shouldXXX() calls return this
1846 Abhijit Saha Independent JDK-8168202 Additional tests for jarsigner's warnings
1846 Abhijit Saha Independent JDK-8168196 IllegalArgumentException thrown by JCK test api/java_awt/Component/FlipBufferStrategy/indexTGF_General in opengl pipeline
1846 Abhijit Saha Independent JDK-8168195 IllegalArgumentException thrown by api/java_awt/Component/FlipBufferStrategy/indexTGF_General
1846 Abhijit Saha Independent JDK-8168187 Creating a VolatileImage with size 0,0 results in no longer working g2d.drawString
1846 Abhijit Saha Independent JDK-8168175 JEditorPane.createEditorKitForContentType throws NPE after 6882559
1846 Abhijit Saha Independent JDK-8168174 new JEditorPane("text/plain","") fails for null context class loader
1846 Abhijit Saha Independent JDK-8168167 Partially initialized string object created by C2's string concat optimization may escape
1846 Abhijit Saha Independent JDK-8168165 Math.pow yields different results upon repeated calls
1847 Philip Race Oracle JDK-8168105 [macosx] Incorrect char to glyph mapping printing on OSX 10.10
1847 Robert Mckenna Oracle JDK-8167613 Add debug output for indicating if a chosen ciphersuite was legacy
1852 Coleen Phillimore Oracle JDK-8167607 Cyclic interface initialization causes JVM crash
1853 Igor Ignatyev Oracle JDK-8162358 Utils.tryFindJvmPid sometimes find incorrect pid
1853 Aleksej Efimov Oracle JDK-8167255 (tz) Support tzdata2016g
1853 Coleen Phillimore Oracle JDK-8162766 Unsafe_DefineClass0 accesses raw oops while in _thread_in_native
1854 Andrew Hughes Red Hat JDK-8167502 [REDO] JDWP: Memory Leak: GlobalRefs never deleted when processing invokeMethod command
1854 Vladimir Kempik Azul JDK-8154945 Enable 8130150 and 8081778 intrinsics by default
1854 Tim Bell Oracle JDK-8167475 ASSEMBLY_EXCEPTION contains historical company name
1858 Alexandr Scherbatiy BellSoft JDK-8167367 [macos 10.12] Trackpad scrolling of text on macOS 10.12 Sierra is very fast (Trackpad, Retina only)
1859 Philip Race Oracle JDK-8167235 SIGSEGV when attempting to rotate BufferedImage using AffineTransform by NaN degrees
1861 Sean Coffey Oracle JDK-8167121 sun.management.LazyCompositeData.isTypeMatched() fails for composite types with items of ArrayType
1862 Mikhail Cherkasov Oracle JDK-8167022 [TEST_BUG] :jdk/test/sun/misc/URLClassPath/ClassnameCharTest.java test fails with NullPointerException
1862 Mikhail Cherkasov Oracle JDK-8167020 [TEST_BUG] sun/security/ssl/SSLSocketImpl/CloseSocket.java failed with "Error while cleaning up threads after test"
1865 Ivan Gerasimov Google JDK-8166986 sun/security/krb5/auto/MaxRetries.java may fail with BindException
1865 Ivan Gerasimov Google JDK-8166985 sun/security/krb5/auto/MaxRetries.java failed with timeout
1865 Ivan Gerasimov Google JDK-8166984 sun/security/krb5/auto/MaxRetries.java fails with Retry count is -1 less
1865 Robert Mckenna Oracle JDK-8166978 [TEST_BUG] com/sun/jndi/ldap/LdapTimeoutTest.java fails at handleNamingException
1865 Robert Mckenna Oracle JDK-8166977 [TEST_BUG] com/sun/jndi/ldap/LdapTimeoutTest.java failed intermittently
1865 Robert Mckenna Oracle JDK-8148237 [TEST_BUG] com/sun/jndi/ldap/LdapTimeoutTest.java fails intermittently
1865 Robert Mckenna Oracle JDK-8148235 com/sun/jndi/ldap/LdapTimeoutTest.java failed intermittently
1866 Ivan Gerasimov Google JDK-8166853 Synthetic bridge constructor in ArrayList$Itr blocks inlining
1867 Anton Tarasov JetBrains JDK-8166787 Android Studio 2.x crashes with NPE at sun.lwawt.macosx.CAccessibility.getAccessibleIndexInParent
1868 Robert Mckenna Oracle JDK-8166789 Add invalid network / computer name cases to isReachable known failure switch
1868 Robert Mckenna Oracle JDK-8166435 New tests from 8144566 fail with "No expected Server Name Indication"
1868 Robert Mckenna Oracle JDK-8159569 Custom HostnameVerifier disables SNI extension
1869 Volker Simonis Amazon JDK-8165231 java.nio.Bits.unaligned() doesn't return true on ppc
1872 Robert Mckenna Oracle JDK-8166631 InetAddress.isReachable returns true for non existing IP addresses
1873 Vladimir Kempik Azul JDK-8166443 Crash in rebuild_cpu_to_node_map
1873 Vladimir Kempik Azul JDK-8166105 Runtime.availableProcessors() ignores Linux taskset command
1874 Robert Mckenna Oracle JDK-8166424 [TEST_BUG] Test JarURLConnectionUseCaches.java fails at windows: failed to clean up files after test
1874 Robert Mckenna Oracle JDK-8166423 JarURLConnection does not handle useCaches correctly
1875 Anton Tarasov JetBrains JDK-8166360 [macosx] two JNI locals to delete in AWTWindow.m, CGraphicsEnv.m
1879 Kevin Walls Oracle JDK-8165820 Long pause in ParOldGC, because ParallelTaskTerminator peeks wrong TaskQueueSet
1880 Anton Tarasov JetBrains JDK-8165719 [macosx] modal dialog can skip the activation/focus events
1881 Sean Coffey Oracle JDK-8165599 CertificateException missing cause of underlying exception
1881 Mikhail Cherkasov Oracle JDK-8166037 [TEST_BUG] javax/management/security/SecurityTest.java fails due to missing keyStore file
1883 Ivan Gerasimov Google JDK-8160958 [TEST_BUG] java/net/SetFactoryPermission/SetFactoryPermission.java should be added into :needs_compact2 group
1883 Ivan Gerasimov Google JDK-8160951 [TEST_BUG] javax/xml/bind/marshal/8134111/UnmarshalTest.java should be added into :needs_jre group
1886 Ivan Gerasimov Google JDK-8165309 Base64.Encoder.wrap(os).write(byte[],int,int) with incorrect arguments should not produce output
1887 Ivan Gerasimov Google JDK-8164411 Avoid repeated "Please insert a smart card" popup windows
1887 Sergey Bylokhov Amazon JDK-8165684 java.beans.MethodRef#get throws NullPointerException
1887 Vladimir Kozlov Oracle JDK-8165671 missing precedence edge for anti_dependence
1887 Vladimir Kozlov Oracle JDK-8165670 Random infrequent null pointer exceptions in javac
1889 Alexey Ivanov Oracle JDK-8165260 [macosx] Cursor not updating correctly after closing a modal dialog
1889 Goetz Lindenmaier SAP JDK-8165484 XSLTC transformer swallows empty namespace declaration which is needed to undeclare default namespace
1889 Goetz Lindenmaier SAP JDK-8165320 Small flaw when integrating 8160174 to JDK8
1891 Tobias Hartmann Oracle JDK-8165418 Unrecognized VM option 'UseCountedLoopSafepoints'
1891 Tobias Hartmann Oracle JDK-8165327 jvm crashes when -XX:+UseCountedLoopSafepoints is enabled
1892 Ivan Gerasimov Google JDK-8164063 Finalizing one key of a KeyPair invalidates the other key
1894 Kevin Walls Oracle JDK-8163286 Threads may do significant work out of the non-shared overflow buffer
1895 Ivan Gerasimov Google JDK-8165021 (smartcardio) CardTerminal.connect() throws CardException instead of CardNotPresentException
1896 Abhijit Saha Independent JDK-8129533 ISO 4217 amendment 160
1900 David Buck Oracle JDK-8164849 java.net.NetworkInterface - fixes and improvements for network interface listing
1903 Ivan Gerasimov Google JDK-8164417 ZoneOffset.ofHoursMinutesSeconds() does not reject invalid input
1904 Aleksej Efimov Oracle JDK-8164567 Fix PermGen memory leaks caused by static final Exceptions
1905 Sean Coffey Oracle JDK-8164444 Build needs additional flags to compile with GCC 6
1907 Mikhail Cherkasov Oracle JDK-8164491 TextArea.replaceRange() and insert() are broken with setText(null)
1907 Sean Coffey Oracle JDK-8162916 [TEST_BUG] sun/security/krb5/auto/UnboundSSL.java fails
1907 Vladimir Kozlov Oracle JDK-8164387 Performance regression: bimorphic inlining may be bypassed by type speculation
1908 Mikhail Cherkasov Oracle JDK-8164119 MoveToOtherScreenTest fails due wrong key attribute
1909 Alexander Zvegintsev Oracle JDK-8164213 Update GIFlib library to the latest up-to-date
1909 Mikhail Cherkasov Oracle JDK-8164209 Duplicate entry in http.nonProxyHosts will ignore subsequent entries
1910 Mikhail Cherkasov Oracle JDK-8164118 Memory leak in com.apple.laf.AquaProgressBarUI: removed progress bar still referenced
1910 Hannes Wallnoefer Oracle JDK-8164112 Honor Number type hint in toPrimitive on Numbers
1910 Dmitry Markov Oracle JDK-8164053 [macosx] Press "To Back" button on the Dialog,the Dialog moves behind the Frame
1911 Mikhail Cherkasov Oracle JDK-8164027 IllegalArgumentException: adding a component to a container on a different GraphicsDevice
1914 Mikhail Cherkasov Oracle JDK-8163944 [TEST_BUG] sun/net/www/protocol/http/HttpInputStream.java fails intermittently
1914 Ivan Gerasimov Google JDK-8163910 Tests added in JDK-8163518 fail on some platforms
1915 Ivan Gerasimov Google JDK-8163868 Integer overflow in StringBufferInputStream.read() and CharArrayReader.read/skip()
1915 Zoltan Majo Oracle JDK-8163585 PPC64: Support AES intrinsics
1916 Sean Coffey Oracle JDK-8163791 Unexpected NPE still possible on some Kerberos ticket calls
1916 Sean Coffey Oracle JDK-8163103 Update KerberosTicket to describe behavior if it has been destroyed and fix NullPointerExceptions
1917 Mikhail Cherkasov Oracle JDK-8163491 Remove dependency on sun.misc.RegexpPool and friends
1921 Sean Coffey Oracle JDK-8163297 sun.net.ftp.impl.FtpClient.nameList(String path) handles "null" incorrectly
1921 David Buck Oracle JDK-8163273 Fix for JDK-8147451 failed: Crash in Method::checked_resolve_jmethod_id(_jmethodID*)
1924 Mikhail Cherkasov Oracle JDK-8162964 sun.net.ftp.impl.FtpClient.nameList(String path) handles "null" incorrectly
1924 Aleksej Efimov Oracle JDK-8162678 (tz) Support tzdata2016f
1929 Philip Race Oracle JDK-8162734 JDK should be updated to use LittleCMS 2.8
1930 Alexey Ivanov Oracle JDK-8162508 JVM crashed with font manager on Solaris 12
1931 Mikhail Cherkasov Oracle JDK-8028363 XmlGregorianCalendarImpl.getTimeZone() bug when offset is less than 10 minutes
1935 Sean Coffey Oracle JDK-8162378 (fs) LinuxWatchService can reports events against wrong directory
1941 Mikhail Cherkasov Oracle JDK-8160941 "text/uri-list" dataflavor concats the first two strings
1942 Mikhail Cherkasov Oracle JDK-8161498 Memory leak in com.apple.laf.ScreenMenu: removed JMenuItems are still referenced

No changesets log

JDK-8201823 Release Note: Change to Internal Java Package Names in RPM Installers
JDK-8196599 Release Note: JNLP files won't launch from IE11 on Windows 10 Creators Update
JDK-8196596 Release Note: RMI Registry Filter Allows Binding Arrays of Any Type
JDK-8193617 Java RPMs should allow for side-by-side installation of JDK and JRE, 32 and 64 bit, and only one update for each major version
JDK-8193616 Simplify build system building rpms
JDK-8193615 undo 8189805: 64 and 32 bit RPMS must co-exist
JDK-8193614 64 and 32 bit RPMS must co-exist
JDK-8193383 [Windows] java.awt.IllegalComponentStateException: component must be showing on the screen to determine its location
JDK-8193382 Change of behavior in the getMessage () method of the SOAPMessageContextImpl class
JDK-8193379 JNLP files won't launch from IE11 on Windows 10 Creators Update
JDK-8191427 Release Note: Decode error with Tomcat version 7.x
JDK-8191215 Time related C1 intrinsics produce inconsistent results when floating around
JDK-8191214 test tck.java.time.zone.TCKZoneRules is broken by tzdata2017c
JDK-8191213 (tz) Support tzdata2017c
JDK-8190444 JDWP exit error JVMTI_ERROR_WRONG_PHASE(112)
JDK-8190306 Enable AssumeMP by default on SPARC machines
JDK-8190299 JVM crashes sometimes while starting
JDK-8190296 webstart app fails with CouldNotLoadArgumentException when account in Japanese
JDK-8188862 JDK 8u131 socketRead0 hang at SSL read
JDK-8188861 Relax RMI Registry Serial Filter to allow arrays of any type
JDK-8188859 Desktop shortcut of Web Start application is broken after JRE update
JDK-8186258 New defaults for DSA keys in jarsigner and keytool
JDK-8185973 keytool should not warn if signature algorithm used in cacerts is weak
JDK-8185972 keytool should print out warnings when reading or generating cert/cert req using weak algorithms
JDK-8185971 Keytool, print key algorithm of certificate or key entry
JDK-8185303 Jar file verification failing with SecurityException: digest missing xxx
JDK-8185147 getUint32 returning Long
JDK-8184975 [TESTBUG] com/sun/jdi/LineNumberInfo.java fails with ArrayIndexOutOfBoundsException
JDK-8184137 Missing @bug for tests added with JDK-8165367
JDK-8184133 Java 8u121 on Linux intermittently returns null for MAC address
JDK-8182974 CosNaming's implementation doesn't comply with the specification
JDK-8182955 Minor optimizations to ISO10126PADDING
JDK-8182951 Additional tests for JEP 288: Disable SHA-1 Certificates
JDK-8182920 Mach 5 builds failed on Windows/install repo after JDK-8173207
JDK-8182749 JCK test api/java_net/Socket/descriptions.html#Bind crashes on Windows
JDK-8182317 NPE in JFXPanel$HostContainer#setEmbeddedStage
JDK-8182315 [macos] deadlock on JFXPanel startup
JDK-8182278 Padding property of the select tag is incorrect in WebView
JDK-8182277 Javafx WebView fails to render pdf.js
JDK-8182051 [macos] If you hit the escape key repeatedly to close the subwindow, the process crashes
JDK-8181573 CategoryAxis rotates improperly as yAxis
JDK-8181120 Update copyright header for files modified in 2017
JDK-8180942 Build libxml2 and libxslt from source
JDK-8180910 Build sqlite3 from source
JDK-8180902 JVM Crash in WebPage.setBackgroundColor() during webpage navigation (Non Public API)
JDK-8180803 Excessive memory consumption in TriangleMesh/MeshView
JDK-8180636 Modena sample: no response after clicking "Restart" button
JDK-8180499 Add missing copyright headers to package.html files
JDK-8180180 [Mac] WebView renders icons instead of letters on some sites
JDK-8179859 Remove unused third-party code from WebKit sources
JDK-8179394 WebEngine.getDocument().getDocumentURI() no longer returns null for loading a String of HTML
JDK-8179205 com.sun.webkit.dom.NodeImpl#SelfDisposer is not called
JDK-8179106 Missing copyright headers for some files
JDK-8178943 Integrate new version of Java VisualVM based on VisualVM 1.3.9 into JDK
JDK-8178876 Underscore not visible in HTML combo box options inside webview
JDK-8178861 Copying String with "\r\n" to Clipboard duplicates "\r"
JDK-8177903 Release Note: Compilers accept modification of final fields outside initializer methods
JDK-8177508 Update copyright header for files modified in 2017
JDK-8177502 [test] Ensemble cannot play AudioClip files when running in Java 8 and hosted over http
JDK-8177420 NPE when JavaFX loads default stylesheet or font families if CCL is null
JDK-8177315 backout changes for 8176516 (backport of 8173791)
JDK-8177065 Print dialogs are not blocking/modal w.r.t specified owner windows
JDK-8176165 Update copyright header for files modified in 2016
JDK-8175332 JavaFX Applet popup windows are in the wrong location on Mac
JDK-8175331 Region is not rendered correctly when node cache is enabled
JDK-8175280 JVM crash on resizing JavaFX application with title and icon
JDK-8175202 Fedora Linux issue with jnlp-servlet.jar demo source code license
JDK-8175008 SocketException no longer handled by WebView when processing web pages
JDK-8174811 WebView Form Post fails if connection is closed before keepAlive-Timeout
JDK-8174806 Packager update App Store runtime rules for libjfxwebkit.dylib
JDK-8174801 [macosx] New WebView Native Code uses private Apple APIs
JDK-8174727 Ensemble Advanced Media sample hangs after going full screen
JDK-8174195 Font.loadFont returns null on some Ubuntu 32bits
JDK-8173601 JSCallbackMemoryTest fails intermittently
JDK-8173586 Release Note: BigInteger performance improvements turned on by default
JDK-8173160 JavaFx WebView canvas doesn't support dash within strokeRec
JDK-8173146 Ensemble8 black flash at startup on b145+
JDK-8172953 WebView Debug build is broken
JDK-8172898 Validation of WebSQL Support in Webkit
JDK-8172766 [TESTBUG] Validation of JSObject Memory leak
JDK-8172495 Ignore __cmake_systeminformation from web module build directory
JDK-8172406 Update java-wrappers for WebKit generated classes following WebKit update
JDK-8172396 JavaScript to Java String conversion is not correct
JDK-8172395 DRT test fast/canvas/canvas-fillRect-shadow.html fails
JDK-8172394 VBox.setVgrow and HBox.setHgrow corrupt following controls when window resized
JDK-8171854 [WebView] ComboBox and DropDownList - Render fragments of the scrollbar are visible
JDK-8171396 CID keyed OpenType fonts are not supported by T2K
JDK-8171372 UsageTracker should limit records and avoid truncation
JDK-8171361 Crash while loading wordpress.com in HiDPI / Retina display
JDK-8171240 JNLP fails to get loaded with old javaws when multiple jres (jre9 and jre8u111) installed
JDK-8171026 Memory leak in JavaFX WebView
JDK-8170881 [WebView, OS X] Webkit rendering artifacts with inertia scrolling
JDK-8170874 Menu slow to respond after resizing a window multiple times with animation running
JDK-8170696 Fix PlatformContextJava type leaking to GraphicsContext
JDK-8170673 [TEST BUG] Create test for JDK-8134470
JDK-8169997 Input of type file doesn't honor "accept" attribute.
JDK-8169969 Registered JREs match to different 'osname'
JDK-8169844 Animated gifs are not working
JDK-8169777 MenuBar unoperable after moving Application to second monitor
JDK-8169542 Add navigation and stop button to HelloWebView
JDK-8169508 Tick marks position is not animated when toggling forceZeroInRange
JDK-8169292 Need to document JSObject Call and setSlot APIs to use weak references
JDK-8169236 JRE 8u112 attempts to run ICACLS.EXE on startup in Windows 10 Version 1607, build 14393
JDK-8169128 Java installer leaves cached files on host after update
JDK-8168952 Ucrypto Library leaks native memory
JDK-8168821 Cleanup whitespace after fix for JDK-8156078
JDK-8168820 Second image in Ensemble8/Image Creation sample does not load
JDK-8168819 Ensemble8 uses setAccessible to access methods and fields of various classes
JDK-8168814 Ensemble uses deprecated flv (vp6) media files hosted on OTN
JDK-8168813 Ensemble Timeline regression
JDK-8168812 Ensemble8: Review each sample description, playground, appearance, related docs and links
JDK-8168811 Ensemble8 media player slider issues
JDK-8168810 [Mac] Regression from JDK-8087709
JDK-8168809 Ensemble Media samples sliders don't react to clicks
JDK-8168611 Backport various Ensemble8 fixes from FX 9 to FX 8
JDK-8168539 wrong width/height in texture update
JDK-8168459 Audio slider works incorrectly for short files
JDK-8168299 NumberAxis: sticked numbers sometimes
JDK-8168298 Axis class does not render ticks marks when tick labels are invisible
JDK-8168247 [TEST_BUG] test/closed/security/infra/java/security/cert/CertPathValidator/certification/ValidatePathWithParams.java needs modification
JDK-8168244 Add new IdenTrust roots
JDK-8168243 Add new DTrust roots
JDK-8168242 Remove "UTN - DATACorp SGC" Root CA Certificate
JDK-8168237 Installer hangs during the JDK 8u74 installation process.
JDK-8168232 On Mac Install Run javawslauncher.app to register protocol handler with Launch Services
JDK-8168231 jdk 8u71 fails to install with no error message
JDK-8168221 Change JavawsLauncher.app to use NSTask or execv
JDK-8168220 Add a URL scheme handler to reliably launch .jnlp files - Mac registration part
JDK-8168219 Desktop shortcut is not updated after JNLP is changed in deployment cache
JDK-8168217 Application started using javaws now starts in {java.home} rather than current directory
JDK-8168216 System property 'user.dir' now set to 'java.home' value rather than user's working directory
JDK-8168215 Signed JWS application unexpectedly asks for permission to open a socket
JDK-8168213 Revise java.com image and link paths dtjava.js and deployJava.js
JDK-8168209 Deployment Toolkit should recognize IE Metro for Windows 8 and provide appropriate default response
JDK-8168113 Can't pass ObservableList as argument using FXML
JDK-8167585 java.lang.SecurityException: Failed to extract baseline.versions error
JDK-8167351 Backout changeset 43a27ac2fd89 to correct reviewer name and unintentional change
JDK-8167317 JavaFX Ensemble8 media sample hang and crash
JDK-8167313 Side effects of using url schema handler.
JDK-8167312 HTMLEditor freezes after restoring previously maximized window
JDK-8167124 use @Native annotation in web classes
JDK-8167100 Minor source diffs introduced in backports of JDK-8160837 and JDK-8163582
JDK-8167098 Backport of JDK-8158926 to JDK 8u mistakenly used preliminary patch
JDK-8166992 Pisces software renderer shows incomplete border images in particular situation
JDK-8166907 WebEngine.print will attempt to print even if the printer job is complete or has an error
JDK-8166906 Crash when calling WebEngine.print on background thread
JDK-8166895 NumberAxis: inaccurate rendering of ticks when tick unit is low
JDK-8166879 jfxwebkit.dll is missing file detail for 8u112 and 9
JDK-8166864 [macos] JVM continuously throw a NullPointerException on new MacOS 10.12
JDK-8166620 Maximizing an Window with Screen-Size hides it
JDK-8166586 protect FileChooser return from internal NPE
JDK-8166547 Loading "https://www.windyty.com" with JavaFX WebView crashes JVM.
JDK-8166327 JRE 6u121 causes applet to fail with: Reset deny session certificate store
JDK-8166208 FlightRecorderOptions settings for defaultrecording ignored.
JDK-8165965 change checkWhiteSpace to match jcheck extension list
JDK-8165774 [TEST BUG] FXCssAutomated StylesRegionTest/testfxborderimagewidth fails with array comparison
JDK-8165754 canvas/philip/tests/2d.path.clip.empty.html fails with 8u112
JDK-8165607 Incorrect Bug ID in comment for JDK-8164076
JDK-8165435 [TEST BUG] Control for HasTransformsTest not generated
JDK-8165266 [Windows] JavaFX crash in WebPage.twkOpen in 8u112 when closing WebView while debugging
JDK-8165019 [TEST BUG] Instructions for manual tests are not displayed
JDK-8164985 Scaling problem on OSX Retina
JDK-8164915 Website weibo.com cannot be loaded
JDK-8164564 Cleanup whitespace and file permission in tests repo
JDK-8164509 Update .hgignore files to ingore .jcheck dir until we actually enable jcheck
JDK-8164499 [WebView] Debug build is no longer working after JDK-8089681
JDK-8164415 ListChangeListener on ReadOnlyListWrapper's getReadOnlyProperty() does not reset change
JDK-8164409 [Javadoc] Replace references of Stage with Window in the Window class
JDK-8164222 [Mac] disable failing unicode config unit tests
JDK-8164179 Update copyright header for files modified in 2016
JDK-8164164 Document that setting scene on stage changes stage size unless explicitly set
JDK-8163983 dtjava - chrome / edge browser - "Java Plug-in is not supported by this browser. More info" message box blocking content
JDK-8163972 JavaFX browser can get stuck in an infinite loop when calling path.getTotalLength()
JDK-8163873 WebStart does not clean up jnlp file after closing
JDK-8163846 Add regression test for JDK-8161258
JDK-8163828 Revert fix for JDK-8162804
JDK-8163827 [Mac] JavaFX crashes on startup when run on Mac in VMWare
JDK-8163506 [test] Correct assertEquals ("", actual, expected) in LoadTest.loadJarFile
JDK-8163349 [WebView] WebView can't display social network icons on wellsfargo.com
JDK-8163322 REGRESSION: 8u91 update of 32 bit JRE removes preferences of the 64 bit JRE
JDK-8163302 Stage alwaysOnTop property not reset to false if permission is denied
JDK-8163182 HTMLEditor: font bold doesn't work when an indent is set
JDK-8163159 General sibling selector is broken for selected input boxes in WebView
JDK-8162809 HTTP Live Streaming not working anymore
JDK-8162804 Revert fix for JDK-8154148
JDK-8161986 Selecting 32/64 bit resources failed if user has installed both jre's
JDK-8161700 Deadlock in Java Web Start application involving JNLPClassLoader
JDK-8159235 TestDefNewAllocationPendingStackTrace.java and TestG1HumongousAllocationPendingStackTrace.java test failures with java.lang.AssertionError: No matching stack trace found

Committer push log

Aleksej Efimov, Oracle

Bug Summary
JDK-8162678 (tz) Support tzdata2016f
JDK-8167255 (tz) Support tzdata2016g
JDK-8170711 (tz) Support tzdata2016j
JDK-8176438 (tz) Support tzdata2017a
JDK-8177964 (tz) Support tzdata2017b
JDK-8181426 After updating to Java8u131, the bind to rmiregistry is rejected by registryFilter even though registryFilter is set
JDK-8164567 Fix PermGen memory leaks caused by static final Exceptions
JDK-8172297 In java 8, the marshalling with JAX-WS does not escape carriage return
JDK-8162941 Publishing two webservices on same port fails with "java.net.BindException: Address already in use"
JDK-8172673 SAXParseException when sending soap message

Alexey Ivanov, Oracle

Bug Summary
JDK-8165260 [macosx] Cursor not updating correctly after closing a modal dialog
JDK-8162508 JVM crashed with font manager on Solaris 12
JDK-8180481 NullPointerException from JComboBox and JList when Accessibility enabled

Alexandr Scherbatiy, BellSoft

Bug Summary
JDK-8167367 [macos 10.12] Trackpad scrolling of text on macOS 10.12 Sierra is very fast (Trackpad, Retina only)
JDK-8175809 [macosx] Fast precise scrolling and DeltaAccumulator fix for macOS Sierra 10.12.2

Anton Litvinov, Oracle

Bug Summary
JDK-8181656 [macos] javafx.print.PrinterJob.showPrintDialog() hangs on macOS
JDK-8177954 [macosx] PrinterJob's native Print Dialog does not reflect specified Copies or Page Ranges
JDK-8177053 [macosx] PrintRequestAttributeSet breaks page size set using PageFormat
JDK-8172980 Two "Direct Clip" threads are created to play the same "AudioClip" object, what makes clip sound corrupted

Andrew Hughes, Red Hat

Bug Summary
JDK-8167502 [REDO] JDWP: Memory Leak: GlobalRefs never deleted when processing invokeMethod command

Anton Tarasov, JetBrains

Bug Summary
JDK-8165719 [macosx] modal dialog can skip the activation/focus events
JDK-8166360 [macosx] two JNI locals to delete in AWTWindow.m, CGraphicsEnv.m
JDK-8166787 Android Studio 2.x crashes with NPE at sun.lwawt.macosx.CAccessibility.getAccessibleIndexInParent
JDK-8170286 AwtFrame::WmShowWindow() may steal focus

Abhijit Saha, Independent

Bug Summary
JDK-8169141 [macosx] Chinese Comma cannot be entered using Pinyin Input Method on OS X
JDK-8169139 [macosx] java 7 and 8 JDialogs on multiscreen jump to parent frame on focus
JDK-8169153 [macosx] Remove all references to GC from native OBJ-C code
JDK-8169149 Add algorithm constraint that specifies the restriction date
JDK-8169144 Add mechanism to allow non default root CAs to be not subject to algorithm restrictions
JDK-8169151 Add security property to configure XML Signature secure validation mode
JDK-8168202 Additional tests for jarsigner's warnings
JDK-8169164 Apply algorithm constraints to timestamped code
JDK-8172946 Certificates not being blocked by jdk.tls.disabledAlgorithms property
JDK-8172934 Chrome interop regression with JDK-8148516
JDK-8178931 closed/java/awt/MenuBar/MenuBarStress1/MenuBarStress1.java hangs on win 64 bit with jdk8
JDK-8168187 Creating a VolatileImage with size 0,0 results in no longer working g2d.drawString
JDK-8178938 FtpURLConnection connection leak on FileNotFoundException
JDK-8168195 IllegalArgumentException thrown by api/java_awt/Component/FlipBufferStrategy/indexTGF_General
JDK-8168196 IllegalArgumentException thrown by JCK test api/java_awt/Component/FlipBufferStrategy/indexTGF_General in opengl pipeline
JDK-8178933 IME Composition Window is displayed at incorrect location
JDK-8169180 Improve extensibility of ObjectInputFilter information passed to the filter
JDK-8169147 Increase the minimum strength of EC keys
JDK-8129533 ISO 4217 amendment 160
JDK-8168175 JEditorPane.createEditorKitForContentType throws NPE after 6882559
JDK-8169142 LDAP "follow" throws ClassCastException with Java 8
JDK-8169140 Make handling of 3rd party providers more stable
JDK-8168165 Math.pow yields different results upon repeated calls
JDK-8168174 new JEditorPane("text/plain","") fails for null context class loader
JDK-8168203 OutputAnalyzer's shouldXXX() calls return this
JDK-8168167 Partially initialized string object created by C2's string concat optimization may escape
JDK-8178932 Resizing dialog which is JWindow parent makes JVM crash
JDK-8178934 The new menu can't be shown on the menubar after clicking the "Add" button.
JDK-8172943 Verifying ECDSA signatures permits trailing bytes

Anthony Scarpino, Oracle

Bug Summary
JDK-8176536 Improved algorithm constraints checking

Attila Szegedi, Independent

Bug Summary
JDK-8169647 "Bad local variable type" in ES6 Nashorn when reassigning a `let` within a `try`
JDK-8170628 >>>=0 generates invalid bytecode for BaseNode LHS
JDK-8172021 Can't unambiguously select between fixed arity signatures [(java.util.Collection), (java.util.Map)]

Alexander Zvegintsev, Oracle

Bug Summary
JDK-8180287 [macos] JComboBox doesn't display popup in mixed JavaFX Swing Application on 8u131 and Mac OS 10.12
JDK-8175181 Make tracking SecondaryLoop.enter/exit methods easier
JDK-8164213 Update GIFlib library to the latest up-to-date

Brent Christian, Oracle

Bug Summary
JDK-8177730 (props) "No Java runtime present, requesting install" when creating VM from JNI [macosx]
JDK-8177734 [JCP] [Mac]Cannot launch JCP on Mac os with language set to "Chinese, Simplified" while region is not China
JDK-8176329 jdeps to detect MR jar file and output a warning
JDK-8177733 Locale issues with Mac 10.12
JDK-8177731 System.getProperty("os.version") returns "Unknown" on Mac
JDK-8177732 System.getProperty("os.version") returns incorrect version number on Mac

Christoph Langer, SAP

Bug Summary
JDK-8169865 Downport minor fixes in java.net native code from JDK 9 to JDK 8
JDK-8179406 InetAddress.getLocalHost crash
JDK-8171436 java.lang.VerifyError: (class: GregorSamsa, method: template$dot$0$outline$1 signature: (LGregorSamsa$48;)V) Register 10 contains wrong type
JDK-8172578 SocketInputStream.socketRead0 can hang even with soTimeout set

Sean Coffey, Oracle

Bug Summary
JDK-8162378 (fs) LinuxWatchService can reports events against wrong directory
JDK-8162916 [TEST_BUG] sun/security/krb5/auto/UnboundSSL.java fails
JDK-8164444 Build needs additional flags to compile with GCC 6
JDK-8165599 CertificateException missing cause of underlying exception
JDK-8171950 com/sun/net/httpserver/bugs/6725892/Test.java fails intermittently
JDK-8165240 Currency update needed for ISO 4217 Amendment #161
JDK-8165241 Currency update needed for ISO 4217 Amendment #162.
JDK-8174032 IllegalArgumentException: jdk.tls.namedGroups
JDK-8172039 java/util/concurrent/locks/ReentrantLock/CancelledLockLoops.java test failed with 'Completed != 2'
JDK-8171151 JDK8u ProblemList.txt Updates
JDK-8181205 JRE fails to load/register security providers when started from UNC pathname
JDK-8178539 NPE hit with java.security.debug=provider
JDK-8173688 performance regression in com/sun/crypto/provider/OutputFeedback.java
JDK-8172034 ProblemList.txt needs to be updated as 7041639 closed
JDK-8169444 RSAClientKeyExchange debug info is incorrect
JDK-8157561 Ship the unlimited policy files in JDK Updates
JDK-8167121 sun.management.LazyCompositeData.isTypeMatched() fails for composite types with items of ArrayType
JDK-8163297 sun.net.ftp.impl.FtpClient.nameList(String path) handles "null" incorrectly
JDK-8173265 TsacertOptionTest.java intermittently fails on Mac
JDK-8163791 Unexpected NPE still possible on some Kerberos ticket calls
JDK-8163103 Update KerberosTicket to describe behavior if it has been destroyed and fix NullPointerExceptions
JDK-8178721 Use stronger algorithms and keys for JSSE testing

Coleen Phillimore, Oracle

Bug Summary
JDK-8167607 Cyclic interface initialization causes JVM crash
JDK-8162766 Unsafe_DefineClass0 accesses raw oops while in _thread_in_native

David Buck, Oracle

Bug Summary
JDK-8169902 C2 compilation fails with SIGSEGV
JDK-8179306 Crash in ClassLoaderData/JNIHandleBlock::oops_do during concurrent marking
JDK-8168123 Crash in HotSpot with jvm.dll+0x42b48 ciObjectFactory::create_new_metadata
JDK-8173816 Crash in klassItable::initialize_itable_for_interface when running SelectionResolution InvokeInterfaceICCE.java
JDK-8176150 Exception "Duplicate field name&signature in class file" should report the name and signature of the field
JDK-8163273 Fix for JDK-8147451 failed: Crash in Method::checked_resolve_jmethod_id(_jmethodID*)
JDK-8164849 java.net.NetworkInterface - fixes and improvements for network interface listing
JDK-8170041 Mac OS: Unexpected JavaLaunchHelper message displaying
JDK-8178279 nmethod's exception cache not multi-thread safe
JDK-8170665 unexpected profiling mismatch in c1 generated code
JDK-8178280 Weblogic12medrec assert(handler_address == SharedRuntime::compute_compiled_exc_handler(nm, pc, exception, force_unwind, true)) failed: Must be the same

David Dehaven, Oracle

Bug Summary
JDK-8169779 With JDK 1.7 text field does not obtain focus when using mnemonic Alt/Key combin

David Holmes, Oracle

Bug Summary
JDK-8172318 [linux] Experimental support for cgroup memory limits in container (ie Docker) environments
JDK-8171480 Cache initial active_processor_count
JDK-8180497 Class java.util.concurrent.ThreadLocalRandom fails to Initialize when using SecurityManager
JDK-8171481 G1 crashes if active_processor_count changes during startup
JDK-8179469 HotSpot VM fails to start when AggressiveHeap is set
JDK-8181462 PPC64: "mbind: Invalid argument" when -XX:+UseNUMA is used
JDK-8174987 SA does not work if executable is DSO

Dmitry Markov, Oracle

Bug Summary
JDK-8170652 [macosx] Activating a JDialog puts to back another dialog
JDK-8170907 [macosx] Cursor management unification
JDK-8164053 [macosx] Press "To Back" button on the Dialog,the Dialog moves behind the Frame
JDK-8177769 [macosx] Sometimes NSWindow.isZoomed hangs
JDK-8175009 [macosx] Wrong rendering of diacritics on macOS
JDK-8169254 [PIT] Exception running java/awt/event/KeyEvent/KeyChar/KeyCharTest.java
JDK-8172790 [PIT] on Windows, failure of java/awt/Dialog/DialogAboveFrame/DialogAboveFrameTest.java
JDK-8169498 Diacritics input works incorrectly on Windows if Spanish (Latin American) keyboard layout is used
JDK-8176727 IllegalArgumentException in java.awt.image.ReplicateScaleFilter
JDK-8179888 Java "1.8.0_112" on Windows 10 displays different characters for EUDCs from ones created in eudcedit.exe.
JDK-8176364 lookupDefaultPrintService returns null on Solaris 11 when default printer is set using lpoptions command
JDK-8174858 Text is displayed in bold when fonts are installed into symlinked folder
JDK-8175276 The copyright section in the test/java/awt/font/TextLayout/DiacriticsDrawingTest.java should be updated
JDK-8169253 VK_OEM_102 dead key detected as VK_UNDEFINED

Goetz Lindenmaier, SAP

Bug Summary
JDK-8168413 Further improvements for Unix NetworkInterface native implementation
JDK-8165320 Small flaw when integrating 8160174 to JDK8
JDK-8165484 XSLTC transformer swallows empty namespace declaration which is needed to undeclare default namespace

Hannes Wallnoefer, Oracle

Bug Summary
JDK-8164112 Honor Number type hint in toPrimitive on Numbers
JDK-8177774 JSObject property access is broken for numeric keys outside the int range
JDK-8172654 Missing checks in sparse array shift() implementation
JDK-8168310 Nested object literal property maps not reset in optimistic recompilation
JDK-8172667 SparseArrayData should not grow its underlying dense array data

Ivan Gerasimov, Google

Bug Summary
JDK-8165021 (smartcardio) CardTerminal.connect() throws CardException instead of CardNotPresentException
JDK-8169537 (tz) Support tzdata2016i
JDK-8160958 [TEST_BUG] java/net/SetFactoryPermission/SetFactoryPermission.java should be added into :needs_compact2 group
JDK-8160951 [TEST_BUG] javax/xml/bind/marshal/8134111/UnmarshalTest.java should be added into :needs_jre group
JDK-8167592 Add MD5 to signed JAR restrictions
JDK-8168485 automatic discovery of LDAP servers with Kerberos authentication
JDK-8164411 Avoid repeated "Please insert a smart card" popup windows
JDK-8165309 Base64.Encoder.wrap(os).write(byte[],int,int) with incorrect arguments should not produce output
JDK-8176897 Failed to load RSA private key from pkcs12
JDK-8164063 Finalizing one key of a KeyPair invalidates the other key
JDK-8163868 Integer overflow in StringBufferInputStream.read() and CharArrayReader.read/skip()
JDK-8169868 Modify sun/security/smartcardio manual regression tests so that they do not just fail if no cardreader found
JDK-8180440 Need to terminate server process if client runs into problems
JDK-8169056 StringIndexOutOfBoundsException in Pattern.compile with CANON_EQ flag
JDK-8166985 sun/security/krb5/auto/MaxRetries.java failed with timeout
JDK-8166984 sun/security/krb5/auto/MaxRetries.java fails with Retry count is -1 less
JDK-8166986 sun/security/krb5/auto/MaxRetries.java may fail with BindException
JDK-8166853 Synthetic bridge constructor in ArrayList$Itr blocks inlining
JDK-8163910 Tests added in JDK-8163518 fail on some platforms
JDK-8170278 ticket renewal won't happen with debugging turned on
JDK-8171360 Update OS detection code to recognize Windows Server 2016
JDK-8164417 ZoneOffset.ofHoursMinutesSeconds() does not reject invalid input

Igor Ignatyev, Oracle

Bug Summary
JDK-8162358 Utils.tryFindJvmPid sometimes find incorrect pid

Kevin Walls, Oracle

Bug Summary
JDK-8169622 [REDO] failed: no mismatched stores, except on raw memory: StoreB StoreI
JDK-8175821 [REDO] MemberNameTable doesn't purge stale entries
JDK-8168475 Add a new CPU family (S_family) for SPARC S7 and above processors
JDK-8168523 C2: Handle "wide" aliases for unsafe accesses
JDK-8168522 C2: opaque unsafe access triggers an assert
JDK-8153218 C2: Type speculation produces mismatched unsafe accesses
JDK-8177887 expose L1_data_cache_line_size for diagnostic/sanity checks
JDK-8168473 java in ldoms, with cpu-arch=generic has problems
JDK-8165820 Long pause in ParOldGC, because ParallelTaskTerminator peeks wrong TaskQueueSet
JDK-8181726 missing LNT entry for finally block
JDK-8177817 Remove assertions in 8u that were removed by 8056124 in 9.
JDK-8177783 remove legacy code in SPARC's VM_Version::platform_features
JDK-8163286 Threads may do significant work out of the non-shared overflow buffer
JDK-8176104 Use new API to get cache line sizes

Vladimir Kozlov, Oracle

Bug Summary
JDK-8172257 C2: anti dependence missed because store hidden by membar
JDK-8165671 missing precedence edge for anti_dependence
JDK-8164387 Performance regression: bimorphic inlining may be bypassed by type speculation
JDK-8165670 Random infrequent null pointer exceptions in javac

Martin Buchholz, Google

Bug Summary
JDK-8181429 ConcurrentSkipListSet.clear() can leave the Set in an invalid state

Mikhail Cherkasov, Oracle

Bug Summary
JDK-8160941 "text/uri-list" dataflavor concats the first two strings
JDK-8154884 [macosx] Custom Swing text components need to allow standard accessibility
JDK-8161940 [macosx] JList, VO can't access non-visible list items
JDK-8167474 [macosx] JMenuItems in JPopupMenu are not accessible
JDK-8167022 [TEST_BUG] :jdk/test/sun/misc/URLClassPath/ClassnameCharTest.java test fails with NullPointerException
JDK-8166037 [TEST_BUG] javax/management/security/SecurityTest.java fails due to missing keyStore file
JDK-8163944 [TEST_BUG] sun/net/www/protocol/http/HttpInputStream.java fails intermittently
JDK-8167020 [TEST_BUG] sun/security/ssl/SSLSocketImpl/CloseSocket.java failed with "Error while cleaning up threads after test"
JDK-8171222 Deleting a file from either the open or save java.awt.FileDialog hangs.
JDK-8171223 Double icons with JMenuItem setHorizontalTextPosition on Win 10
JDK-8164209 Duplicate entry in http.nonProxyHosts will ignore subsequent entries
JDK-8164027 IllegalArgumentException: adding a component to a container on a different GraphicsDevice
JDK-8178540 javax.swing.text.html.parser.Parser parseScript ignores a character after comment end
JDK-8169485 JVM crash at sun.java2d.windows.GDIBlitLoops.nativeBlit
JDK-8164118 Memory leak in com.apple.laf.AquaProgressBarUI: removed progress bar still referenced
JDK-8161498 Memory leak in com.apple.laf.ScreenMenu: removed JMenuItems are still referenced
JDK-8174097 Menu is activated after using mnemonic Alt/Key combination
JDK-8164119 MoveToOtherScreenTest fails due wrong key attribute
JDK-8178807 NPE in AccessBridge while editing JList model
JDK-8176090 Performance problems in dialogs with large tables when JAB activated
JDK-8163491 Remove dependency on sun.misc.RegexpPool and friends
JDK-8162964 sun.net.ftp.impl.FtpClient.nameList(String path) handles "null" incorrectly
JDK-8164491 TextArea.replaceRange() and insert() are broken with setText(null)
JDK-8028363 XmlGregorianCalendarImpl.getTimeZone() bug when offset is less than 10 minutes

Mandy Chung, Oracle

Bug Summary
JDK-8174729 Race Condition in java.lang.reflect.WeakCache

Maurizio Cimadamore, Oracle

Bug Summary
JDK-8172291 Polymorhic signature method check crashes javac

Naoto Sato, Oracle

Bug Summary
JDK-8177776 Create an equivalent test case for JDK9's SupplementalJapaneseEraTest
JDK-8177779 JapaneseEra.getDisplayName doesn't return names if it's an additional era
JDK-8178389 Overstatement of universality of Era.getDisplayName() implementation
JDK-8178388 Wrong display name for supplemental Japanese era

Poonam Bajaj Parhar, Oracle

Bug Summary
JDK-8175034 hs_err improvement: Add event logging for class redefinition to the hs_err file
JDK-8168920 Instance field load is replaced by wrong data Phi
JDK-8154312 nmethod::oops_do_marking_epilogue always runs verification code
JDK-8182567 OOM ERRORS + SERVICE-THREAD TAKES A PROCESSOR TO 100%

Philip Race, Oracle

Bug Summary
JDK-8168693 [macosx] Delete unused class NSPrintinfo
JDK-8168105 [macosx] Incorrect char to glyph mapping printing on OSX 10.10
JDK-8173077 [macosx] LinearGradientPaint and RadialGradientPaint are not printed on OS X.
JDK-8173076 [macosx] Printing a shape filled with a texture doesn't work under Mac OS X
JDK-8177824 [macosx] The print test crashed with Nimbus L&F
JDK-8174751 CUPS Printing is broken with Ubuntu 16.10 (CUPS 2.2)
JDK-8162734 JDK should be updated to use LittleCMS 2.8
JDK-8177067 JDK support for JavaFX modal print dialogs
JDK-8180379 JFileChooser with Windows look and feel crashes on win 10
JDK-8177050 PrinterJob.pageDialog() with DialogSelectionType.NATIVE returns a PageFormat when cancelled.
JDK-8167235 SIGSEGV when attempting to rotate BufferedImage using AffineTransform by NaN degrees
JDK-8177049 Stack overflow on Linux using DialogTypeSelection.NATIVE

Robert Mckenna, Oracle

Bug Summary
JDK-8174265 (fs) WatchService hangs on GetOverlappedResult and locks directory (win)
JDK-8169601 [macosx] Delete unused class NSPrintinfo
JDK-8166977 [TEST_BUG] com/sun/jndi/ldap/LdapTimeoutTest.java failed intermittently
JDK-8166978 [TEST_BUG] com/sun/jndi/ldap/LdapTimeoutTest.java fails at handleNamingException
JDK-8148237 [TEST_BUG] com/sun/jndi/ldap/LdapTimeoutTest.java fails intermittently
JDK-8166424 [TEST_BUG] Test JarURLConnectionUseCaches.java fails at windows: failed to clean up files after test
JDK-8167613 Add debug output for indicating if a chosen ciphersuite was legacy
JDK-8166789 Add invalid network / computer name cases to isReachable known failure switch
JDK-8148235 com/sun/jndi/ldap/LdapTimeoutTest.java failed intermittently
JDK-8181379 Correctly handle exception in TCPChannel.createConnection
JDK-8159569 Custom HostnameVerifier disables SNI extension
JDK-8172436 Deadlock in com.sun.jndi.ldap.pool.Connections
JDK-8166631 InetAddress.isReachable returns true for non existing IP addresses
JDK-8168482 jarsigner -verbose -verify should print the algorithms used to sign the jar
JDK-8166423 JarURLConnection does not handle useCaches correctly
JDK-8169600 Make XSL generated namespace prefixes local to transformation process
JDK-8177726 MAWT: Java should be more careful manipulating NLSPATH, XFILESEARCHPATH env variables
JDK-8166435 New tests from 8144566 fail with "No expected Server Name Indication"
JDK-8181891 Regression since 8u60: System.getenv doesn't return env var set in JNI code
JDK-8177725 Stop changing user environment variables related to /usr/dt
JDK-8181378 sun.rmi.transport.tcp.TCPChannel.createConnection close connection on timeout
JDK-8173832 tools/pack200/Pack200Test.java fails on Win32: Could not reserve enough space
JDK-8173664 Typo in https://java.net/downloads/heap-snapshot/hprof-binary-format.html

Roger Riggs, Oracle

Bug Summary
JDK-8168645 ReflectionFactory support for IIOP and custom serialization
JDK-8176787 Wrap FileInputStream's native skip and available methods

Sergey Bylokhov, Amazon

Bug Summary
JDK-8169560 [macosx] Various memory leaks in jdk9
JDK-8165684 java.beans.MethodRef#get throws NullPointerException

Volker Simonis, Amazon

Bug Summary
JDK-8172053 (ppc64) Downport of 8170153 breaks build on linux/ppc64 (big endian)
JDK-8171153 CMS: Crash in CardTableModRefBSForCTRS::process_chunk_boundaries
JDK-8165231 java.nio.Bits.unaligned() doesn't return true on ppc
JDK-8170873 PPC64/aarch64: Poor StrictMath performance due to non-optimized compilation

Serguei Spitsyn, Oracle

Bug Summary
JDK-8169744 jdb returns invalid argument count if first parameter to Arrays.asList is null
JDK-8172823 need more workarounds for suspend equivalent condition issue

Sundararajan Athijegannathan, Oracle

Bug Summary
JDK-8170658 JSObject call() is passed undefined for the argument 'thiz'

Tim Bell, Oracle

Bug Summary
JDK-8167475 ASSEMBLY_EXCEPTION contains historical company name

Tobias Hartmann, Oracle

Bug Summary
JDK-8176496 [TESTBUG] 8174164 fix missed the test
JDK-8180937 compiler/dependencies/MonomorphicObjectCall/TestMonomorphicObjectCall.java fails product
JDK-8164293 HotSpot leaking memory in long-running requests
JDK-8165327 jvm crashes when -XX:+UseCountedLoopSafepoints is enabled
JDK-8181039 Null pointer dereference in InitializeNode::complete_stores
JDK-8181038 Null pointer dereference in LoadNode::Identity()
JDK-8181035 Null pointer dereference in Matcher::ReduceInst()
JDK-8181037 Null pointer dereference in Matcher::xform()
JDK-8181040 Null pointer dereference of CodeCache::find_blob() result
JDK-8181036 Null pointer dereferences of ConstMethod::method()
JDK-8177762 Range check dependent CastII/ConvI2L is prematurely eliminated
JDK-8176495 SafePointNode::_replaced_nodes breaks with irreducible loops
JDK-8165418 Unrecognized VM option 'UseCountedLoopSafepoints'

Thomas Schatzl, Oracle

Bug Summary
JDK-8180748 Interned string and symbol table leak memory during parallel unlinking

Vladimir Kempik, Azul

Bug Summary
JDK-8176313 C1: NPE is thrown instead of LinkageError when accessing inaccessible field on NULL receiver
JDK-8166443 Crash in rebuild_cpu_to_node_map
JDK-8154945 Enable 8130150 and 8081778 intrinsics by default
JDK-8172976 Infinite loop in handle_wrong_method in jmod
JDK-8166105 Runtime.availableProcessors() ignores Linux taskset command

Vladimir Ivanov, Oracle

Bug Summary
JDK-8176451 C1 value numbering handling of Unsafe.get*Volatile is incorrect

Zoltan Majo, Oracle

Bug Summary
JDK-8171154 assert(c == Bytecodes::_putfield) failed: must be putfield
JDK-8161987 Compilers accept modification of final fields outside initializer methods
JDK-8163585 PPC64: Support AES intrinsics
JDK-8180934 PutfieldError failed with UnsupportedClassVersionError
JDK-8171502 Scanning method file for initialized final field updates can fail for non-existent fields